You are viewing a plain text version of this content. The canonical link for it is here.
Posted to dev@lucene.apache.org by Policeman Jenkins Server <je...@thetaphi.de> on 2013/03/10 12:50:13 UTC

[JENKINS] Lucene-Solr-4.x-Linux (64bit/jdk1.6.0_41) - Build # 4619 - Still Failing!

Build: http://jenkins.thetaphi.de/job/Lucene-Solr-4.x-Linux/4619/
Java: 64bit/jdk1.6.0_41 -XX:+UseSerialGC

3 tests failed.
FAILED:  junit.framework.TestSuite.org.apache.lucene.index.sorter.IndexSortingTest

Error Message:
37

Stack Trace:
java.lang.ArrayIndexOutOfBoundsException: 37
	at __randomizedtesting.SeedInfo.seed([4B8B508907D4199D]:0)
	at org.apache.lucene.index.sorter.SortingAtomicReader$SortingDocsAndPositionsEnum.<init>(SortingAtomicReader.java:454)
	at org.apache.lucene.index.sorter.SortingAtomicReader$SortingTermsEnum.docsAndPositions(SortingAtomicReader.java:161)
	at org.apache.lucene.index.MultiTermsEnum.docsAndPositions(MultiTermsEnum.java:474)
	at org.apache.lucene.index.TermsEnum.docsAndPositions(TermsEnum.java:183)
	at org.apache.lucene.codecs.TermsConsumer.merge(TermsConsumer.java:186)
	at org.apache.lucene.codecs.FieldsConsumer.merge(FieldsConsumer.java:72)
	at org.apache.lucene.index.SegmentMerger.mergeTerms(SegmentMerger.java:383)
	at org.apache.lucene.index.SegmentMerger.merge(SegmentMerger.java:116)
	at org.apache.lucene.index.IndexWriter.addIndexes(IndexWriter.java:2423)
	at org.apache.lucene.index.sorter.IndexSortingTest.beforeClassSorterUtilTest(IndexSortingTest.java:65)
	at sun.reflect.NativeMethodAccessorImpl.invoke0(Native Method)
	at sun.reflect.NativeMethodAccessorImpl.invoke(NativeMethodAccessorImpl.java:39)
	at sun.reflect.DelegatingMethodAccessorImpl.invoke(DelegatingMethodAccessorImpl.java:25)
	at java.lang.reflect.Method.invoke(Method.java:597)
	at com.carrotsearch.randomizedtesting.RandomizedRunner.invoke(RandomizedRunner.java:1559)
	at com.carrotsearch.randomizedtesting.RandomizedRunner.access$600(RandomizedRunner.java:79)
	at com.carrotsearch.randomizedtesting.RandomizedRunner$4.evaluate(RandomizedRunner.java:677)
	at com.carrotsearch.randomizedtesting.RandomizedRunner$5.evaluate(RandomizedRunner.java:693)
	at org.apache.lucene.util.AbstractBeforeAfterRule$1.evaluate(AbstractBeforeAfterRule.java:46)
	at org.apache.lucene.util.TestRuleStoreClassName$1.evaluate(TestRuleStoreClassName.java:42)
	at com.carrotsearch.randomizedtesting.rules.SystemPropertiesInvariantRule$1.evaluate(SystemPropertiesInvariantRule.java:55)
	at com.carrotsearch.randomizedtesting.rules.NoShadowingOrOverridesOnMethodsRule$1.evaluate(NoShadowingOrOverridesOnMethodsRule.java:39)
	at com.carrotsearch.randomizedtesting.rules.NoShadowingOrOverridesOnMethodsRule$1.evaluate(NoShadowingOrOverridesOnMethodsRule.java:39)
	at com.carrotsearch.randomizedtesting.rules.StatementAdapter.evaluate(StatementAdapter.java:36)
	at org.apache.lucene.util.TestRuleAssertionsRequired$1.evaluate(TestRuleAssertionsRequired.java:43)
	at org.apache.lucene.util.TestRuleMarkFailure$1.evaluate(TestRuleMarkFailure.java:48)
	at org.apache.lucene.util.TestRuleIgnoreAfterMaxFailures$1.evaluate(TestRuleIgnoreAfterMaxFailures.java:70)
	at org.apache.lucene.util.TestRuleIgnoreTestSuites$1.evaluate(TestRuleIgnoreTestSuites.java:55)
	at com.carrotsearch.randomizedtesting.rules.StatementAdapter.evaluate(StatementAdapter.java:36)
	at com.carrotsearch.randomizedtesting.ThreadLeakControl$StatementRunner.run(ThreadLeakControl.java:358)
	at java.lang.Thread.run(Thread.java:662)


FAILED:  junit.framework.TestSuite.org.apache.lucene.index.sorter.SortingAtomicReaderTest

Error Message:
this codec cannot write docvalues

Stack Trace:
java.lang.UnsupportedOperationException: this codec cannot write docvalues
	at __randomizedtesting.SeedInfo.seed([4B8B508907D4199D]:0)
	at org.apache.lucene.codecs.lucene3x.Lucene3xCodec$1.fieldsConsumer(Lucene3xCodec.java:73)
	at org.apache.lucene.index.DocValuesProcessor.flush(DocValuesProcessor.java:77)
	at org.apache.lucene.index.TwoStoredFieldsConsumers.flush(TwoStoredFieldsConsumers.java:42)
	at org.apache.lucene.index.DocFieldProcessor.flush(DocFieldProcessor.java:80)
	at org.apache.lucene.index.DocumentsWriterPerThread.flush(DocumentsWriterPerThread.java:493)
	at org.apache.lucene.index.DocumentsWriter.doFlush(DocumentsWriter.java:422)
	at org.apache.lucene.index.DocumentsWriter.postUpdate(DocumentsWriter.java:316)
	at org.apache.lucene.index.DocumentsWriter.updateDocument(DocumentsWriter.java:389)
	at org.apache.lucene.index.IndexWriter.updateDocument(IndexWriter.java:1473)
	at org.apache.lucene.index.IndexWriter.addDocument(IndexWriter.java:1148)
	at org.apache.lucene.index.RandomIndexWriter.addDocument(RandomIndexWriter.java:152)
	at org.apache.lucene.index.RandomIndexWriter.addDocument(RandomIndexWriter.java:114)
	at org.apache.lucene.index.sorter.SorterTestBase.createIndex(SorterTestBase.java:213)
	at org.apache.lucene.index.sorter.SorterTestBase.beforeClassSorterTestBase(SorterTestBase.java:232)
	at sun.reflect.NativeMethodAccessorImpl.invoke0(Native Method)
	at sun.reflect.NativeMethodAccessorImpl.invoke(NativeMethodAccessorImpl.java:39)
	at sun.reflect.DelegatingMethodAccessorImpl.invoke(DelegatingMethodAccessorImpl.java:25)
	at java.lang.reflect.Method.invoke(Method.java:597)
	at com.carrotsearch.randomizedtesting.RandomizedRunner.invoke(RandomizedRunner.java:1559)
	at com.carrotsearch.randomizedtesting.RandomizedRunner.access$600(RandomizedRunner.java:79)
	at com.carrotsearch.randomizedtesting.RandomizedRunner$4.evaluate(RandomizedRunner.java:677)
	at com.carrotsearch.randomizedtesting.RandomizedRunner$5.evaluate(RandomizedRunner.java:693)
	at org.apache.lucene.util.AbstractBeforeAfterRule$1.evaluate(AbstractBeforeAfterRule.java:46)
	at org.apache.lucene.util.TestRuleStoreClassName$1.evaluate(TestRuleStoreClassName.java:42)
	at com.carrotsearch.randomizedtesting.rules.SystemPropertiesInvariantRule$1.evaluate(SystemPropertiesInvariantRule.java:55)
	at com.carrotsearch.randomizedtesting.rules.NoShadowingOrOverridesOnMethodsRule$1.evaluate(NoShadowingOrOverridesOnMethodsRule.java:39)
	at com.carrotsearch.randomizedtesting.rules.NoShadowingOrOverridesOnMethodsRule$1.evaluate(NoShadowingOrOverridesOnMethodsRule.java:39)
	at com.carrotsearch.randomizedtesting.rules.StatementAdapter.evaluate(StatementAdapter.java:36)
	at org.apache.lucene.util.TestRuleAssertionsRequired$1.evaluate(TestRuleAssertionsRequired.java:43)
	at org.apache.lucene.util.TestRuleMarkFailure$1.evaluate(TestRuleMarkFailure.java:48)
	at org.apache.lucene.util.TestRuleIgnoreAfterMaxFailures$1.evaluate(TestRuleIgnoreAfterMaxFailures.java:70)
	at org.apache.lucene.util.TestRuleIgnoreTestSuites$1.evaluate(TestRuleIgnoreTestSuites.java:55)
	at com.carrotsearch.randomizedtesting.rules.StatementAdapter.evaluate(StatementAdapter.java:36)
	at com.carrotsearch.randomizedtesting.ThreadLeakControl$StatementRunner.run(ThreadLeakControl.java:358)
	at java.lang.Thread.run(Thread.java:662)


FAILED:  junit.framework.TestSuite.org.apache.lucene.index.sorter.SortingAtomicReaderTest

Error Message:


Stack Trace:
java.lang.NullPointerException
	at __randomizedtesting.SeedInfo.seed([4B8B508907D4199D]:0)
	at org.apache.lucene.index.sorter.SorterTestBase.afterClassSorterTestBase(SorterTestBase.java:239)
	at sun.reflect.NativeMethodAccessorImpl.invoke0(Native Method)
	at sun.reflect.NativeMethodAccessorImpl.invoke(NativeMethodAccessorImpl.java:39)
	at sun.reflect.DelegatingMethodAccessorImpl.invoke(DelegatingMethodAccessorImpl.java:25)
	at java.lang.reflect.Method.invoke(Method.java:597)
	at com.carrotsearch.randomizedtesting.RandomizedRunner.invoke(RandomizedRunner.java:1559)
	at com.carrotsearch.randomizedtesting.RandomizedRunner.access$600(RandomizedRunner.java:79)
	at com.carrotsearch.randomizedtesting.RandomizedRunner$5.evaluate(RandomizedRunner.java:700)
	at org.apache.lucene.util.AbstractBeforeAfterRule$1.evaluate(AbstractBeforeAfterRule.java:46)
	at org.apache.lucene.util.TestRuleStoreClassName$1.evaluate(TestRuleStoreClassName.java:42)
	at com.carrotsearch.randomizedtesting.rules.SystemPropertiesInvariantRule$1.evaluate(SystemPropertiesInvariantRule.java:55)
	at com.carrotsearch.randomizedtesting.rules.NoShadowingOrOverridesOnMethodsRule$1.evaluate(NoShadowingOrOverridesOnMethodsRule.java:39)
	at com.carrotsearch.randomizedtesting.rules.NoShadowingOrOverridesOnMethodsRule$1.evaluate(NoShadowingOrOverridesOnMethodsRule.java:39)
	at com.carrotsearch.randomizedtesting.rules.StatementAdapter.evaluate(StatementAdapter.java:36)
	at org.apache.lucene.util.TestRuleAssertionsRequired$1.evaluate(TestRuleAssertionsRequired.java:43)
	at org.apache.lucene.util.TestRuleMarkFailure$1.evaluate(TestRuleMarkFailure.java:48)
	at org.apache.lucene.util.TestRuleIgnoreAfterMaxFailures$1.evaluate(TestRuleIgnoreAfterMaxFailures.java:70)
	at org.apache.lucene.util.TestRuleIgnoreTestSuites$1.evaluate(TestRuleIgnoreTestSuites.java:55)
	at com.carrotsearch.randomizedtesting.rules.StatementAdapter.evaluate(StatementAdapter.java:36)
	at com.carrotsearch.randomizedtesting.ThreadLeakControl$StatementRunner.run(ThreadLeakControl.java:358)
	at java.lang.Thread.run(Thread.java:662)




Build Log:
[...truncated 6759 lines...]
[junit4:junit4] Suite: org.apache.lucene.index.sorter.IndexSortingTest
[junit4:junit4]   2> NOTE: test params are: codec=Lucene42: {id=PostingsFormat(name=Direct), positions=PostingsFormat(name=Memory doPackFST= true), norm=Lucene41(blocksize=128), docs=PostingsFormat(name=Direct), term_vectors=PostingsFormat(name=Direct)}, docValues:{binary=DocValuesFormat(name=Asserting), numeric=DocValuesFormat(name=Asserting), sorted=DocValuesFormat(name=Asserting), sorted_set=DocValuesFormat(name=CheapBastard)}, sim=RandomSimilarityProvider(queryNorm=true,coord=no): {positions=IB SPL-L3(800.0), term_vectors=DFR I(F)LZ(0.3)}, locale=ro_RO, timezone=Atlantic/St_Helena
[junit4:junit4]   2> NOTE: Linux 3.2.0-38-generic amd64/Sun Microsystems Inc. 1.6.0_41 (64-bit)/cpus=8,threads=1,free=111355960,total=126418944
[junit4:junit4]   2> NOTE: All tests run in this JVM: [IndexSortingTest]
[junit4:junit4]   2> NOTE: reproduce with: ant test  -Dtestcase=IndexSortingTest -Dtests.seed=4B8B508907D4199D -Dtests.multiplier=3 -Dtests.slow=true -Dtests.locale=ro_RO -Dtests.timezone=Atlantic/St_Helena -Dtests.file.encoding=UTF-8
[junit4:junit4] ERROR   0.00s J0 | IndexSortingTest (suite) <<<
[junit4:junit4]    > Throwable #1: java.lang.ArrayIndexOutOfBoundsException: 37
[junit4:junit4]    > 	at __randomizedtesting.SeedInfo.seed([4B8B508907D4199D]:0)
[junit4:junit4]    > 	at org.apache.lucene.index.sorter.SortingAtomicReader$SortingDocsAndPositionsEnum.<init>(SortingAtomicReader.java:454)
[junit4:junit4]    > 	at org.apache.lucene.index.sorter.SortingAtomicReader$SortingTermsEnum.docsAndPositions(SortingAtomicReader.java:161)
[junit4:junit4]    > 	at org.apache.lucene.index.MultiTermsEnum.docsAndPositions(MultiTermsEnum.java:474)
[junit4:junit4]    > 	at org.apache.lucene.index.TermsEnum.docsAndPositions(TermsEnum.java:183)
[junit4:junit4]    > 	at org.apache.lucene.codecs.TermsConsumer.merge(TermsConsumer.java:186)
[junit4:junit4]    > 	at org.apache.lucene.codecs.FieldsConsumer.merge(FieldsConsumer.java:72)
[junit4:junit4]    > 	at org.apache.lucene.index.SegmentMerger.mergeTerms(SegmentMerger.java:383)
[junit4:junit4]    > 	at org.apache.lucene.index.SegmentMerger.merge(SegmentMerger.java:116)
[junit4:junit4]    > 	at org.apache.lucene.index.IndexWriter.addIndexes(IndexWriter.java:2423)
[junit4:junit4]    > 	at org.apache.lucene.index.sorter.IndexSortingTest.beforeClassSorterUtilTest(IndexSortingTest.java:65)
[junit4:junit4]    > 	at sun.reflect.NativeMethodAccessorImpl.invoke0(Native Method)
[junit4:junit4]    > 	at sun.reflect.NativeMethodAccessorImpl.invoke(NativeMethodAccessorImpl.java:39)
[junit4:junit4]    > 	at sun.reflect.DelegatingMethodAccessorImpl.invoke(DelegatingMethodAccessorImpl.java:25)
[junit4:junit4]    > 	at java.lang.reflect.Method.invoke(Method.java:597)
[junit4:junit4]    > 	at com.carrotsearch.randomizedtesting.RandomizedRunner.invoke(RandomizedRunner.java:1559)
[junit4:junit4]    > 	at com.carrotsearch.randomizedtesting.RandomizedRunner.access$600(RandomizedRunner.java:79)
[junit4:junit4]    > 	at com.carrotsearch.randomizedtesting.RandomizedRunner$4.evaluate(RandomizedRunner.java:677)
[junit4:junit4]    > 	at com.carrotsearch.randomizedtesting.RandomizedRunner$5.evaluate(RandomizedRunner.java:693)
[junit4:junit4]    > 	at org.apache.lucene.util.AbstractBeforeAfterRule$1.evaluate(AbstractBeforeAfterRule.java:46)
[junit4:junit4]    > 	at org.apache.lucene.util.TestRuleStoreClassName$1.evaluate(TestRuleStoreClassName.java:42)
[junit4:junit4]    > 	at com.carrotsearch.randomizedtesting.rules.SystemPropertiesInvariantRule$1.evaluate(SystemPropertiesInvariantRule.java:55)
[junit4:junit4]    > 	at com.carrotsearch.randomizedtesting.rules.NoShadowingOrOverridesOnMethodsRule$1.evaluate(NoShadowingOrOverridesOnMethodsRule.java:39)
[junit4:junit4]    > 	at com.carrotsearch.randomizedtesting.rules.NoShadowingOrOverridesOnMethodsRule$1.evaluate(NoShadowingOrOverridesOnMethodsRule.java:39)
[junit4:junit4]    > 	at com.carrotsearch.randomizedtesting.rules.StatementAdapter.evaluate(StatementAdapter.java:36)
[junit4:junit4]    > 	at org.apache.lucene.util.TestRuleAssertionsRequired$1.evaluate(TestRuleAssertionsRequired.java:43)
[junit4:junit4]    > 	at org.apache.lucene.util.TestRuleMarkFailure$1.evaluate(TestRuleMarkFailure.java:48)
[junit4:junit4]    > 	at org.apache.lucene.util.TestRuleIgnoreAfterMaxFailures$1.evaluate(TestRuleIgnoreAfterMaxFailures.java:70)
[junit4:junit4]    > 	at org.apache.lucene.util.TestRuleIgnoreTestSuites$1.evaluate(TestRuleIgnoreTestSuites.java:55)
[junit4:junit4]    > 	at com.carrotsearch.randomizedtesting.rules.StatementAdapter.evaluate(StatementAdapter.java:36)
[junit4:junit4]    > 	at com.carrotsearch.randomizedtesting.ThreadLeakControl$StatementRunner.run(ThreadLeakControl.java:358)
[junit4:junit4]    > 	at java.lang.Thread.run(Thread.java:662)
[junit4:junit4] Completed on J0 in 1.72s, 0 tests, 1 error <<< FAILURES!

[...truncated 13 lines...]
[junit4:junit4] Suite: org.apache.lucene.index.sorter.SortingAtomicReaderTest
[junit4:junit4]   2> NOTE: test params are: codec=Lucene3x, sim=RandomSimilarityProvider(queryNorm=true,coord=yes): {positions=DFR I(n)L3(800.0), term_vectors=DFR GB1}, locale=cs_CZ, timezone=America/Mendoza
[junit4:junit4]   2> NOTE: Linux 3.2.0-38-generic amd64/Sun Microsystems Inc. 1.6.0_41 (64-bit)/cpus=8,threads=1,free=108310304,total=126418944
[junit4:junit4]   2> NOTE: All tests run in this JVM: [TestPKIndexSplitter, TestIndexSplitter, TestHighFreqTerms, SweetSpotSimilarityTest, SortingAtomicReaderTest]
[junit4:junit4]   2> NOTE: reproduce with: ant test  -Dtestcase=SortingAtomicReaderTest -Dtests.seed=4B8B508907D4199D -Dtests.multiplier=3 -Dtests.slow=true -Dtests.locale=cs_CZ -Dtests.timezone=America/Mendoza -Dtests.file.encoding=UTF-8
[junit4:junit4] ERROR   0.00s J1 | SortingAtomicReaderTest (suite) <<<
[junit4:junit4]    > Throwable #1: java.lang.UnsupportedOperationException: this codec cannot write docvalues
[junit4:junit4]    > 	at __randomizedtesting.SeedInfo.seed([4B8B508907D4199D]:0)
[junit4:junit4]    > 	at org.apache.lucene.codecs.lucene3x.Lucene3xCodec$1.fieldsConsumer(Lucene3xCodec.java:73)
[junit4:junit4]    > 	at org.apache.lucene.index.DocValuesProcessor.flush(DocValuesProcessor.java:77)
[junit4:junit4]    > 	at org.apache.lucene.index.TwoStoredFieldsConsumers.flush(TwoStoredFieldsConsumers.java:42)
[junit4:junit4]    > 	at org.apache.lucene.index.DocFieldProcessor.flush(DocFieldProcessor.java:80)
[junit4:junit4]    > 	at org.apache.lucene.index.DocumentsWriterPerThread.flush(DocumentsWriterPerThread.java:493)
[junit4:junit4]    > 	at org.apache.lucene.index.DocumentsWriter.doFlush(DocumentsWriter.java:422)
[junit4:junit4]    > 	at org.apache.lucene.index.DocumentsWriter.postUpdate(DocumentsWriter.java:316)
[junit4:junit4]    > 	at org.apache.lucene.index.DocumentsWriter.updateDocument(DocumentsWriter.java:389)
[junit4:junit4]    > 	at org.apache.lucene.index.IndexWriter.updateDocument(IndexWriter.java:1473)
[junit4:junit4]    > 	at org.apache.lucene.index.IndexWriter.addDocument(IndexWriter.java:1148)
[junit4:junit4]    > 	at org.apache.lucene.index.RandomIndexWriter.addDocument(RandomIndexWriter.java:152)
[junit4:junit4]    > 	at org.apache.lucene.index.RandomIndexWriter.addDocument(RandomIndexWriter.java:114)
[junit4:junit4]    > 	at org.apache.lucene.index.sorter.SorterTestBase.createIndex(SorterTestBase.java:213)
[junit4:junit4]    > 	at org.apache.lucene.index.sorter.SorterTestBase.beforeClassSorterTestBase(SorterTestBase.java:232)
[junit4:junit4]    > 	at sun.reflect.NativeMethodAccessorImpl.invoke0(Native Method)
[junit4:junit4]    > 	at sun.reflect.NativeMethodAccessorImpl.invoke(NativeMethodAccessorImpl.java:39)
[junit4:junit4]    > 	at sun.reflect.DelegatingMethodAccessorImpl.invoke(DelegatingMethodAccessorImpl.java:25)
[junit4:junit4]    > 	at java.lang.reflect.Method.invoke(Method.java:597)
[junit4:junit4]    > 	at com.carrotsearch.randomizedtesting.RandomizedRunner.invoke(RandomizedRunner.java:1559)
[junit4:junit4]    > 	at com.carrotsearch.randomizedtesting.RandomizedRunner.access$600(RandomizedRunner.java:79)
[junit4:junit4]    > 	at com.carrotsearch.randomizedtesting.RandomizedRunner$4.evaluate(RandomizedRunner.java:677)
[junit4:junit4]    > 	at com.carrotsearch.randomizedtesting.RandomizedRunner$5.evaluate(RandomizedRunner.java:693)
[junit4:junit4]    > 	at org.apache.lucene.util.AbstractBeforeAfterRule$1.evaluate(AbstractBeforeAfterRule.java:46)
[junit4:junit4]    > 	at org.apache.lucene.util.TestRuleStoreClassName$1.evaluate(TestRuleStoreClassName.java:42)
[junit4:junit4]    > 	at com.carrotsearch.randomizedtesting.rules.SystemPropertiesInvariantRule$1.evaluate(SystemPropertiesInvariantRule.java:55)
[junit4:junit4]    > 	at com.carrotsearch.randomizedtesting.rules.NoShadowingOrOverridesOnMethodsRule$1.evaluate(NoShadowingOrOverridesOnMethodsRule.java:39)
[junit4:junit4]    > 	at com.carrotsearch.randomizedtesting.rules.NoShadowingOrOverridesOnMethodsRule$1.evaluate(NoShadowingOrOverridesOnMethodsRule.java:39)
[junit4:junit4]    > 	at com.carrotsearch.randomizedtesting.rules.StatementAdapter.evaluate(StatementAdapter.java:36)
[junit4:junit4]    > 	at org.apache.lucene.util.TestRuleAssertionsRequired$1.evaluate(TestRuleAssertionsRequired.java:43)
[junit4:junit4]    > 	at org.apache.lucene.util.TestRuleMarkFailure$1.evaluate(TestRuleMarkFailure.java:48)
[junit4:junit4]    > 	at org.apache.lucene.util.TestRuleIgnoreAfterMaxFailures$1.evaluate(TestRuleIgnoreAfterMaxFailures.java:70)
[junit4:junit4]    > 	at org.apache.lucene.util.TestRuleIgnoreTestSuites$1.evaluate(TestRuleIgnoreTestSuites.java:55)
[junit4:junit4]    > 	at com.carrotsearch.randomizedtesting.rules.StatementAdapter.evaluate(StatementAdapter.java:36)
[junit4:junit4]    > 	at com.carrotsearch.randomizedtesting.ThreadLeakControl$StatementRunner.run(ThreadLeakControl.java:358)
[junit4:junit4]    > 	at java.lang.Thread.run(Thread.java:662)
[junit4:junit4]    > Throwable #2: java.lang.NullPointerException
[junit4:junit4]    > 	at __randomizedtesting.SeedInfo.seed([4B8B508907D4199D]:0)
[junit4:junit4]    > 	at org.apache.lucene.index.sorter.SorterTestBase.afterClassSorterTestBase(SorterTestBase.java:239)
[junit4:junit4]    > 	at sun.reflect.NativeMethodAccessorImpl.invoke0(Native Method)
[junit4:junit4]    > 	at sun.reflect.NativeMethodAccessorImpl.invoke(NativeMethodAccessorImpl.java:39)
[junit4:junit4]    > 	at sun.reflect.DelegatingMethodAccessorImpl.invoke(DelegatingMethodAccessorImpl.java:25)
[junit4:junit4]    > 	at java.lang.reflect.Method.invoke(Method.java:597)
[junit4:junit4]    > 	at com.carrotsearch.randomizedtesting.RandomizedRunner.invoke(RandomizedRunner.java:1559)
[junit4:junit4]    > 	at com.carrotsearch.randomizedtesting.RandomizedRunner.access$600(RandomizedRunner.java:79)
[junit4:junit4]    > 	at com.carrotsearch.randomizedtesting.RandomizedRunner$5.evaluate(RandomizedRunner.java:700)
[junit4:junit4]    > 	at org.apache.lucene.util.AbstractBeforeAfterRule$1.evaluate(AbstractBeforeAfterRule.java:46)
[junit4:junit4]    > 	at org.apache.lucene.util.TestRuleStoreClassName$1.evaluate(TestRuleStoreClassName.java:42)
[junit4:junit4]    > 	at com.carrotsearch.randomizedtesting.rules.SystemPropertiesInvariantRule$1.evaluate(SystemPropertiesInvariantRule.java:55)
[junit4:junit4]    > 	at com.carrotsearch.randomizedtesting.rules.NoShadowingOrOverridesOnMethodsRule$1.evaluate(NoShadowingOrOverridesOnMethodsRule.java:39)
[junit4:junit4]    > 	at com.carrotsearch.randomizedtesting.rules.NoShadowingOrOverridesOnMethodsRule$1.evaluate(NoShadowingOrOverridesOnMethodsRule.java:39)
[junit4:junit4]    > 	at com.carrotsearch.randomizedtesting.rules.StatementAdapter.evaluate(StatementAdapter.java:36)
[junit4:junit4]    > 	at org.apache.lucene.util.TestRuleAssertionsRequired$1.evaluate(TestRuleAssertionsRequired.java:43)
[junit4:junit4]    > 	at org.apache.lucene.util.TestRuleMarkFailure$1.evaluate(TestRuleMarkFailure.java:48)
[junit4:junit4]    > 	at org.apache.lucene.util.TestRuleIgnoreAfterMaxFailures$1.evaluate(TestRuleIgnoreAfterMaxFailures.java:70)
[junit4:junit4]    > 	at org.apache.lucene.util.TestRuleIgnoreTestSuites$1.evaluate(TestRuleIgnoreTestSuites.java:55)
[junit4:junit4]    > 	at com.carrotsearch.randomizedtesting.rules.StatementAdapter.evaluate(StatementAdapter.java:36)
[junit4:junit4]    > 	at com.carrotsearch.randomizedtesting.ThreadLeakControl$StatementRunner.run(ThreadLeakControl.java:358)
[junit4:junit4]    > 	at java.lang.Thread.run(Thread.java:662)
[junit4:junit4] Completed on J1 in 0.19s, 0 tests, 2 errors <<< FAILURES!

[...truncated 14 lines...]
BUILD FAILED
/mnt/ssd/jenkins/workspace/Lucene-Solr-4.x-Linux/build.xml:381: The following error occurred while executing this line:
/mnt/ssd/jenkins/workspace/Lucene-Solr-4.x-Linux/build.xml:361: The following error occurred while executing this line:
/mnt/ssd/jenkins/workspace/Lucene-Solr-4.x-Linux/build.xml:39: The following error occurred while executing this line:
/mnt/ssd/jenkins/workspace/Lucene-Solr-4.x-Linux/lucene/build.xml:548: The following error occurred while executing this line:
/mnt/ssd/jenkins/workspace/Lucene-Solr-4.x-Linux/lucene/common-build.xml:1757: The following error occurred while executing this line:
/mnt/ssd/jenkins/workspace/Lucene-Solr-4.x-Linux/lucene/module-build.xml:61: The following error occurred while executing this line:
/mnt/ssd/jenkins/workspace/Lucene-Solr-4.x-Linux/lucene/common-build.xml:1213: The following error occurred while executing this line:
/mnt/ssd/jenkins/workspace/Lucene-Solr-4.x-Linux/lucene/common-build.xml:877: There were test failures: 8 suites, 21 tests, 3 suite-level errors

Total time: 18 minutes 19 seconds
Build step 'Invoke Ant' marked build as failure
Archiving artifacts
Recording test results
Description set: Java: 64bit/jdk1.6.0_41 -XX:+UseSerialGC
Email was triggered for: Failure
Sending email for trigger: Failure



[JENKINS] Lucene-Solr-4.x-Linux (32bit/jdk1.8.0-ea-b79) - Build # 4620 - Still Failing!

Posted by Policeman Jenkins Server <je...@thetaphi.de>.
Build: http://jenkins.thetaphi.de/job/Lucene-Solr-4.x-Linux/4620/
Java: 32bit/jdk1.8.0-ea-b79 -client -XX:+UseParallelGC

1 tests failed.
FAILED:  org.apache.solr.cloud.UnloadDistributedZkTest.testDistribSearch

Error Message:
Still found shard

Stack Trace:
java.lang.AssertionError: Still found shard
	at __randomizedtesting.SeedInfo.seed([768E6FF7ADAC39EA:F768E1EFDAF359D6]:0)
	at org.junit.Assert.fail(Assert.java:93)
	at org.apache.solr.cloud.UnloadDistributedZkTest.testUnloadShardAndCollection(UnloadDistributedZkTest.java:124)
	at org.apache.solr.cloud.UnloadDistributedZkTest.doTest(UnloadDistributedZkTest.java:77)
	at org.apache.solr.BaseDistributedSearchTestCase.testDistribSearch(BaseDistributedSearchTestCase.java:806)
	at sun.reflect.NativeMethodAccessorImpl.invoke0(Native Method)
	at sun.reflect.NativeMethodAccessorImpl.invoke(NativeMethodAccessorImpl.java:57)
	at sun.reflect.DelegatingMethodAccessorImpl.invoke(DelegatingMethodAccessorImpl.java:43)
	at java.lang.reflect.Method.invoke(Method.java:487)
	at com.carrotsearch.randomizedtesting.RandomizedRunner.invoke(RandomizedRunner.java:1559)
	at com.carrotsearch.randomizedtesting.RandomizedRunner.access$600(RandomizedRunner.java:79)
	at com.carrotsearch.randomizedtesting.RandomizedRunner$6.evaluate(RandomizedRunner.java:737)
	at com.carrotsearch.randomizedtesting.RandomizedRunner$7.evaluate(RandomizedRunner.java:773)
	at com.carrotsearch.randomizedtesting.RandomizedRunner$8.evaluate(RandomizedRunner.java:787)
	at com.carrotsearch.randomizedtesting.rules.SystemPropertiesRestoreRule$1.evaluate(SystemPropertiesRestoreRule.java:53)
	at org.apache.lucene.util.TestRuleSetupTeardownChained$1.evaluate(TestRuleSetupTeardownChained.java:50)
	at org.apache.lucene.util.TestRuleFieldCacheSanity$1.evaluate(TestRuleFieldCacheSanity.java:51)
	at org.apache.lucene.util.AbstractBeforeAfterRule$1.evaluate(AbstractBeforeAfterRule.java:46)
	at com.carrotsearch.randomizedtesting.rules.SystemPropertiesInvariantRule$1.evaluate(SystemPropertiesInvariantRule.java:55)
	at org.apache.lucene.util.TestRuleThreadAndTestName$1.evaluate(TestRuleThreadAndTestName.java:49)
	at org.apache.lucene.util.TestRuleIgnoreAfterMaxFailures$1.evaluate(TestRuleIgnoreAfterMaxFailures.java:70)
	at org.apache.lucene.util.TestRuleMarkFailure$1.evaluate(TestRuleMarkFailure.java:48)
	at com.carrotsearch.randomizedtesting.rules.StatementAdapter.evaluate(StatementAdapter.java:36)
	at com.carrotsearch.randomizedtesting.ThreadLeakControl$StatementRunner.run(ThreadLeakControl.java:358)
	at com.carrotsearch.randomizedtesting.ThreadLeakControl.forkTimeoutingTask(ThreadLeakControl.java:782)
	at com.carrotsearch.randomizedtesting.ThreadLeakControl$3.evaluate(ThreadLeakControl.java:442)
	at com.carrotsearch.randomizedtesting.RandomizedRunner.runSingleTest(RandomizedRunner.java:746)
	at com.carrotsearch.randomizedtesting.RandomizedRunner$3.evaluate(RandomizedRunner.java:648)
	at com.carrotsearch.randomizedtesting.RandomizedRunner$4.evaluate(RandomizedRunner.java:682)
	at com.carrotsearch.randomizedtesting.RandomizedRunner$5.evaluate(RandomizedRunner.java:693)
	at com.carrotsearch.randomizedtesting.rules.StatementAdapter.evaluate(StatementAdapter.java:36)
	at com.carrotsearch.randomizedtesting.rules.SystemPropertiesRestoreRule$1.evaluate(SystemPropertiesRestoreRule.java:53)
	at org.apache.lucene.util.AbstractBeforeAfterRule$1.evaluate(AbstractBeforeAfterRule.java:46)
	at org.apache.lucene.util.TestRuleStoreClassName$1.evaluate(TestRuleStoreClassName.java:42)
	at com.carrotsearch.randomizedtesting.rules.SystemPropertiesInvariantRule$1.evaluate(SystemPropertiesInvariantRule.java:55)
	at com.carrotsearch.randomizedtesting.rules.NoShadowingOrOverridesOnMethodsRule$1.evaluate(NoShadowingOrOverridesOnMethodsRule.java:39)
	at com.carrotsearch.randomizedtesting.rules.NoShadowingOrOverridesOnMethodsRule$1.evaluate(NoShadowingOrOverridesOnMethodsRule.java:39)
	at com.carrotsearch.randomizedtesting.rules.StatementAdapter.evaluate(StatementAdapter.java:36)
	at org.apache.lucene.util.TestRuleAssertionsRequired$1.evaluate(TestRuleAssertionsRequired.java:43)
	at org.apache.lucene.util.TestRuleMarkFailure$1.evaluate(TestRuleMarkFailure.java:48)
	at org.apache.lucene.util.TestRuleIgnoreAfterMaxFailures$1.evaluate(TestRuleIgnoreAfterMaxFailures.java:70)
	at org.apache.lucene.util.TestRuleIgnoreTestSuites$1.evaluate(TestRuleIgnoreTestSuites.java:55)
	at com.carrotsearch.randomizedtesting.rules.StatementAdapter.evaluate(StatementAdapter.java:36)
	at com.carrotsearch.randomizedtesting.ThreadLeakControl$StatementRunner.run(ThreadLeakControl.java:358)
	at java.lang.Thread.run(Thread.java:722)




Build Log:
[...truncated 8975 lines...]
[junit4:junit4] Suite: org.apache.solr.cloud.UnloadDistributedZkTest
[junit4:junit4]   2> 0 T229 oas.BaseDistributedSearchTestCase.initHostContext Setting hostContext system property: /ks/
[junit4:junit4]   2> 3 T229 oas.SolrTestCaseJ4.setUp ###Starting testDistribSearch
[junit4:junit4]   2> Creating dataDir: /mnt/ssd/jenkins/workspace/Lucene-Solr-4.x-Linux/solr/build/solr-core/test/J0/./solrtest-UnloadDistributedZkTest-1362922366005
[junit4:junit4]   2> 6 T229 oasc.ZkTestServer.run STARTING ZK TEST SERVER
[junit4:junit4]   2> 8 T230 oasc.ZkTestServer$ZKServerMain.runFromConfig Starting server
[junit4:junit4]   2> 29 T230 oaz.Environment.logEnv Server environment:zookeeper.version=3.4.5-1392090, built on 09/30/2012 17:52 GMT
[junit4:junit4]   2> 29 T230 oaz.Environment.logEnv Server environment:host.name=serv1
[junit4:junit4]   2> 29 T230 oaz.Environment.logEnv Server environment:java.version=1.8.0-ea
[junit4:junit4]   2> 29 T230 oaz.Environment.logEnv Server environment:java.vendor=Oracle Corporation
[junit4:junit4]   2> 29 T230 oaz.Environment.logEnv Server environment:java.home=/var/lib/jenkins/tools/java/32bit/jdk1.8.0-ea-b79/jre
[junit4:junit4]   2> 29 T230 oaz.Environment.logEnv Server environment:java.class.path=/mnt/ssd/jenkins/workspace/Lucene-Solr-4.x-Linux/solr/build/solr-core/classes/test:/mnt/ssd/jenkins/workspace/Lucene-Solr-4.x-Linux/solr/build/solr-test-framework/classes/java:/mnt/ssd/jenkins/workspace/Lucene-Solr-4.x-Linux/solr/build/solr-core/test-files:/mnt/ssd/jenkins/workspace/Lucene-Solr-4.x-Linux/lucene/build/test-framework/classes/java:/mnt/ssd/jenkins/workspace/Lucene-Solr-4.x-Linux/lucene/build/codecs/classes/java:/mnt/ssd/jenkins/workspace/Lucene-Solr-4.x-Linux/solr/build/solr-solrj/classes/java:/mnt/ssd/jenkins/workspace/Lucene-Solr-4.x-Linux/solr/build/solr-core/classes/java:/mnt/ssd/jenkins/workspace/Lucene-Solr-4.x-Linux/lucene/build/analysis/common/lucene-analyzers-common-4.2-SNAPSHOT.jar:/mnt/ssd/jenkins/workspace/Lucene-Solr-4.x-Linux/lucene/build/analysis/kuromoji/lucene-analyzers-kuromoji-4.2-SNAPSHOT.jar:/mnt/ssd/jenkins/workspace/Lucene-Solr-4.x-Linux/lucene/build/analysis/phonetic/lucene-analyzers-phonetic-4.2-SNAPSHOT.jar:/mnt/ssd/jenkins/workspace/Lucene-Solr-4.x-Linux/lucene/build/codecs/lucene-codecs-4.2-SNAPSHOT.jar:/mnt/ssd/jenkins/workspace/Lucene-Solr-4.x-Linux/lucene/build/highlighter/lucene-highlighter-4.2-SNAPSHOT.jar:/mnt/ssd/jenkins/workspace/Lucene-Solr-4.x-Linux/lucene/build/memory/lucene-memory-4.2-SNAPSHOT.jar:/mnt/ssd/jenkins/workspace/Lucene-Solr-4.x-Linux/lucene/build/misc/lucene-misc-4.2-SNAPSHOT.jar:/mnt/ssd/jenkins/workspace/Lucene-Solr-4.x-Linux/lucene/build/spatial/lucene-spatial-4.2-SNAPSHOT.jar:/mnt/ssd/jenkins/workspace/Lucene-Solr-4.x-Linux/lucene/build/suggest/lucene-suggest-4.2-SNAPSHOT.jar:/mnt/ssd/jenkins/workspace/Lucene-Solr-4.x-Linux/lucene/build/grouping/lucene-grouping-4.2-SNAPSHOT.jar:/mnt/ssd/jenkins/workspace/Lucene-Solr-4.x-Linux/lucene/build/queries/lucene-queries-4.2-SNAPSHOT.jar:/mnt/ssd/jenkins/workspace/Lucene-Solr-4.x-Linux/lucene/build/queryparser/lucene-queryparser-4.2-SNAPSHOT.jar:/mnt/ssd/jenkins/workspace/Lucene-Solr-4.x-Linux/solr/core/lib/cglib-nodep-2.2.jar:/mnt/ssd/jenkins/workspace/Lucene-Solr-4.x-Linux/solr/core/lib/commons-cli-1.2.jar:/mnt/ssd/jenkins/workspace/Lucene-Solr-4.x-Linux/solr/core/lib/commons-codec-1.7.jar:/mnt/ssd/jenkins/workspace/Lucene-Solr-4.x-Linux/solr/core/lib/commons-fileupload-1.2.1.jar:/mnt/ssd/jenkins/workspace/Lucene-Solr-4.x-Linux/solr/core/lib/commons-lang-2.6.jar:/mnt/ssd/jenkins/workspace/Lucene-Solr-4.x-Linux/solr/core/lib/easymock-3.0.jar:/mnt/ssd/jenkins/workspace/Lucene-Solr-4.x-Linux/solr/core/lib/guava-13.0.1.jar:/mnt/ssd/jenkins/workspace/Lucene-Solr-4.x-Linux/solr/core/lib/javax.servlet-api-3.0.1.jar:/mnt/ssd/jenkins/workspace/Lucene-Solr-4.x-Linux/solr/core/lib/objenesis-1.2.jar:/mnt/ssd/jenkins/workspace/Lucene-Solr-4.x-Linux/solr/core/lib/org.restlet-2.1.1.jar:/mnt/ssd/jenkins/workspace/Lucene-Solr-4.x-Linux/solr/core/lib/org.restlet.ext.servlet-2.1.1.jar:/mnt/ssd/jenkins/workspace/Lucene-Solr-4.x-Linux/solr/core/lib/spatial4j-0.3.jar:/mnt/ssd/jenkins/workspace/Lucene-Solr-4.x-Linux/solr/solrj/lib/commons-io-2.1.jar:/mnt/ssd/jenkins/workspace/Lucene-Solr-4.x-Linux/solr/solrj/lib/httpclient-4.2.3.jar:/mnt/ssd/jenkins/workspace/Lucene-Solr-4.x-Linux/solr/solrj/lib/httpcore-4.2.2.jar:/mnt/ssd/jenkins/workspace/Lucene-Solr-4.x-Linux/solr/solrj/lib/httpmime-4.2.3.jar:/mnt/ssd/jenkins/workspace/Lucene-Solr-4.x-Linux/solr/solrj/lib/jcl-over-slf4j-1.6.4.jar:/mnt/ssd/jenkins/workspace/Lucene-Solr-4.x-Linux/solr/solrj/lib/slf4j-api-1.6.4.jar:/mnt/ssd/jenkins/workspace/Lucene-Solr-4.x-Linux/solr/solrj/lib/slf4j-jdk14-1.6.4.jar:/mnt/ssd/jenkins/workspace/Lucene-Solr-4.x-Linux/solr/solrj/lib/wstx-asl-3.2.7.jar:/mnt/ssd/jenkins/workspace/Lucene-Solr-4.x-Linux/solr/solrj/lib/zookeeper-3.4.5.jar:/mnt/ssd/jenkins/workspace/Lucene-Solr-4.x-Linux/solr/example/lib/jetty-continuation-8.1.8.v20121106.jar:/mnt/ssd/jenkins/workspace/Lucene-Solr-4.x-Linux/solr/example/lib/jetty-deploy-8.1.8.v20121106.jar:/mnt/ssd/jenkins/workspace/Lucene-Solr-4.x-Linux/solr/example/lib/jetty-http-8.1.8.v20121106.jar:/mnt/ssd/jenkins/workspace/Lucene-Solr-4.x-Linux/solr/example/lib/jetty-io-8.1.8.v20121106.jar:/mnt/ssd/jenkins/workspace/Lucene-Solr-4.x-Linux/solr/example/lib/jetty-jmx-8.1.8.v20121106.jar:/mnt/ssd/jenkins/workspace/Lucene-Solr-4.x-Linux/solr/example/lib/jetty-security-8.1.8.v20121106.jar:/mnt/ssd/jenkins/workspace/Lucene-Solr-4.x-Linux/solr/example/lib/jetty-server-8.1.8.v20121106.jar:/mnt/ssd/jenkins/workspace/Lucene-Solr-4.x-Linux/solr/example/lib/jetty-servlet-8.1.8.v20121106.jar:/mnt/ssd/jenkins/workspace/Lucene-Solr-4.x-Linux/solr/example/lib/jetty-util-8.1.8.v20121106.jar:/mnt/ssd/jenkins/workspace/Lucene-Solr-4.x-Linux/solr/example/lib/jetty-webapp-8.1.8.v20121106.jar:/mnt/ssd/jenkins/workspace/Lucene-Solr-4.x-Linux/solr/example/lib/jetty-xml-8.1.8.v20121106.jar:/mnt/ssd/jenkins/workspace/Lucene-Solr-4.x-Linux/solr/example/lib/servlet-api-3.0.jar:/mnt/ssd/jenkins/workspace/Lucene-Solr-4.x-Linux/solr/example/example-DIH/solr/db/lib/derby-10.9.1.0.jar:/mnt/ssd/jenkins/workspace/Lucene-Solr-4.x-Linux/solr/example/example-DIH/solr/db/lib/hsqldb-1.8.0.10.jar:/mnt/ssd/jenkins/workspace/Lucene-Solr-4.x-Linux/lucene/build/core/classes/java:/mnt/ssd/jenkins/workspace/Lucene-Solr-4.x-Linux/lucene/test-framework/lib/junit-4.10.jar:/mnt/ssd/jenkins/workspace/Lucene-Solr-4.x-Linux/lucene/test-framework/lib/randomizedtesting-runner-2.0.8.jar:/var/lib/jenkins/tools/hudson.tasks.Ant_AntInstallation/ANT_1.8.2/lib/ant-launcher.jar:/var/lib/jenkins/.ant/lib/ivy-2.3.0.jar:/var/lib/jenkins/tools/hudson.tasks.Ant_AntInstallation/ANT_1.8.2/lib/ant-jai.jar:/var/lib/jenkins/tools/hudson.tasks.Ant_AntInstallation/ANT_1.8.2/lib/ant-swing.jar:/var/lib/jenkins/tools/hudson.tasks.Ant_AntInstallation/ANT_1.8.2/lib/ant-apache-oro.jar:/var/lib/jenkins/tools/hudson.tasks.Ant_AntInstallation/ANT_1.8.2/lib/ant-jmf.jar:/var/lib/jenkins/tools/hudson.tasks.Ant_AntInstallation/ANT_1.8.2/lib/ant-apache-xalan2.jar:/var/lib/jenkins/tools/hudson.tasks.Ant_AntInstallation/ANT_1.8.2/lib/ant-javamail.jar:/var/lib/jenkins/tools/hudson.tasks.Ant_AntInstallation/ANT_1.8.2/lib/ant-apache-resolver.jar:/var/lib/jenkins/tools/hudson.tasks.Ant_AntInstallation/ANT_1.8.2/lib/ant-testutil.jar:/var/lib/jenkins/tools/hudson.tasks.Ant_AntInstallation/ANT_1.8.2/lib/ant-commons-logging.jar:/var/lib/jenkins/tools/hudson.tasks.Ant_AntInstallation/ANT_1.8.2/lib/ant-apache-log4j.jar:/var/lib/jenkins/tools/hudson.tasks.Ant_AntInstallation/ANT_1.8.2/lib/ant-junit.jar:/var/lib/jenkins/tools/hudson.tasks.Ant_AntInstallation/ANT_1.8.2/lib/ant-jsch.jar:/var/lib/jenkins/tools/hudson.tasks.Ant_AntInstallation/ANT_1.8.2/lib/ant-commons-net.jar:/var/lib/jenkins/tools/hudson.tasks.Ant_AntInstallation/ANT_1.8.2/lib/ant-apache-bsf.jar:/var/lib/jenkins/tools/hudson.tasks.Ant_AntInstallation/ANT_1.8.2/lib/ant-jdepend.jar:/var/lib/jenkins/tools/hudson.tasks.Ant_AntInstallation/ANT_1.8.2/lib/ant-netrexx.jar:/var/lib/jenkins/tools/hudson.tasks.Ant_AntInstallation/ANT_1.8.2/lib/ant-apache-regexp.jar:/var/lib/jenkins/tools/hudson.tasks.Ant_AntInstallation/ANT_1.8.2/lib/ant-junit4.jar:/var/lib/jenkins/tools/hudson.tasks.Ant_AntInstallation/ANT_1.8.2/lib/ant.jar:/var/lib/jenkins/tools/hudson.tasks.Ant_AntInstallation/ANT_1.8.2/lib/ant-apache-bcel.jar:/var/lib/jenkins/tools/hudson.tasks.Ant_AntInstallation/ANT_1.8.2/lib/ant-antlr.jar:/var/lib/jenkins/tools/java/32bit/jdk1.8.0-ea-b79/lib/tools.jar:/var/lib/jenkins/.ivy2/cache/com.carrotsearch.randomizedtesting/junit4-ant/jars/junit4-ant-2.0.8.jar
[junit4:junit4]   2> 31 T230 oaz.Environment.logEnv Server environment:java.library.path=/usr/lib/jvm/j2sdk1.6-sun/jre/lib/amd64/server:/usr/lib/jvm/j2sdk1.6-sun/jre/lib/amd64:/usr/lib/jvm/j2sdk1.6-sun/jre/../lib/amd64:/usr/java/packages/lib/i386:/lib:/usr/lib
[junit4:junit4]   2> 31 T230 oaz.Environment.logEnv Server environment:java.io.tmpdir=.
[junit4:junit4]   2> 31 T230 oaz.Environment.logEnv Server environment:java.compiler=<NA>
[junit4:junit4]   2> 31 T230 oaz.Environment.logEnv Server environment:os.name=Linux
[junit4:junit4]   2> 31 T230 oaz.Environment.logEnv Server environment:os.arch=i386
[junit4:junit4]   2> 31 T230 oaz.Environment.logEnv Server environment:os.version=3.2.0-38-generic
[junit4:junit4]   2> 31 T230 oaz.Environment.logEnv Server environment:user.name=jenkins
[junit4:junit4]   2> 31 T230 oaz.Environment.logEnv Server environment:user.home=/var/lib/jenkins
[junit4:junit4]   2> 32 T230 oaz.Environment.logEnv Server environment:user.dir=/mnt/ssd/jenkins/workspace/Lucene-Solr-4.x-Linux/solr/build/solr-core/test/J0
[junit4:junit4]   2> 49 T230 oazs.ZooKeeperServer.setTickTime tickTime set to 1000
[junit4:junit4]   2> 50 T230 oazs.ZooKeeperServer.setMinSessionTimeout minSessionTimeout set to -1
[junit4:junit4]   2> 50 T230 oazs.ZooKeeperServer.setMaxSessionTimeout maxSessionTimeout set to -1
[junit4:junit4]   2> 51 T230 oazs.NIOServerCnxnFactory.configure binding to port 0.0.0.0/0.0.0.0:0
[junit4:junit4]   2> 75 T230 oazsp.FileTxnSnapLog.save Snapshotting: 0x0 to /mnt/ssd/jenkins/workspace/Lucene-Solr-4.x-Linux/solr/build/solr-core/test/J0/./org.apache.solr.cloud.UnloadDistributedZkTest-1362922366005/zookeeper/server1/data/version-2/snapshot.0
[junit4:junit4]   2> 108 T229 oasc.ZkTestServer.run start zk server on port:46789
[junit4:junit4]   2> 127 T229 oaz.Environment.logEnv Client environment:zookeeper.version=3.4.5-1392090, built on 09/30/2012 17:52 GMT
[junit4:junit4]   2> 127 T229 oaz.Environment.logEnv Client environment:host.name=serv1
[junit4:junit4]   2> 128 T229 oaz.Environment.logEnv Client environment:java.version=1.8.0-ea
[junit4:junit4]   2> 128 T229 oaz.Environment.logEnv Client environment:java.vendor=Oracle Corporation
[junit4:junit4]   2> 128 T229 oaz.Environment.logEnv Client environment:java.home=/var/lib/jenkins/tools/java/32bit/jdk1.8.0-ea-b79/jre
[junit4:junit4]   2> 128 T229 oaz.Environment.logEnv Client environment:java.class.path=/mnt/ssd/jenkins/workspace/Lucene-Solr-4.x-Linux/solr/build/solr-core/classes/test:/mnt/ssd/jenkins/workspace/Lucene-Solr-4.x-Linux/solr/build/solr-test-framework/classes/java:/mnt/ssd/jenkins/workspace/Lucene-Solr-4.x-Linux/solr/build/solr-core/test-files:/mnt/ssd/jenkins/workspace/Lucene-Solr-4.x-Linux/lucene/build/test-framework/classes/java:/mnt/ssd/jenkins/workspace/Lucene-Solr-4.x-Linux/lucene/build/codecs/classes/java:/mnt/ssd/jenkins/workspace/Lucene-Solr-4.x-Linux/solr/build/solr-solrj/classes/java:/mnt/ssd/jenkins/workspace/Lucene-Solr-4.x-Linux/solr/build/solr-core/classes/java:/mnt/ssd/jenkins/workspace/Lucene-Solr-4.x-Linux/lucene/build/analysis/common/lucene-analyzers-common-4.2-SNAPSHOT.jar:/mnt/ssd/jenkins/workspace/Lucene-Solr-4.x-Linux/lucene/build/analysis/kuromoji/lucene-analyzers-kuromoji-4.2-SNAPSHOT.jar:/mnt/ssd/jenkins/workspace/Lucene-Solr-4.x-Linux/lucene/build/analysis/phonetic/lucene-analyzers-phonetic-4.2-SNAPSHOT.jar:/mnt/ssd/jenkins/workspace/Lucene-Solr-4.x-Linux/lucene/build/codecs/lucene-codecs-4.2-SNAPSHOT.jar:/mnt/ssd/jenkins/workspace/Lucene-Solr-4.x-Linux/lucene/build/highlighter/lucene-highlighter-4.2-SNAPSHOT.jar:/mnt/ssd/jenkins/workspace/Lucene-Solr-4.x-Linux/lucene/build/memory/lucene-memory-4.2-SNAPSHOT.jar:/mnt/ssd/jenkins/workspace/Lucene-Solr-4.x-Linux/lucene/build/misc/lucene-misc-4.2-SNAPSHOT.jar:/mnt/ssd/jenkins/workspace/Lucene-Solr-4.x-Linux/lucene/build/spatial/lucene-spatial-4.2-SNAPSHOT.jar:/mnt/ssd/jenkins/workspace/Lucene-Solr-4.x-Linux/lucene/build/suggest/lucene-suggest-4.2-SNAPSHOT.jar:/mnt/ssd/jenkins/workspace/Lucene-Solr-4.x-Linux/lucene/build/grouping/lucene-grouping-4.2-SNAPSHOT.jar:/mnt/ssd/jenkins/workspace/Lucene-Solr-4.x-Linux/lucene/build/queries/lucene-queries-4.2-SNAPSHOT.jar:/mnt/ssd/jenkins/workspace/Lucene-Solr-4.x-Linux/lucene/build/queryparser/lucene-queryparser-4.2-SNAPSHOT.jar:/mnt/ssd/jenkins/workspace/Lucene-Solr-4.x-Linux/solr/core/lib/cglib-nodep-2.2.jar:/mnt/ssd/jenkins/workspace/Lucene-Solr-4.x-Linux/solr/core/lib/commons-cli-1.2.jar:/mnt/ssd/jenkins/workspace/Lucene-Solr-4.x-Linux/solr/core/lib/commons-codec-1.7.jar:/mnt/ssd/jenkins/workspace/Lucene-Solr-4.x-Linux/solr/core/lib/commons-fileupload-1.2.1.jar:/mnt/ssd/jenkins/workspace/Lucene-Solr-4.x-Linux/solr/core/lib/commons-lang-2.6.jar:/mnt/ssd/jenkins/workspace/Lucene-Solr-4.x-Linux/solr/core/lib/easymock-3.0.jar:/mnt/ssd/jenkins/workspace/Lucene-Solr-4.x-Linux/solr/core/lib/guava-13.0.1.jar:/mnt/ssd/jenkins/workspace/Lucene-Solr-4.x-Linux/solr/core/lib/javax.servlet-api-3.0.1.jar:/mnt/ssd/jenkins/workspace/Lucene-Solr-4.x-Linux/solr/core/lib/objenesis-1.2.jar:/mnt/ssd/jenkins/workspace/Lucene-Solr-4.x-Linux/solr/core/lib/org.restlet-2.1.1.jar:/mnt/ssd/jenkins/workspace/Lucene-Solr-4.x-Linux/solr/core/lib/org.restlet.ext.servlet-2.1.1.jar:/mnt/ssd/jenkins/workspace/Lucene-Solr-4.x-Linux/solr/core/lib/spatial4j-0.3.jar:/mnt/ssd/jenkins/workspace/Lucene-Solr-4.x-Linux/solr/solrj/lib/commons-io-2.1.jar:/mnt/ssd/jenkins/workspace/Lucene-Solr-4.x-Linux/solr/solrj/lib/httpclient-4.2.3.jar:/mnt/ssd/jenkins/workspace/Lucene-Solr-4.x-Linux/solr/solrj/lib/httpcore-4.2.2.jar:/mnt/ssd/jenkins/workspace/Lucene-Solr-4.x-Linux/solr/solrj/lib/httpmime-4.2.3.jar:/mnt/ssd/jenkins/workspace/Lucene-Solr-4.x-Linux/solr/solrj/lib/jcl-over-slf4j-1.6.4.jar:/mnt/ssd/jenkins/workspace/Lucene-Solr-4.x-Linux/solr/solrj/lib/slf4j-api-1.6.4.jar:/mnt/ssd/jenkins/workspace/Lucene-Solr-4.x-Linux/solr/solrj/lib/slf4j-jdk14-1.6.4.jar:/mnt/ssd/jenkins/workspace/Lucene-Solr-4.x-Linux/solr/solrj/lib/wstx-asl-3.2.7.jar:/mnt/ssd/jenkins/workspace/Lucene-Solr-4.x-Linux/solr/solrj/lib/zookeeper-3.4.5.jar:/mnt/ssd/jenkins/workspace/Lucene-Solr-4.x-Linux/solr/example/lib/jetty-continuation-8.1.8.v20121106.jar:/mnt/ssd/jenkins/workspace/Lucene-Solr-4.x-Linux/solr/example/lib/jetty-deploy-8.1.8.v20121106.jar:/mnt/ssd/jenkins/workspace/Lucene-Solr-4.x-Linux/solr/example/lib/jetty-http-8.1.8.v20121106.jar:/mnt/ssd/jenkins/workspace/Lucene-Solr-4.x-Linux/solr/example/lib/jetty-io-8.1.8.v20121106.jar:/mnt/ssd/jenkins/workspace/Lucene-Solr-4.x-Linux/solr/example/lib/jetty-jmx-8.1.8.v20121106.jar:/mnt/ssd/jenkins/workspace/Lucene-Solr-4.x-Linux/solr/example/lib/jetty-security-8.1.8.v20121106.jar:/mnt/ssd/jenkins/workspace/Lucene-Solr-4.x-Linux/solr/example/lib/jetty-server-8.1.8.v20121106.jar:/mnt/ssd/jenkins/workspace/Lucene-Solr-4.x-Linux/solr/example/lib/jetty-servlet-8.1.8.v20121106.jar:/mnt/ssd/jenkins/workspace/Lucene-Solr-4.x-Linux/solr/example/lib/jetty-util-8.1.8.v20121106.jar:/mnt/ssd/jenkins/workspace/Lucene-Solr-4.x-Linux/solr/example/lib/jetty-webapp-8.1.8.v20121106.jar:/mnt/ssd/jenkins/workspace/Lucene-Solr-4.x-Linux/solr/example/lib/jetty-xml-8.1.8.v20121106.jar:/mnt/ssd/jenkins/workspace/Lucene-Solr-4.x-Linux/solr/example/lib/servlet-api-3.0.jar:/mnt/ssd/jenkins/workspace/Lucene-Solr-4.x-Linux/solr/example/example-DIH/solr/db/lib/derby-10.9.1.0.jar:/mnt/ssd/jenkins/workspace/Lucene-Solr-4.x-Linux/solr/example/example-DIH/solr/db/lib/hsqldb-1.8.0.10.jar:/mnt/ssd/jenkins/workspace/Lucene-Solr-4.x-Linux/lucene/build/core/classes/java:/mnt/ssd/jenkins/workspace/Lucene-Solr-4.x-Linux/lucene/test-framework/lib/junit-4.10.jar:/mnt/ssd/jenkins/workspace/Lucene-Solr-4.x-Linux/lucene/test-framework/lib/randomizedtesting-runner-2.0.8.jar:/var/lib/jenkins/tools/hudson.tasks.Ant_AntInstallation/ANT_1.8.2/lib/ant-launcher.jar:/var/lib/jenkins/.ant/lib/ivy-2.3.0.jar:/var/lib/jenkins/tools/hudson.tasks.Ant_AntInstallation/ANT_1.8.2/lib/ant-jai.jar:/var/lib/jenkins/tools/hudson.tasks.Ant_AntInstallation/ANT_1.8.2/lib/ant-swing.jar:/var/lib/jenkins/tools/hudson.tasks.Ant_AntInstallation/ANT_1.8.2/lib/ant-apache-oro.jar:/var/lib/jenkins/tools/hudson.tasks.Ant_AntInstallation/ANT_1.8.2/lib/ant-jmf.jar:/var/lib/jenkins/tools/hudson.tasks.Ant_AntInstallation/ANT_1.8.2/lib/ant-apache-xalan2.jar:/var/lib/jenkins/tools/hudson.tasks.Ant_AntInstallation/ANT_1.8.2/lib/ant-javamail.jar:/var/lib/jenkins/tools/hudson.tasks.Ant_AntInstallation/ANT_1.8.2/lib/ant-apache-resolver.jar:/var/lib/jenkins/tools/hudson.tasks.Ant_AntInstallation/ANT_1.8.2/lib/ant-testutil.jar:/var/lib/jenkins/tools/hudson.tasks.Ant_AntInstallation/ANT_1.8.2/lib/ant-commons-logging.jar:/var/lib/jenkins/tools/hudson.tasks.Ant_AntInstallation/ANT_1.8.2/lib/ant-apache-log4j.jar:/var/lib/jenkins/tools/hudson.tasks.Ant_AntInstallation/ANT_1.8.2/lib/ant-junit.jar:/var/lib/jenkins/tools/hudson.tasks.Ant_AntInstallation/ANT_1.8.2/lib/ant-jsch.jar:/var/lib/jenkins/tools/hudson.tasks.Ant_AntInstallation/ANT_1.8.2/lib/ant-commons-net.jar:/var/lib/jenkins/tools/hudson.tasks.Ant_AntInstallation/ANT_1.8.2/lib/ant-apache-bsf.jar:/var/lib/jenkins/tools/hudson.tasks.Ant_AntInstallation/ANT_1.8.2/lib/ant-jdepend.jar:/var/lib/jenkins/tools/hudson.tasks.Ant_AntInstallation/ANT_1.8.2/lib/ant-netrexx.jar:/var/lib/jenkins/tools/hudson.tasks.Ant_AntInstallation/ANT_1.8.2/lib/ant-apache-regexp.jar:/var/lib/jenkins/tools/hudson.tasks.Ant_AntInstallation/ANT_1.8.2/lib/ant-junit4.jar:/var/lib/jenkins/tools/hudson.tasks.Ant_AntInstallation/ANT_1.8.2/lib/ant.jar:/var/lib/jenkins/tools/hudson.tasks.Ant_AntInstallation/ANT_1.8.2/lib/ant-apache-bcel.jar:/var/lib/jenkins/tools/hudson.tasks.Ant_AntInstallation/ANT_1.8.2/lib/ant-antlr.jar:/var/lib/jenkins/tools/java/32bit/jdk1.8.0-ea-b79/lib/tools.jar:/var/lib/jenkins/.ivy2/cache/com.carrotsearch.randomizedtesting/junit4-ant/jars/junit4-ant-2.0.8.jar
[junit4:junit4]   2> 130 T229 oaz.Environment.logEnv Client environment:java.library.path=/usr/lib/jvm/j2sdk1.6-sun/jre/lib/amd64/server:/usr/lib/jvm/j2sdk1.6-sun/jre/lib/amd64:/usr/lib/jvm/j2sdk1.6-sun/jre/../lib/amd64:/usr/java/packages/lib/i386:/lib:/usr/lib
[junit4:junit4]   2> 130 T229 oaz.Environment.logEnv Client environment:java.io.tmpdir=.
[junit4:junit4]   2> 130 T229 oaz.Environment.logEnv Client environment:java.compiler=<NA>
[junit4:junit4]   2> 130 T229 oaz.Environment.logEnv Client environment:os.name=Linux
[junit4:junit4]   2> 131 T229 oaz.Environment.logEnv Client environment:os.arch=i386
[junit4:junit4]   2> 131 T229 oaz.Environment.logEnv Client environment:os.version=3.2.0-38-generic
[junit4:junit4]   2> 131 T229 oaz.Environment.logEnv Client environment:user.name=jenkins
[junit4:junit4]   2> 131 T229 oaz.Environment.logEnv Client environment:user.home=/var/lib/jenkins
[junit4:junit4]   2> 132 T229 oaz.Environment.logEnv Client environment:user.dir=/mnt/ssd/jenkins/workspace/Lucene-Solr-4.x-Linux/solr/build/solr-core/test/J0
[junit4:junit4]   2> 133 T229 oaz.ZooKeeper.<init> Initiating client connection, connectString=127.0.0.1:46789 sessionTimeout=10000 watcher=org.apache.solr.common.cloud.ConnectionManager@1c8c60e
[junit4:junit4]   2> 153 T229 oascc.ConnectionManager.waitForConnected Waiting for client to connect to ZooKeeper
[junit4:junit4]   2> 156 T235 oaz.ClientCnxn$SendThread.logStartConnect Opening socket connection to server localhost.localdomain/127.0.0.1:46789. Will not attempt to authenticate using SASL (access denied ("javax.security.auth.AuthPermission" "getLoginConfiguration"))
[junit4:junit4]   2> 157 T235 oaz.ClientCnxn$SendThread.primeConnection Socket connection established to localhost.localdomain/127.0.0.1:46789, initiating session
[junit4:junit4]   2> 157 T231 oazs.NIOServerCnxnFactory.run Accepted socket connection from /127.0.0.1:43355
[junit4:junit4]   2> 164 T231 oazs.ZooKeeperServer.processConnectRequest Client attempting to establish new session at /127.0.0.1:43355
[junit4:junit4]   2> 168 T233 oazsp.FileTxnLog.append Creating new log file: log.1
[junit4:junit4]   2> 179 T233 oazs.ZooKeeperServer.finishSessionInit Established session 0x13d5480e4860000 with negotiated timeout 10000 for client /127.0.0.1:43355
[junit4:junit4]   2> 179 T235 oaz.ClientCnxn$SendThread.onConnected Session establishment complete on server localhost.localdomain/127.0.0.1:46789, sessionid = 0x13d5480e4860000, negotiated timeout = 10000
[junit4:junit4]   2> 182 T236 oascc.ConnectionManager.process Watcher org.apache.solr.common.cloud.ConnectionManager@1c8c60e name:ZooKeeperConnection Watcher:127.0.0.1:46789 got event WatchedEvent state:SyncConnected type:None path:null path:null type:None
[junit4:junit4]   2> 182 T229 oascc.ConnectionManager.waitForConnected Client is connected to ZooKeeper
[junit4:junit4]   2> 183 T229 oascc.SolrZkClient.makePath makePath: /solr
[junit4:junit4]   2> 206 T234 oazs.PrepRequestProcessor.pRequest2Txn Processed session termination for sessionid: 0x13d5480e4860000
[junit4:junit4]   2> 210 T229 oaz.ZooKeeper.close Session: 0x13d5480e4860000 closed
[junit4:junit4]   2> 211 T229 oaz.ZooKeeper.<init> Initiating client connection, connectString=127.0.0.1:46789/solr sessionTimeout=10000 watcher=org.apache.solr.common.cloud.ConnectionManager@8a6a80
[junit4:junit4]   2> 211 T236 oaz.ClientCnxn$EventThread.run EventThread shut down
[junit4:junit4]   2> 213 T231 oazs.NIOServerCnxn.closeSock Closed socket connection for client /127.0.0.1:43355 which had sessionid 0x13d5480e4860000
[junit4:junit4]   2> 213 T237 oaz.ClientCnxn$SendThread.logStartConnect Opening socket connection to server localhost.localdomain/127.0.0.1:46789. Will not attempt to authenticate using SASL (access denied ("javax.security.auth.AuthPermission" "getLoginConfiguration"))
[junit4:junit4]   2> 212 T229 oascc.ConnectionManager.waitForConnected Waiting for client to connect to ZooKeeper
[junit4:junit4]   2> 214 T237 oaz.ClientCnxn$SendThread.primeConnection Socket connection established to localhost.localdomain/127.0.0.1:46789, initiating session
[junit4:junit4]   2> 214 T231 oazs.NIOServerCnxnFactory.run Accepted socket connection from /127.0.0.1:43356
[junit4:junit4]   2> 214 T231 oazs.ZooKeeperServer.processConnectRequest Client attempting to establish new session at /127.0.0.1:43356
[junit4:junit4]   2> 215 T233 oazs.ZooKeeperServer.finishSessionInit Established session 0x13d5480e4860001 with negotiated timeout 10000 for client /127.0.0.1:43356
[junit4:junit4]   2> 215 T237 oaz.ClientCnxn$SendThread.onConnected Session establishment complete on server localhost.localdomain/127.0.0.1:46789, sessionid = 0x13d5480e4860001, negotiated timeout = 10000
[junit4:junit4]   2> 216 T238 oascc.ConnectionManager.process Watcher org.apache.solr.common.cloud.ConnectionManager@8a6a80 name:ZooKeeperConnection Watcher:127.0.0.1:46789/solr got event WatchedEvent state:SyncConnected type:None path:null path:null type:None
[junit4:junit4]   2> 216 T229 oascc.ConnectionManager.waitForConnected Client is connected to ZooKeeper
[junit4:junit4]   2> 218 T229 oascc.SolrZkClient.makePath makePath: /collections/collection1
[junit4:junit4]   2> 223 T229 oascc.SolrZkClient.makePath makePath: /collections/collection1/shards
[junit4:junit4]   2> 226 T229 oascc.SolrZkClient.makePath makePath: /collections/control_collection
[junit4:junit4]   2> 229 T229 oascc.SolrZkClient.makePath makePath: /collections/control_collection/shards
[junit4:junit4]   2> 232 T229 oasc.AbstractZkTestCase.putConfig put /mnt/ssd/jenkins/workspace/Lucene-Solr-4.x-Linux/solr/build/solr-core/test-files/solr/collection1/conf/solrconfig-tlog.xml to /configs/conf1/solrconfig.xml
[junit4:junit4]   2> 239 T229 oascc.SolrZkClient.makePath makePath: /configs/conf1/solrconfig.xml
[junit4:junit4]   2> 245 T229 oasc.AbstractZkTestCase.putConfig put /mnt/ssd/jenkins/workspace/Lucene-Solr-4.x-Linux/solr/build/solr-core/test-files/solr/collection1/conf/schema.xml to /configs/conf1/schema.xml
[junit4:junit4]   2> 246 T229 oascc.SolrZkClient.makePath makePath: /configs/conf1/schema.xml
[junit4:junit4]   2> 250 T229 oasc.AbstractZkTestCase.putConfig put /mnt/ssd/jenkins/workspace/Lucene-Solr-4.x-Linux/solr/build/solr-core/test-files/solr/collection1/conf/stopwords.txt to /configs/conf1/stopwords.txt
[junit4:junit4]   2> 250 T229 oascc.SolrZkClient.makePath makePath: /configs/conf1/stopwords.txt
[junit4:junit4]   2> 254 T229 oasc.AbstractZkTestCase.putConfig put /mnt/ssd/jenkins/workspace/Lucene-Solr-4.x-Linux/solr/build/solr-core/test-files/solr/collection1/conf/protwords.txt to /configs/conf1/protwords.txt
[junit4:junit4]   2> 254 T229 oascc.SolrZkClient.makePath makePath: /configs/conf1/protwords.txt
[junit4:junit4]   2> 257 T229 oasc.AbstractZkTestCase.putConfig put /mnt/ssd/jenkins/workspace/Lucene-Solr-4.x-Linux/solr/build/solr-core/test-files/solr/collection1/conf/currency.xml to /configs/conf1/currency.xml
[junit4:junit4]   2> 258 T229 oascc.SolrZkClient.makePath makePath: /configs/conf1/currency.xml
[junit4:junit4]   2> 262 T229 oasc.AbstractZkTestCase.putConfig put /mnt/ssd/jenkins/workspace/Lucene-Solr-4.x-Linux/solr/build/solr-core/test-files/solr/collection1/conf/open-exchange-rates.json to /configs/conf1/open-exchange-rates.json
[junit4:junit4]   2> 262 T229 oascc.SolrZkClient.makePath makePath: /configs/conf1/open-exchange-rates.json
[junit4:junit4]   2> 265 T229 oasc.AbstractZkTestCase.putConfig put /mnt/ssd/jenkins/workspace/Lucene-Solr-4.x-Linux/solr/build/solr-core/test-files/solr/collection1/conf/mapping-ISOLatin1Accent.txt to /configs/conf1/mapping-ISOLatin1Accent.txt
[junit4:junit4]   2> 266 T229 oascc.SolrZkClient.makePath makePath: /configs/conf1/mapping-ISOLatin1Accent.txt
[junit4:junit4]   2> 269 T229 oasc.AbstractZkTestCase.putConfig put /mnt/ssd/jenkins/workspace/Lucene-Solr-4.x-Linux/solr/build/solr-core/test-files/solr/collection1/conf/old_synonyms.txt to /configs/conf1/old_synonyms.txt
[junit4:junit4]   2> 270 T229 oascc.SolrZkClient.makePath makePath: /configs/conf1/old_synonyms.txt
[junit4:junit4]   2> 273 T229 oasc.AbstractZkTestCase.putConfig put /mnt/ssd/jenkins/workspace/Lucene-Solr-4.x-Linux/solr/build/solr-core/test-files/solr/collection1/conf/synonyms.txt to /configs/conf1/synonyms.txt
[junit4:junit4]   2> 273 T229 oascc.SolrZkClient.makePath makePath: /configs/conf1/synonyms.txt
[junit4:junit4]   2> 277 T234 oazs.PrepRequestProcessor.pRequest2Txn Processed session termination for sessionid: 0x13d5480e4860001
[junit4:junit4]   2> 278 T238 oaz.ClientCnxn$EventThread.run EventThread shut down
[junit4:junit4]   2> 278 T231 oazs.NIOServerCnxn.closeSock Closed socket connection for client /127.0.0.1:43356 which had sessionid 0x13d5480e4860001
[junit4:junit4]   2> 278 T229 oaz.ZooKeeper.close Session: 0x13d5480e4860001 closed
[junit4:junit4]   2> 338 T229 oejs.Server.doStart jetty-8.1.8.v20121106
[junit4:junit4]   2> 341 T229 oejs.AbstractConnector.doStart Started SelectChannelConnector@127.0.0.1:36166
[junit4:junit4]   2> 341 T229 oass.SolrDispatchFilter.init SolrDispatchFilter.init()
[junit4:junit4]   2> 342 T229 oasc.SolrResourceLoader.locateSolrHome JNDI not configured for solr (NoInitialContextEx)
[junit4:junit4]   2> 342 T229 oasc.SolrResourceLoader.locateSolrHome using system property solr.solr.home: /mnt/ssd/jenkins/workspace/Lucene-Solr-4.x-Linux/solr/build/solr-core/test/J0/./org.apache.solr.cloud.UnloadDistributedZkTest-controljetty-1362922366279
[junit4:junit4]   2> 342 T229 oasc.CoreContainer$Initializer.initialize looking for solr config file: /mnt/ssd/jenkins/workspace/Lucene-Solr-4.x-Linux/solr/build/solr-core/test/J0/./org.apache.solr.cloud.UnloadDistributedZkTest-controljetty-1362922366279/solr.xml
[junit4:junit4]   2> 343 T229 oasc.CoreContainer.<init> New CoreContainer 33310855
[junit4:junit4]   2> 343 T229 oasc.CoreContainer.load Loading CoreContainer using Solr Home: '/mnt/ssd/jenkins/workspace/Lucene-Solr-4.x-Linux/solr/build/solr-core/test/J0/./org.apache.solr.cloud.UnloadDistributedZkTest-controljetty-1362922366279/'
[junit4:junit4]   2> 343 T229 oasc.SolrResourceLoader.<init> new SolrResourceLoader for directory: '/mnt/ssd/jenkins/workspace/Lucene-Solr-4.x-Linux/solr/build/solr-core/test/J0/./org.apache.solr.cloud.UnloadDistributedZkTest-controljetty-1362922366279/'
[junit4:junit4]   2> 361 T229 oashc.HttpShardHandlerFactory.getParameter Setting socketTimeout to: 120000
[junit4:junit4]   2> 361 T229 oashc.HttpShardHandlerFactory.getParameter Setting urlScheme to: http://
[junit4:junit4]   2> 361 T229 oashc.HttpShardHandlerFactory.getParameter Setting connTimeout to: 15000
[junit4:junit4]   2> 362 T229 oashc.HttpShardHandlerFactory.getParameter Setting maxConnectionsPerHost to: 20
[junit4:junit4]   2> 362 T229 oashc.HttpShardHandlerFactory.getParameter Setting corePoolSize to: 0
[junit4:junit4]   2> 362 T229 oashc.HttpShardHandlerFactory.getParameter Setting maximumPoolSize to: 2147483647
[junit4:junit4]   2> 363 T229 oashc.HttpShardHandlerFactory.getParameter Setting maxThreadIdleTime to: 5
[junit4:junit4]   2> 363 T229 oashc.HttpShardHandlerFactory.getParameter Setting sizeOfQueue to: -1
[junit4:junit4]   2> 363 T229 oashc.HttpShardHandlerFactory.getParameter Setting fairnessPolicy to: false
[junit4:junit4]   2> 363 T229 oascsi.HttpClientUtil.createClient Creating new http client, config:maxConnectionsPerHost=20&maxConnections=10000&socketTimeout=120000&connTimeout=15000&retry=false
[junit4:junit4]   2> 371 T229 oasc.CoreContainer.load Registering Log Listener
[junit4:junit4]   2> 383 T229 oasc.CoreContainer.initZooKeeper Zookeeper client=127.0.0.1:46789/solr
[junit4:junit4]   2> 390 T229 oasc.ZkController.checkChrootPath zkHost includes chroot
[junit4:junit4]   2> 391 T229 oaz.ZooKeeper.<init> Initiating client connection, connectString=127.0.0.1:46789 sessionTimeout=60000 watcher=org.apache.solr.common.cloud.ConnectionManager@6b668b
[junit4:junit4]   2> 392 T229 oascc.ConnectionManager.waitForConnected Waiting for client to connect to ZooKeeper
[junit4:junit4]   2> 392 T248 oaz.ClientCnxn$SendThread.logStartConnect Opening socket connection to server localhost.localdomain/127.0.0.1:46789. Will not attempt to authenticate using SASL (access denied ("javax.security.auth.AuthPermission" "getLoginConfiguration"))
[junit4:junit4]   2> 393 T248 oaz.ClientCnxn$SendThread.primeConnection Socket connection established to localhost.localdomain/127.0.0.1:46789, initiating session
[junit4:junit4]   2> 393 T231 oazs.NIOServerCnxnFactory.run Accepted socket connection from /127.0.0.1:43357
[junit4:junit4]   2> 393 T231 oazs.ZooKeeperServer.processConnectRequest Client attempting to establish new session at /127.0.0.1:43357
[junit4:junit4]   2> 394 T233 oazs.ZooKeeperServer.finishSessionInit Established session 0x13d5480e4860002 with negotiated timeout 20000 for client /127.0.0.1:43357
[junit4:junit4]   2> 394 T248 oaz.ClientCnxn$SendThread.onConnected Session establishment complete on server localhost.localdomain/127.0.0.1:46789, sessionid = 0x13d5480e4860002, negotiated timeout = 20000
[junit4:junit4]   2> 394 T249 oascc.ConnectionManager.process Watcher org.apache.solr.common.cloud.ConnectionManager@6b668b name:ZooKeeperConnection Watcher:127.0.0.1:46789 got event WatchedEvent state:SyncConnected type:None path:null path:null type:None
[junit4:junit4]   2> 395 T229 oascc.ConnectionManager.waitForConnected Client is connected to ZooKeeper
[junit4:junit4]   2> 396 T234 oazs.PrepRequestProcessor.pRequest2Txn Processed session termination for sessionid: 0x13d5480e4860002
[junit4:junit4]   2> 397 T249 oaz.ClientCnxn$EventThread.run EventThread shut down
[junit4:junit4]   2> 397 T231 oazs.NIOServerCnxn.closeSock Closed socket connection for client /127.0.0.1:43357 which had sessionid 0x13d5480e4860002
[junit4:junit4]   2> 397 T229 oaz.ZooKeeper.close Session: 0x13d5480e4860002 closed
[junit4:junit4]   2> 399 T229 oascsi.HttpClientUtil.createClient Creating new http client, config:maxConnections=500&maxConnectionsPerHost=16&socketTimeout=120000&connTimeout=15000
[junit4:junit4]   2> 402 T229 oaz.ZooKeeper.<init> Initiating client connection, connectString=127.0.0.1:46789/solr sessionTimeout=30000 watcher=org.apache.solr.common.cloud.ConnectionManager@18ce359
[junit4:junit4]   2> 403 T229 oascc.ConnectionManager.waitForConnected Waiting for client to connect to ZooKeeper
[junit4:junit4]   2> 403 T250 oaz.ClientCnxn$SendThread.logStartConnect Opening socket connection to server localhost.localdomain/127.0.0.1:46789. Will not attempt to authenticate using SASL (access denied ("javax.security.auth.AuthPermission" "getLoginConfiguration"))
[junit4:junit4]   2> 404 T250 oaz.ClientCnxn$SendThread.primeConnection Socket connection established to localhost.localdomain/127.0.0.1:46789, initiating session
[junit4:junit4]   2> 404 T231 oazs.NIOServerCnxnFactory.run Accepted socket connection from /127.0.0.1:43358
[junit4:junit4]   2> 404 T231 oazs.ZooKeeperServer.processConnectRequest Client attempting to establish new session at /127.0.0.1:43358
[junit4:junit4]   2> 405 T233 oazs.ZooKeeperServer.finishSessionInit Established session 0x13d5480e4860003 with negotiated timeout 20000 for client /127.0.0.1:43358
[junit4:junit4]   2> 405 T250 oaz.ClientCnxn$SendThread.onConnected Session establishment complete on server localhost.localdomain/127.0.0.1:46789, sessionid = 0x13d5480e4860003, negotiated timeout = 20000
[junit4:junit4]   2> 405 T251 oascc.ConnectionManager.process Watcher org.apache.solr.common.cloud.ConnectionManager@18ce359 name:ZooKeeperConnection Watcher:127.0.0.1:46789/solr got event WatchedEvent state:SyncConnected type:None path:null path:null type:None
[junit4:junit4]   2> 406 T229 oascc.ConnectionManager.waitForConnected Client is connected to ZooKeeper
[junit4:junit4]   2> 412 T234 oazs.PrepRequestProcessor.pRequest Got user-level KeeperException when processing sessionid:0x13d5480e4860003 type:create cxid:0x2 zxid:0x1a txntype:-1 reqpath:n/a Error Path:/solr/overseer Error:KeeperErrorCode = NodeExists for /solr/overseer
[junit4:junit4]   2> 417 T229 oascc.SolrZkClient.makePath makePath: /live_nodes
[junit4:junit4]   2> 420 T229 oasc.ZkController.createEphemeralLiveNode Register node as live in ZooKeeper:/live_nodes/127.0.0.1:36166_ks
[junit4:junit4]   2> 422 T234 oazs.PrepRequestProcessor.pRequest Got user-level KeeperException when processing sessionid:0x13d5480e4860003 type:delete cxid:0x8 zxid:0x1c txntype:-1 reqpath:n/a Error Path:/solr/live_nodes/127.0.0.1:36166_ks Error:KeeperErrorCode = NoNode for /solr/live_nodes/127.0.0.1:36166_ks
[junit4:junit4]   2> 423 T229 oascc.SolrZkClient.makePath makePath: /live_nodes/127.0.0.1:36166_ks
[junit4:junit4]   2> 427 T229 oascc.SolrZkClient.makePath makePath: /overseer_elect/election
[junit4:junit4]   2> 436 T234 oazs.PrepRequestProcessor.pRequest Got user-level KeeperException when processing sessionid:0x13d5480e4860003 type:delete cxid:0x16 zxid:0x21 txntype:-1 reqpath:n/a Error Path:/solr/overseer_elect/leader Error:KeeperErrorCode = NoNode for /solr/overseer_elect/leader
[junit4:junit4]   2> 437 T229 oascc.SolrZkClient.makePath makePath: /overseer_elect/leader
[junit4:junit4]   2> 441 T229 oasc.Overseer.start Overseer (id=89320480183812099-127.0.0.1:36166_ks-n_0000000000) starting
[junit4:junit4]   2> 441 T234 oazs.PrepRequestProcessor.pRequest Got user-level KeeperException when processing sessionid:0x13d5480e4860003 type:create cxid:0x1b zxid:0x23 txntype:-1 reqpath:n/a Error Path:/solr/overseer Error:KeeperErrorCode = NodeExists for /solr/overseer
[junit4:junit4]   2> 447 T234 oazs.PrepRequestProcessor.pRequest Got user-level KeeperException when processing sessionid:0x13d5480e4860003 type:create cxid:0x1c zxid:0x24 txntype:-1 reqpath:n/a Error Path:/solr/overseer Error:KeeperErrorCode = NodeExists for /solr/overseer
[junit4:junit4]   2> 448 T234 oazs.PrepRequestProcessor.pRequest Got user-level KeeperException when processing sessionid:0x13d5480e4860003 type:create cxid:0x1d zxid:0x25 txntype:-1 reqpath:n/a Error Path:/solr/overseer Error:KeeperErrorCode = NodeExists for /solr/overseer
[junit4:junit4]   2> 452 T234 oazs.PrepRequestProcessor.pRequest Got user-level KeeperException when processing sessionid:0x13d5480e4860003 type:create cxid:0x1e zxid:0x26 txntype:-1 reqpath:n/a Error Path:/solr/overseer Error:KeeperErrorCode = NodeExists for /solr/overseer
[junit4:junit4]   2> 453 T253 oasc.OverseerCollectionProcessor.run Process current queue of collection creations
[junit4:junit4]   2> 453 T229 oascc.SolrZkClient.makePath makePath: /clusterstate.json
[junit4:junit4]   2> 456 T229 oascc.SolrZkClient.makePath makePath: /aliases.json
[junit4:junit4]   2> 462 T229 oascc.ZkStateReader.createClusterStateWatchersAndUpdate Updating cluster state from ZooKeeper... 
[junit4:junit4]   2> 472 T252 oasc.Overseer$ClusterStateUpdater.run Starting to work on the main queue
[junit4:junit4]   2> 474 T229 oass.SolrDispatchFilter.init user.dir=/mnt/ssd/jenkins/workspace/Lucene-Solr-4.x-Linux/solr/build/solr-core/test/J0
[junit4:junit4]   2> 475 T229 oass.SolrDispatchFilter.init SolrDispatchFilter.init() done
[junit4:junit4]   2> 475 T229 oascsi.HttpClientUtil.createClient Creating new http client, config:maxConnections=128&maxConnectionsPerHost=32&followRedirects=false
[junit4:junit4]   2> 479 T229 oascsi.HttpClientUtil.createClient Creating new http client, config:
[junit4:junit4]   2> 480 T229 oaz.ZooKeeper.<init> Initiating client connection, connectString=127.0.0.1:46789/solr sessionTimeout=10000 watcher=org.apache.solr.common.cloud.ConnectionManager@e574ad
[junit4:junit4]   2> 481 T229 oascc.ConnectionManager.waitForConnected Waiting for client to connect to ZooKeeper
[junit4:junit4]   2> 481 T255 oaz.ClientCnxn$SendThread.logStartConnect Opening socket connection to server localhost.localdomain/127.0.0.1:46789. Will not attempt to authenticate using SASL (access denied ("javax.security.auth.AuthPermission" "getLoginConfiguration"))
[junit4:junit4]   2> 482 T255 oaz.ClientCnxn$SendThread.primeConnection Socket connection established to localhost.localdomain/127.0.0.1:46789, initiating session
[junit4:junit4]   2> 482 T231 oazs.NIOServerCnxnFactory.run Accepted socket connection from /127.0.0.1:43359
[junit4:junit4]   2> 482 T231 oazs.ZooKeeperServer.processConnectRequest Client attempting to establish new session at /127.0.0.1:43359
[junit4:junit4]   2> 483 T233 oazs.ZooKeeperServer.finishSessionInit Established session 0x13d5480e4860004 with negotiated timeout 10000 for client /127.0.0.1:43359
[junit4:junit4]   2> 483 T255 oaz.ClientCnxn$SendThread.onConnected Session establishment complete on server localhost.localdomain/127.0.0.1:46789, sessionid = 0x13d5480e4860004, negotiated timeout = 10000
[junit4:junit4]   2> 483 T256 oascc.ConnectionManager.process Watcher org.apache.solr.common.cloud.ConnectionManager@e574ad name:ZooKeeperConnection Watcher:127.0.0.1:46789/solr got event WatchedEvent state:SyncConnected type:None path:null path:null type:None
[junit4:junit4]   2> 483 T229 oascc.ConnectionManager.waitForConnected Client is connected to ZooKeeper
[junit4:junit4]   2> 485 T229 oascc.ZkStateReader.createClusterStateWatchersAndUpdate Updating cluster state from ZooKeeper... 
[junit4:junit4]   2> 489 T229 oasc.ChaosMonkey.monkeyLog monkey: init - expire sessions:true cause connection loss:true
[junit4:junit4]   2> 547 T229 oejs.Server.doStart jetty-8.1.8.v20121106
[junit4:junit4]   2> 549 T229 oejs.AbstractConnector.doStart Started SelectChannelConnector@127.0.0.1:54352
[junit4:junit4]   2> 550 T229 oass.SolrDispatchFilter.init SolrDispatchFilter.init()
[junit4:junit4]   2> 550 T229 oasc.SolrResourceLoader.locateSolrHome JNDI not configured for solr (NoInitialContextEx)
[junit4:junit4]   2> 550 T229 oasc.SolrResourceLoader.locateSolrHome using system property solr.solr.home: /mnt/ssd/jenkins/workspace/Lucene-Solr-4.x-Linux/solr/build/solr-core/test/J0/./org.apache.solr.cloud.UnloadDistributedZkTest-jetty1-1362922366490
[junit4:junit4]   2> 550 T229 oasc.CoreContainer$Initializer.initialize looking for solr config file: /mnt/ssd/jenkins/workspace/Lucene-Solr-4.x-Linux/solr/build/solr-core/test/J0/./org.apache.solr.cloud.UnloadDistributedZkTest-jetty1-1362922366490/solr.xml
[junit4:junit4]   2> 551 T229 oasc.CoreContainer.<init> New CoreContainer 6586480
[junit4:junit4]   2> 551 T229 oasc.CoreContainer.load Loading CoreContainer using Solr Home: '/mnt/ssd/jenkins/workspace/Lucene-Solr-4.x-Linux/solr/build/solr-core/test/J0/./org.apache.solr.cloud.UnloadDistributedZkTest-jetty1-1362922366490/'
[junit4:junit4]   2> 551 T229 oasc.SolrResourceLoader.<init> new SolrResourceLoader for directory: '/mnt/ssd/jenkins/workspace/Lucene-Solr-4.x-Linux/solr/build/solr-core/test/J0/./org.apache.solr.cloud.UnloadDistributedZkTest-jetty1-1362922366490/'
[junit4:junit4]   2> 569 T229 oashc.HttpShardHandlerFactory.getParameter Setting socketTimeout to: 120000
[junit4:junit4]   2> 569 T229 oashc.HttpShardHandlerFactory.getParameter Setting urlScheme to: http://
[junit4:junit4]   2> 569 T229 oashc.HttpShardHandlerFactory.getParameter Setting connTimeout to: 15000
[junit4:junit4]   2> 570 T229 oashc.HttpShardHandlerFactory.getParameter Setting maxConnectionsPerHost to: 20
[junit4:junit4]   2> 570 T229 oashc.HttpShardHandlerFactory.getParameter Setting corePoolSize to: 0
[junit4:junit4]   2> 570 T229 oashc.HttpShardHandlerFactory.getParameter Setting maximumPoolSize to: 2147483647
[junit4:junit4]   2> 571 T229 oashc.HttpShardHandlerFactory.getParameter Setting maxThreadIdleTime to: 5
[junit4:junit4]   2> 571 T229 oashc.HttpShardHandlerFactory.getParameter Setting sizeOfQueue to: -1
[junit4:junit4]   2> 571 T229 oashc.HttpShardHandlerFactory.getParameter Setting fairnessPolicy to: false
[junit4:junit4]   2> 572 T229 oascsi.HttpClientUtil.createClient Creating new http client, config:maxConnectionsPerHost=20&maxConnections=10000&socketTimeout=120000&connTimeout=15000&retry=false
[junit4:junit4]   2> 578 T229 oasc.CoreContainer.load Registering Log Listener
[junit4:junit4]   2> 589 T229 oasc.CoreContainer.initZooKeeper Zookeeper client=127.0.0.1:46789/solr
[junit4:junit4]   2> 590 T229 oasc.ZkController.checkChrootPath zkHost includes chroot
[junit4:junit4]   2> 590 T229 oaz.ZooKeeper.<init> Initiating client connection, connectString=127.0.0.1:46789 sessionTimeout=60000 watcher=org.apache.solr.common.cloud.ConnectionManager@113ff21
[junit4:junit4]   2> 591 T229 oascc.ConnectionManager.waitForConnected Waiting for client to connect to ZooKeeper
[junit4:junit4]   2> 591 T266 oaz.ClientCnxn$SendThread.logStartConnect Opening socket connection to server localhost.localdomain/127.0.0.1:46789. Will not attempt to authenticate using SASL (access denied ("javax.security.auth.AuthPermission" "getLoginConfiguration"))
[junit4:junit4]   2> 592 T266 oaz.ClientCnxn$SendThread.primeConnection Socket connection established to localhost.localdomain/127.0.0.1:46789, initiating session
[junit4:junit4]   2> 592 T231 oazs.NIOServerCnxnFactory.run Accepted socket connection from /127.0.0.1:43360
[junit4:junit4]   2> 592 T231 oazs.ZooKeeperServer.processConnectRequest Client attempting to establish new session at /127.0.0.1:43360
[junit4:junit4]   2> 593 T233 oazs.ZooKeeperServer.finishSessionInit Established session 0x13d5480e4860005 with negotiated timeout 20000 for client /127.0.0.1:43360
[junit4:junit4]   2> 593 T266 oaz.ClientCnxn$SendThread.onConnected Session establishment complete on server localhost.localdomain/127.0.0.1:46789, sessionid = 0x13d5480e4860005, negotiated timeout = 20000
[junit4:junit4]   2> 593 T267 oascc.ConnectionManager.process Watcher org.apache.solr.common.cloud.ConnectionManager@113ff21 name:ZooKeeperConnection Watcher:127.0.0.1:46789 got event WatchedEvent state:SyncConnected type:None path:null path:null type:None
[junit4:junit4]   2> 593 T229 oascc.ConnectionManager.waitForConnected Client is connected to ZooKeeper
[junit4:junit4]   2> 595 T234 oazs.PrepRequestProcessor.pRequest2Txn Processed session termination for sessionid: 0x13d5480e4860005
[junit4:junit4]   2> 596 T231 oazs.NIOServerCnxn.closeSock Closed socket connection for client /127.0.0.1:43360 which had sessionid 0x13d5480e4860005
[junit4:junit4]   2> 596 T267 oaz.ClientCnxn$EventThread.run EventThread shut down
[junit4:junit4]   2> 596 T229 oaz.ZooKeeper.close Session: 0x13d5480e4860005 closed
[junit4:junit4]   2> 596 T229 oascsi.HttpClientUtil.createClient Creating new http client, config:maxConnections=500&maxConnectionsPerHost=16&socketTimeout=120000&connTimeout=15000
[junit4:junit4]   2> 603 T229 oaz.ZooKeeper.<init> Initiating client connection, connectString=127.0.0.1:46789/solr sessionTimeout=30000 watcher=org.apache.solr.common.cloud.ConnectionManager@15cdf5c
[junit4:junit4]   2> 605 T268 oaz.ClientCnxn$SendThread.logStartConnect Opening socket connection to server localhost.localdomain/127.0.0.1:46789. Will not attempt to authenticate using SASL (access denied ("javax.security.auth.AuthPermission" "getLoginConfiguration"))
[junit4:junit4]   2> 605 T229 oascc.ConnectionManager.waitForConnected Waiting for client to connect to ZooKeeper
[junit4:junit4]   2> 606 T268 oaz.ClientCnxn$SendThread.primeConnection Socket connection established to localhost.localdomain/127.0.0.1:46789, initiating session
[junit4:junit4]   2> 606 T231 oazs.NIOServerCnxnFactory.run Accepted socket connection from /127.0.0.1:43361
[junit4:junit4]   2> 606 T231 oazs.ZooKeeperServer.processConnectRequest Client attempting to establish new session at /127.0.0.1:43361
[junit4:junit4]   2> 608 T233 oazs.ZooKeeperServer.finishSessionInit Established session 0x13d5480e4860006 with negotiated timeout 20000 for client /127.0.0.1:43361
[junit4:junit4]   2> 608 T268 oaz.ClientCnxn$SendThread.onConnected Session establishment complete on server localhost.localdomain/127.0.0.1:46789, sessionid = 0x13d5480e4860006, negotiated timeout = 20000
[junit4:junit4]   2> 608 T269 oascc.ConnectionManager.process Watcher org.apache.solr.common.cloud.ConnectionManager@15cdf5c name:ZooKeeperConnection Watcher:127.0.0.1:46789/solr got event WatchedEvent state:SyncConnected type:None path:null path:null type:None
[junit4:junit4]   2> 609 T229 oascc.ConnectionManager.waitForConnected Client is connected to ZooKeeper
[junit4:junit4]   2> 611 T234 oazs.PrepRequestProcessor.pRequest Got user-level KeeperException when processing sessionid:0x13d5480e4860006 type:create cxid:0x1 zxid:0x2e txntype:-1 reqpath:n/a Error Path:/solr/overseer Error:KeeperErrorCode = NodeExists for /solr/overseer
[junit4:junit4]   2> 613 T234 oazs.PrepRequestProcessor.pRequest Got user-level KeeperException when processing sessionid:0x13d5480e4860006 type:create cxid:0x2 zxid:0x2f txntype:-1 reqpath:n/a Error Path:/solr/overseer Error:KeeperErrorCode = NodeExists for /solr/overseer
[junit4:junit4]   2> 617 T229 oascc.ZkStateReader.createClusterStateWatchersAndUpdate Updating cluster state from ZooKeeper... 
[junit4:junit4]   2> 1623 T229 oasc.ZkController.createEphemeralLiveNode Register node as live in ZooKeeper:/live_nodes/127.0.0.1:54352_ks
[junit4:junit4]   2> 1625 T234 oazs.PrepRequestProcessor.pRequest Got user-level KeeperException when processing sessionid:0x13d5480e4860006 type:delete cxid:0xb zxid:0x30 txntype:-1 reqpath:n/a Error Path:/solr/live_nodes/127.0.0.1:54352_ks Error:KeeperErrorCode = NoNode for /solr/live_nodes/127.0.0.1:54352_ks
[junit4:junit4]   2> 1626 T229 oascc.SolrZkClient.makePath makePath: /live_nodes/127.0.0.1:54352_ks
[junit4:junit4]   2> 1635 T256 oascc.ZkStateReader$3.process Updating live nodes... (2)
[junit4:junit4]   2> 1635 T251 oascc.ZkStateReader$3.process Updating live nodes... (2)
[junit4:junit4]   2> 1635 T269 oascc.ZkStateReader$3.process Updating live nodes... (2)
[junit4:junit4]   2> 1648 T229 oass.SolrDispatchFilter.init user.dir=/mnt/ssd/jenkins/workspace/Lucene-Solr-4.x-Linux/solr/build/solr-core/test/J0
[junit4:junit4]   2> 1648 T229 oass.SolrDispatchFilter.init SolrDispatchFilter.init() done
[junit4:junit4]   2> 1649 T229 oascsi.HttpClientUtil.createClient Creating new http client, config:maxConnections=128&maxConnectionsPerHost=32&followRedirects=false
[junit4:junit4]   2> 1719 T229 oejs.Server.doStart jetty-8.1.8.v20121106
[junit4:junit4]   2> 1722 T229 oejs.AbstractConnector.doStart Started SelectChannelConnector@127.0.0.1:34545
[junit4:junit4]   2> 1722 T229 oass.SolrDispatchFilter.init SolrDispatchFilter.init()
[junit4:junit4]   2> 1723 T229 oasc.SolrResourceLoader.locateSolrHome JNDI not configured for solr (NoInitialContextEx)
[junit4:junit4]   2> 1723 T229 oasc.SolrResourceLoader.locateSolrHome using system property solr.solr.home: /mnt/ssd/jenkins/workspace/Lucene-Solr-4.x-Linux/solr/build/solr-core/test/J0/./org.apache.solr.cloud.UnloadDistributedZkTest-jetty2-1362922367656
[junit4:junit4]   2> 1723 T229 oasc.CoreContainer$Initializer.initialize looking for solr config file: /mnt/ssd/jenkins/workspace/Lucene-Solr-4.x-Linux/solr/build/solr-core/test/J0/./org.apache.solr.cloud.UnloadDistributedZkTest-jetty2-1362922367656/solr.xml
[junit4:junit4]   2> 1723 T229 oasc.CoreContainer.<init> New CoreContainer 5122648
[junit4:junit4]   2> 1724 T229 oasc.CoreContainer.load Loading CoreContainer using Solr Home: '/mnt/ssd/jenkins/workspace/Lucene-Solr-4.x-Linux/solr/build/solr-core/test/J0/./org.apache.solr.cloud.UnloadDistributedZkTest-jetty2-1362922367656/'
[junit4:junit4]   2> 1724 T229 oasc.SolrResourceLoader.<init> new SolrResourceLoader for directory: '/mnt/ssd/jenkins/workspace/Lucene-Solr-4.x-Linux/solr/build/solr-core/test/J0/./org.apache.solr.cloud.UnloadDistributedZkTest-jetty2-1362922367656/'
[junit4:junit4]   2> 1746 T229 oashc.HttpShardHandlerFactory.getParameter Setting socketTimeout to: 120000
[junit4:junit4]   2> 1746 T229 oashc.HttpShardHandlerFactory.getParameter Setting urlScheme to: http://
[junit4:junit4]   2> 1746 T229 oashc.HttpShardHandlerFactory.getParameter Setting connTimeout to: 15000
[junit4:junit4]   2> 1747 T229 oashc.HttpShardHandlerFactory.getParameter Setting maxConnectionsPerHost to: 20
[junit4:junit4]   2> 1747 T229 oashc.HttpShardHandlerFactory.getParameter Setting corePoolSize to: 0
[junit4:junit4]   2> 1747 T229 oashc.HttpShardHandlerFactory.getParameter Setting maximumPoolSize to: 2147483647
[junit4:junit4]   2> 1748 T229 oashc.HttpShardHandlerFactory.getParameter Setting maxThreadIdleTime to: 5
[junit4:junit4]   2> 1748 T229 oashc.HttpShardHandlerFactory.getParameter Setting sizeOfQueue to: -1
[junit4:junit4]   2> 1748 T229 oashc.HttpShardHandlerFactory.getParameter Setting fairnessPolicy to: false
[junit4:junit4]   2> 1748 T229 oascsi.HttpClientUtil.createClient Creating new http client, config:maxConnectionsPerHost=20&maxConnections=10000&socketTimeout=120000&connTimeout=15000&retry=false
[junit4:junit4]   2> 1755 T229 oasc.CoreContainer.load Registering Log Listener
[junit4:junit4]   2> 1767 T229 oasc.CoreContainer.initZooKeeper Zookeeper client=127.0.0.1:46789/solr
[junit4:junit4]   2> 1767 T229 oasc.ZkController.checkChrootPath zkHost includes chroot
[junit4:junit4]   2> 1767 T229 oaz.ZooKeeper.<init> Initiating client connection, connectString=127.0.0.1:46789 sessionTimeout=60000 watcher=org.apache.solr.common.cloud.ConnectionManager@1648e80
[junit4:junit4]   2> 1768 T229 oascc.ConnectionManager.waitForConnected Waiting for client to connect to ZooKeeper
[junit4:junit4]   2> 1769 T280 oaz.ClientCnxn$SendThread.logStartConnect Opening socket connection to server localhost.localdomain/127.0.0.1:46789. Will not attempt to authenticate using SASL (access denied ("javax.security.auth.AuthPermission" "getLoginConfiguration"))
[junit4:junit4]   2> 1770 T280 oaz.ClientCnxn$SendThread.primeConnection Socket connection established to localhost.localdomain/127.0.0.1:46789, initiating session
[junit4:junit4]   2> 1770 T231 oazs.NIOServerCnxnFactory.run Accepted socket connection from /127.0.0.1:43362
[junit4:junit4]   2> 1771 T231 oazs.ZooKeeperServer.processConnectRequest Client attempting to establish new session at /127.0.0.1:43362
[junit4:junit4]   2> 1772 T233 oazs.ZooKeeperServer.finishSessionInit Established session 0x13d5480e4860007 with negotiated timeout 20000 for client /127.0.0.1:43362
[junit4:junit4]   2> 1772 T280 oaz.ClientCnxn$SendThread.onConnected Session establishment complete on server localhost.localdomain/127.0.0.1:46789, sessionid = 0x13d5480e4860007, negotiated timeout = 20000
[junit4:junit4]   2> 1773 T281 oascc.ConnectionManager.process Watcher org.apache.solr.common.cloud.ConnectionManager@1648e80 name:ZooKeeperConnection Watcher:127.0.0.1:46789 got event WatchedEvent state:SyncConnected type:None path:null path:null type:None
[junit4:junit4]   2> 1773 T229 oascc.ConnectionManager.waitForConnected Client is connected to ZooKeeper
[junit4:junit4]   2> 1775 T234 oazs.PrepRequestProcessor.pRequest2Txn Processed session termination for sessionid: 0x13d5480e4860007
[junit4:junit4]   2> 1777 T231 oazs.NIOServerCnxn.closeSock Closed socket connection for client /127.0.0.1:43362 which had sessionid 0x13d5480e4860007
[junit4:junit4]   2> 1777 T281 oaz.ClientCnxn$EventThread.run EventThread shut down
[junit4:junit4]   2> 1777 T229 oaz.ZooKeeper.close Session: 0x13d5480e4860007 closed
[junit4:junit4]   2> 1778 T229 oascsi.HttpClientUtil.createClient Creating new http client, config:maxConnections=500&maxConnectionsPerHost=16&socketTimeout=120000&connTimeout=15000
[junit4:junit4]   2> 1781 T229 oaz.ZooKeeper.<init> Initiating client connection, connectString=127.0.0.1:46789/solr sessionTimeout=30000 watcher=org.apache.solr.common.cloud.ConnectionManager@187d092
[junit4:junit4]   2> 1782 T282 oaz.ClientCnxn$SendThread.logStartConnect Opening socket connection to server localhost.localdomain/127.0.0.1:46789. Will not attempt to authenticate using SASL (access denied ("javax.security.auth.AuthPermission" "getLoginConfiguration"))
[junit4:junit4]   2> 1782 T229 oascc.ConnectionManager.waitForConnected Waiting for client to connect to ZooKeeper
[junit4:junit4]   2> 1783 T282 oaz.ClientCnxn$SendThread.primeConnection Socket connection established to localhost.localdomain/127.0.0.1:46789, initiating session
[junit4:junit4]   2> 1783 T231 oazs.NIOServerCnxnFactory.run Accepted socket connection from /127.0.0.1:43363
[junit4:junit4]   2> 1783 T231 oazs.ZooKeeperServer.processConnectRequest Client attempting to establish new session at /127.0.0.1:43363
[junit4:junit4]   2> 1785 T233 oazs.ZooKeeperServer.finishSessionInit Established session 0x13d5480e4860008 with negotiated timeout 20000 for client /127.0.0.1:43363
[junit4:junit4]   2> 1785 T282 oaz.ClientCnxn$SendThread.onConnected Session establishment complete on server localhost.localdomain/127.0.0.1:46789, sessionid = 0x13d5480e4860008, negotiated timeout = 20000
[junit4:junit4]   2> 1785 T283 oascc.ConnectionManager.process Watcher org.apache.solr.common.cloud.ConnectionManager@187d092 name:ZooKeeperConnection Watcher:127.0.0.1:46789/solr got event WatchedEvent state:SyncConnected type:None path:null path:null type:None
[junit4:junit4]   2> 1786 T229 oascc.ConnectionManager.waitForConnected Client is connected to ZooKeeper
[junit4:junit4]   2> 1787 T234 oazs.PrepRequestProcessor.pRequest Got user-level KeeperException when processing sessionid:0x13d5480e4860008 type:create cxid:0x1 zxid:0x36 txntype:-1 reqpath:n/a Error Path:/solr/overseer Error:KeeperErrorCode = NodeExists for /solr/overseer
[junit4:junit4]   2> 1789 T234 oazs.PrepRequestProcessor.pRequest Got user-level KeeperException when processing sessionid:0x13d5480e4860008 type:create cxid:0x2 zxid:0x37 txntype:-1 reqpath:n/a Error Path:/solr/overseer Error:KeeperErrorCode = NodeExists for /solr/overseer
[junit4:junit4]   2> 1792 T229 oascc.ZkStateReader.createClusterStateWatchersAndUpdate Updating cluster state from ZooKeeper... 
[junit4:junit4]   2> 2798 T229 oasc.ZkController.createEphemeralLiveNode Register node as live in ZooKeeper:/live_nodes/127.0.0.1:34545_ks
[junit4:junit4]   2> 2800 T234 oazs.PrepRequestProcessor.pRequest Got user-level KeeperException when processing sessionid:0x13d5480e4860008 type:delete cxid:0xb zxid:0x38 txntype:-1 reqpath:n/a Error Path:/solr/live_nodes/127.0.0.1:34545_ks Error:KeeperErrorCode = NoNode for /solr/live_nodes/127.0.0.1:34545_ks
[junit4:junit4]   2> 2801 T229 oascc.SolrZkClient.makePath makePath: /live_nodes/127.0.0.1:34545_ks
[junit4:junit4]   2> 2807 T251 oascc.ZkStateReader$3.process Updating live nodes... (3)
[junit4:junit4]   2> 2807 T256 oascc.ZkStateReader$3.process Updating live nodes... (3)
[junit4:junit4]   2> 2808 T283 oascc.ZkStateReader$3.process Updating live nodes... (3)
[junit4:junit4]   2> 2808 T269 oascc.ZkStateReader$3.process Updating live nodes... (3)
[junit4:junit4]   2> 2817 T229 oass.SolrDispatchFilter.init user.dir=/mnt/ssd/jenkins/workspace/Lucene-Solr-4.x-Linux/solr/build/solr-core/test/J0
[junit4:junit4]   2> 2818 T229 oass.SolrDispatchFilter.init SolrDispatchFilter.init() done
[junit4:junit4]   2> 2819 T229 oascsi.HttpClientUtil.createClient Creating new http client, config:maxConnections=128&maxConnectionsPerHost=32&followRedirects=false
[junit4:junit4]   2> 2884 T229 oejs.Server.doStart jetty-8.1.8.v20121106
[junit4:junit4]   2> 2887 T229 oejs.AbstractConnector.doStart Started SelectChannelConnector@127.0.0.1:40211
[junit4:junit4]   2> 2888 T229 oass.SolrDispatchFilter.init SolrDispatchFilter.init()
[junit4:junit4]   2> 2888 T229 oasc.SolrResourceLoader.locateSolrHome JNDI not configured for solr (NoInitialContextEx)
[junit4:junit4]   2> 2888 T229 oasc.SolrResourceLoader.locateSolrHome using system property solr.solr.home: /mnt/ssd/jenkins/workspace/Lucene-Solr-4.x-Linux/solr/build/solr-core/test/J0/./org.apache.solr.cloud.UnloadDistributedZkTest-jetty3-1362922368825
[junit4:junit4]   2> 2889 T229 oasc.CoreContainer$Initializer.initialize looking for solr config file: /mnt/ssd/jenkins/workspace/Lucene-Solr-4.x-Linux/solr/build/solr-core/test/J0/./org.apache.solr.cloud.UnloadDistributedZkTest-jetty3-1362922368825/solr.xml
[junit4:junit4]   2> 2889 T229 oasc.CoreContainer.<init> New CoreContainer 17050135
[junit4:junit4]   2> 2890 T229 oasc.CoreContainer.load Loading CoreContainer using Solr Home: '/mnt/ssd/jenkins/workspace/Lucene-Solr-4.x-Linux/solr/build/solr-core/test/J0/./org.apache.solr.cloud.UnloadDistributedZkTest-jetty3-1362922368825/'
[junit4:junit4]   2> 2891 T229 oasc.SolrResourceLoader.<init> new SolrResourceLoader for directory: '/mnt/ssd/jenkins/workspace/Lucene-Solr-4.x-Linux/solr/build/solr-core/test/J0/./org.apache.solr.cloud.UnloadDistributedZkTest-jetty3-1362922368825/'
[junit4:junit4]   2> 2920 T229 oashc.HttpShardHandlerFactory.getParameter Setting socketTimeout to: 120000
[junit4:junit4]   2> 2920 T229 oashc.HttpShardHandlerFactory.getParameter Setting urlScheme to: http://
[junit4:junit4]   2> 2920 T229 oashc.HttpShardHandlerFactory.getParameter Setting connTimeout to: 15000
[junit4:junit4]   2> 2920 T229 oashc.HttpShardHandlerFactory.getParameter Setting maxConnectionsPerHost to: 20
[junit4:junit4]   2> 2921 T229 oashc.HttpShardHandlerFactory.getParameter Setting corePoolSize to: 0
[junit4:junit4]   2> 2921 T229 oashc.HttpShardHandlerFactory.getParameter Setting maximumPoolSize to: 2147483647
[junit4:junit4]   2> 2921 T229 oashc.HttpShardHandlerFactory.getParameter Setting maxThreadIdleTime to: 5
[junit4:junit4]   2> 2922 T229 oashc.HttpShardHandlerFactory.getParameter Setting sizeOfQueue to: -1
[junit4:junit4]   2> 2922 T229 oashc.HttpShardHandlerFactory.getParameter Setting fairnessPolicy to: false
[junit4:junit4]   2> 2922 T229 oascsi.HttpClientUtil.createClient Creating new http client, config:maxConnectionsPerHost=20&maxConnections=10000&socketTimeout=120000&connTimeout=15000&retry=false
[junit4:junit4]   2> 2929 T229 oasc.CoreContainer.load Registering Log Listener
[junit4:junit4]   2> 2939 T229 oasc.CoreContainer.initZooKeeper Zookeeper client=127.0.0.1:46789/solr
[junit4:junit4]   2> 2940 T229 oasc.ZkController.checkChrootPath zkHost includes chroot
[junit4:junit4]   2> 2940 T229 oaz.ZooKeeper.<init> Initiating client connection, connectString=127.0.0.1:46789 sessionTimeout=60000 watcher=org.apache.solr.common.cloud.ConnectionManager@16b486f
[junit4:junit4]   2> 2941 T229 oascc.ConnectionManager.waitForConnected Waiting for client to connect to ZooKeeper
[junit4:junit4]   2> 2941 T294 oaz.ClientCnxn$SendThread.logStartConnect Opening socket connection to server localhost.localdomain/127.0.0.1:46789. Will not attempt to authenticate using SASL (access denied ("javax.security.auth.AuthPermission" "getLoginConfiguration"))
[junit4:junit4]   2> 2942 T294 oaz.ClientCnxn$SendThread.primeConnection Socket connection established to localhost.localdomain/127.0.0.1:46789, initiating session
[junit4:junit4]   2> 2942 T231 oazs.NIOServerCnxnFactory.run Accepted socket connection from /127.0.0.1:43364
[junit4:junit4]   2> 2942 T231 oazs.ZooKeeperServer.processConnectRequest Client attempting to establish new session at /127.0.0.1:43364
[junit4:junit4]   2> 2943 T233 oazs.ZooKeeperServer.finishSessionInit Established session 0x13d5480e4860009 with negotiated timeout 20000 for client /127.0.0.1:43364
[junit4:junit4]   2> 2943 T294 oaz.ClientCnxn$SendThread.onConnected Session establishment complete on server localhost.localdomain/127.0.0.1:46789, sessionid = 0x13d5480e4860009, negotiated timeout = 20000
[junit4:junit4]   2> 2944 T295 oascc.ConnectionManager.process Watcher org.apache.solr.common.cloud.ConnectionManager@16b486f name:ZooKeeperConnection Watcher:127.0.0.1:46789 got event WatchedEvent state:SyncConnected type:None path:null path:null type:None
[junit4:junit4]   2> 2944 T229 oascc.ConnectionManager.waitForConnected Client is connected to ZooKeeper
[junit4:junit4]   2> 2946 T234 oazs.PrepRequestProcessor.pRequest2Txn Processed session termination for sessionid: 0x13d5480e4860009
[junit4:junit4]   2> 2947 T231 oazs.NIOServerCnxn.closeSock Closed socket connection for client /127.0.0.1:43364 which had sessionid 0x13d5480e4860009
[junit4:junit4]   2> 2947 T295 oaz.ClientCnxn$EventThread.run EventThread shut down
[junit4:junit4]   2> 2947 T229 oaz.ZooKeeper.close Session: 0x13d5480e4860009 closed
[junit4:junit4]   2> 2948 T229 oascsi.HttpClientUtil.createClient Creating new http client, config:maxConnections=500&maxConnectionsPerHost=16&socketTimeout=120000&connTimeout=15000
[junit4:junit4]   2> 2951 T229 oaz.ZooKeeper.<init> Initiating client connection, connectString=127.0.0.1:46789/solr sessionTimeout=30000 watcher=org.apache.solr.common.cloud.ConnectionManager@168b510
[junit4:junit4]   2> 2951 T229 oascc.ConnectionManager.waitForConnected Waiting for client to connect to ZooKeeper
[junit4:junit4]   2> 2952 T296 oaz.ClientCnxn$SendThread.logStartConnect Opening socket connection to server localhost.localdomain/127.0.0.1:46789. Will not attempt to authenticate using SASL (access denied ("javax.security.auth.AuthPermission" "getLoginConfiguration"))
[junit4:junit4]   2> 2952 T296 oaz.ClientCnxn$SendThread.primeConnection Socket connection established to localhost.localdomain/127.0.0.1:46789, initiating session
[junit4:junit4]   2> 2952 T231 oazs.NIOServerCnxnFactory.run Accepted socket connection from /127.0.0.1:43365
[junit4:junit4]   2> 2953 T231 oazs.ZooKeeperServer.processConnectRequest Client attempting to establish new session at /127.0.0.1:43365
[junit4:junit4]   2> 2953 T233 oazs.ZooKeeperServer.finishSessionInit Established session 0x13d5480e486000a with negotiated timeout 20000 for client /127.0.0.1:43365
[junit4:junit4]   2> 2953 T296 oaz.ClientCnxn$SendThread.onConnected Session establishment complete on server localhost.localdomain/127.0.0.1:46789, sessionid = 0x13d5480e486000a, negotiated timeout = 20000
[junit4:junit4]   2> 2954 T297 oascc.ConnectionManager.process Watcher org.apache.solr.common.cloud.ConnectionManager@168b510 name:ZooKeeperConnection Watcher:127.0.0.1:46789/solr got event WatchedEvent state:SyncConnected type:None path:null path:null type:None
[junit4:junit4]   2> 2954 T229 oascc.ConnectionManager.waitForConnected Client is connected to ZooKeeper
[junit4:junit4]   2> 2956 T234 oazs.PrepRequestProcessor.pRequest Got user-level KeeperException when processing sessionid:0x13d5480e486000a type:create cxid:0x1 zxid:0x3e txntype:-1 reqpath:n/a Error Path:/solr/overseer Error:KeeperErrorCode = NodeExists for /solr/overseer
[junit4:junit4]   2> 2957 T234 oazs.PrepRequestProcessor.pRequest Got user-level KeeperException when processing sessionid:0x13d5480e486000a type:create cxid:0x2 zxid:0x3f txntype:-1 reqpath:n/a Error Path:/solr/overseer Error:KeeperErrorCode = NodeExists for /solr/overseer
[junit4:junit4]   2> 2961 T229 oascc.ZkStateReader.createClusterStateWatchersAndUpdate Updating cluster state from ZooKeeper... 
[junit4:junit4]   2> 3966 T229 oasc.ZkController.createEphemeralLiveNode Register node as live in ZooKeeper:/live_nodes/127.0.0.1:40211_ks
[junit4:junit4]   2> 3967 T234 oazs.PrepRequestProcessor.pRequest Got user-level KeeperException when processing sessionid:0x13d5480e486000a type:delete cxid:0xb zxid:0x40 txntype:-1 reqpath:n/a Error Path:/solr/live_nodes/127.0.0.1:40211_ks Error:KeeperErrorCode = NoNode for /solr/live_nodes/127.0.0.1:40211_ks
[junit4:junit4]   2> 3969 T229 oascc.SolrZkClient.makePath makePath: /live_nodes/127.0.0.1:40211_ks
[junit4:junit4]   2> 3975 T269 oascc.ZkStateReader$3.process Updating live nodes... (4)
[junit4:junit4]   2> 3976 T283 oascc.ZkStateReader$3.process Updating live nodes... (4)
[junit4:junit4]   2> 3976 T251 oascc.ZkStateReader$3.process Updating live nodes... (4)
[junit4:junit4]   2> 3976 T297 oascc.ZkStateReader$3.process Updating live nodes... (4)
[junit4:junit4]   2> 3976 T256 oascc.ZkStateReader$3.process Updating live nodes... (4)
[junit4:junit4]   2> 3986 T229 oass.SolrDispatchFilter.init user.dir=/mnt/ssd/jenkins/workspace/Lucene-Solr-4.x-Linux/solr/build/solr-core/test/J0
[junit4:junit4]   2> 3987 T229 oass.SolrDispatchFilter.init SolrDispatchFilter.init() done
[junit4:junit4]   2> 3988 T229 oascsi.HttpClientUtil.createClient Creating new http client, config:maxConnections=128&maxConnectionsPerHost=32&followRedirects=false
[junit4:junit4]   2> 4058 T229 oejs.Server.doStart jetty-8.1.8.v20121106
[junit4:junit4]   2> 4061 T229 oejs.AbstractConnector.doStart Started SelectChannelConnector@127.0.0.1:34590
[junit4:junit4]   2> 4061 T229 oass.SolrDispatchFilter.init SolrDispatchFilter.init()
[junit4:junit4]   2> 4062 T229 oasc.SolrResourceLoader.locateSolrHome JNDI not configured for solr (NoInitialContextEx)
[junit4:junit4]   2> 4062 T229 oasc.SolrResourceLoader.locateSolrHome using system property solr.solr.home: /mnt/ssd/jenkins/workspace/Lucene-Solr-4.x-Linux/solr/build/solr-core/test/J0/./org.apache.solr.cloud.UnloadDistributedZkTest-jetty4-1362922369994
[junit4:junit4]   2> 4062 T229 oasc.CoreContainer$Initializer.initialize looking for solr config file: /mnt/ssd/jenkins/workspace/Lucene-Solr-4.x-Linux/solr/build/solr-core/test/J0/./org.apache.solr.cloud.UnloadDistributedZkTest-jetty4-1362922369994/solr.xml
[junit4:junit4]   2> 4063 T229 oasc.CoreContainer.<init> New CoreContainer 9401826
[junit4:junit4]   2> 4063 T229 oasc.CoreContainer.load Loading CoreContainer using Solr Home: '/mnt/ssd/jenkins/workspace/Lucene-Solr-4.x-Linux/solr/build/solr-core/test/J0/./org.apache.solr.cloud.UnloadDistributedZkTest-jetty4-1362922369994/'
[junit4:junit4]   2> 4063 T229 oasc.SolrResourceLoader.<init> new SolrResourceLoader for directory: '/mnt/ssd/jenkins/workspace/Lucene-Solr-4.x-Linux/solr/build/solr-core/test/J0/./org.apache.solr.cloud.UnloadDistributedZkTest-jetty4-1362922369994/'
[junit4:junit4]   2> 4079 T229 oashc.HttpShardHandlerFactory.getParameter Setting socketTimeout to: 120000
[junit4:junit4]   2> 4080 T229 oashc.HttpShardHandlerFactory.getParameter Setting urlScheme to: http://
[junit4:junit4]   2> 4080 T229 oashc.HttpShardHandlerFactory.getParameter Setting connTimeout to: 15000
[junit4:junit4]   2> 4080 T229 oashc.HttpShardHandlerFactory.getParameter Setting maxConnectionsPerHost to: 20
[junit4:junit4]   2> 4081 T229 oashc.HttpShardHandlerFactory.getParameter Setting corePoolSize to: 0
[junit4:junit4]   2> 4081 T229 oashc.HttpShardHandlerFactory.getParameter Setting maximumPoolSize to: 2147483647
[junit4:junit4]   2> 4081 T229 oashc.HttpShardHandlerFactory.getParameter Setting maxThreadIdleTime to: 5
[junit4:junit4]   2> 4081 T229 oashc.HttpShardHandlerFactory.getParameter Setting sizeOfQueue to: -1
[junit4:junit4]   2> 4082 T229 oashc.HttpShardHandlerFactory.getParameter Setting fairnessPolicy to: false
[junit4:junit4]   2> 4082 T229 oascsi.HttpClientUtil.createClient Creating new http client, config:maxConnectionsPerHost=20&maxConnections=10000&socketTimeout=120000&connTimeout=15000&retry=false
[junit4:junit4]   2> 4088 T229 oasc.CoreContainer.load Registering Log Listener
[junit4:junit4]   2> 4098 T229 oasc.CoreContainer.initZooKeeper Zookeeper client=127.0.0.1:46789/solr
[junit4:junit4]   2> 4099 T229 oasc.ZkController.checkChrootPath zkHost includes chroot
[junit4:junit4]   2> 4099 T229 oaz.ZooKeeper.<init> Initiating client connection, connectString=127.0.0.1:46789 sessionTimeout=60000 watcher=org.apache.solr.common.cloud.ConnectionManager@38466
[junit4:junit4]   2> 4100 T229 oascc.ConnectionManager.waitForConnected Waiting for client to connect to ZooKeeper
[junit4:junit4]   2> 4100 T308 oaz.ClientCnxn$SendThread.logStartConnect Opening socket connection to server localhost.localdomain/127.0.0.1:46789. Will not attempt to authenticate using SASL (access denied ("javax.security.auth.AuthPermission" "getLoginConfiguration"))
[junit4:junit4]   2> 4101 T308 oaz.ClientCnxn$SendThread.primeConnection Socket connection established to localhost.localdomain/127.0.0.1:46789, initiating session
[junit4:junit4]   2> 4101 T231 oazs.NIOServerCnxnFactory.run Accepted socket connection from /127.0.0.1:43368
[junit4:junit4]   2> 4102 T231 oazs.ZooKeeperServer.processConnectRequest Client attempting to establish new session at /127.0.0.1:43368
[junit4:junit4]   2> 4103 T233 oazs.ZooKeeperServer.finishSessionInit Established session 0x13d5480e486000b with negotiated timeout 20000 for client /127.0.0.1:43368
[junit4:junit4]   2> 4103 T308 oaz.ClientCnxn$SendThread.onConnected Session establishment complete on server localhost.localdomain/127.0.0.1:46789, sessionid = 0x13d5480e486000b, negotiated timeout = 20000
[junit4:junit4]   2> 4103 T309 oascc.ConnectionManager.process Watcher org.apache.solr.common.cloud.ConnectionManager@38466 name:ZooKeeperConnection Watcher:127.0.0.1:46789 got event WatchedEvent state:SyncConnected type:None path:null path:null type:None
[junit4:junit4]   2> 4104 T229 oascc.ConnectionManager.waitForConnected Client is connected to ZooKeeper
[junit4:junit4]   2> 4106 T234 oazs.PrepRequestProcessor.pRequest2Txn Processed session termination for sessionid: 0x13d5480e486000b
[junit4:junit4]   2> 4106 T231 oazs.NIOServerCnxn.closeSock Closed socket connection for client /127.0.0.1:43368 which had sessionid 0x13d5480e486000b
[junit4:junit4]   2> 4106 T309 oaz.ClientCnxn$EventThread.run EventThread shut down
[junit4:junit4]   2> 4106 T229 oaz.ZooKeeper.close Session: 0x13d5480e486000b closed
[junit4:junit4]   2> 4107 T229 oascsi.HttpClientUtil.createClient Creating new http client, config:maxConnections=500&maxConnectionsPerHost=16&socketTimeout=120000&connTimeout=15000
[junit4:junit4]   2> 4110 T229 oaz.ZooKeeper.<init> Initiating client connection, connectString=127.0.0.1:46789/solr sessionTimeout=30000 watcher=org.apache.solr.common.cloud.ConnectionManager@50aef0
[junit4:junit4]   2> 4111 T229 oascc.ConnectionManager.waitForConnected Waiting for client to connect to ZooKeeper
[junit4:junit4]   2> 4111 T310 oaz.ClientCnxn$SendThread.logStartConnect Opening socket connection to server localhost.localdomain/127.0.0.1:46789. Will not attempt to authenticate using SASL (access denied ("javax.security.auth.AuthPermission" "getLoginConfiguration"))
[junit4:junit4]   2> 4111 T310 oaz.ClientCnxn$SendThread.primeConnection Socket connection established to localhost.localdomain/127.0.0.1:46789, initiating session
[junit4:junit4]   2> 4112 T231 oazs.NIOServerCnxnFactory.run Accepted socket connection from /127.0.0.1:43369
[junit4:junit4]   2> 4112 T231 oazs.ZooKeeperServer.processConnectRequest Client attempting to establish new session at /127.0.0.1:43369
[junit4:junit4]   2> 4113 T233 oazs.ZooKeeperServer.finishSessionInit Established session 0x13d5480e486000c with negotiated timeout 20000 for client /127.0.0.1:43369
[junit4:junit4]   2> 4113 T310 oaz.ClientCnxn$SendThread.onConnected Session establishment complete on server localhost.localdomain/127.0.0.1:46789, sessionid = 0x13d5480e486000c, negotiated timeout = 20000
[junit4:junit4]   2> 4113 T311 oascc.ConnectionManager.process Watcher org.apache.solr.common.cloud.ConnectionManager@50aef0 name:ZooKeeperConnection Watcher:127.0.0.1:46789/solr got event WatchedEvent state:SyncConnected type:None path:null path:null type:None
[junit4:junit4]   2> 4114 T229 oascc.ConnectionManager.waitForConnected Client is connected to ZooKeeper
[junit4:junit4]   2> 4116 T234 oazs.PrepRequestProcessor.pRequest Got user-level KeeperException when processing sessionid:0x13d5480e486000c type:create cxid:0x1 zxid:0x46 txntype:-1 reqpath:n/a Error Path:/solr/overseer Error:KeeperErrorCode = NodeExists for /solr/overseer
[junit4:junit4]   2> 4118 T234 oazs.PrepRequestProcessor.pRequest Got user-level KeeperException when processing sessionid:0x13d5480e486000c type:create cxid:0x2 zxid:0x47 txntype:-1 reqpath:n/a Error Path:/solr/overseer Error:KeeperErrorCode = NodeExists for /solr/overseer
[junit4:junit4]   2> 4121 T229 oascc.ZkStateReader.createClusterStateWatchersAndUpdate Updating cluster state from ZooKeeper... 
[junit4:junit4]   2> 5127 T229 oasc.ZkController.createEphemeralLiveNode Register node as live in ZooKeeper:/live_nodes/127.0.0.1:34590_ks
[junit4:junit4]   2> 5129 T234 oazs.PrepRequestProcessor.pRequest Got user-level KeeperException when processing sessionid:0x13d5480e486000c type:delete cxid:0xb zxid:0x48 txntype:-1 reqpath:n/a Error Path:/solr/live_nodes/127.0.0.1:34590_ks Error:KeeperErrorCode = NoNode for /solr/live_nodes/127.0.0.1:34590_ks
[junit4:junit4]   2> 5130 T229 oascc.SolrZkClient.makePath makePath: /live_nodes/127.0.0.1:34590_ks
[junit4:junit4]   2> 5136 T283 oascc.ZkStateReader$3.process Updating live nodes... (5)
[junit4:junit4]   2> 5136 T251 oascc.ZkStateReader$3.process Updating live nodes... (5)
[junit4:junit4]   2> 5137 T269 oascc.ZkStateReader$3.process Updating live nodes... (5)
[junit4:junit4]   2> 5136 T256 oascc.ZkStateReader$3.process Updating live nodes... (5)
[junit4:junit4]   2> 5136 T297 oascc.ZkStateReader$3.process Updating live nodes... (5)
[junit4:junit4]   2> 5137 T311 oascc.ZkStateReader$3.process Updating live nodes... (5)
[junit4:junit4]   2> 5147 T229 oass.SolrDispatchFilter.init user.dir=/mnt/ssd/jenkins/workspace/Lucene-Solr-4.x-Linux/solr/build/solr-core/test/J0
[junit4:junit4]   2> 5148 T229 oass.SolrDispatchFilter.init SolrDispatchFilter.init() done
[junit4:junit4]   2> 5148 T229 oascsi.HttpClientUtil.createClient Creating new http client, config:maxConnections=128&maxConnectionsPerHost=32&followRedirects=false
[junit4:junit4]   2> 5153 T229 oascsi.HttpClientUtil.createClient Creating new http client, config:maxConnections=128&maxConnectionsPerHost=32&followRedirects=false
[junit4:junit4]   2> 5170 T263 oasc.CoreContainer.create Creating SolrCore 'unloadcollection1' using instanceDir: /mnt/ssd/jenkins/workspace/Lucene-Solr-4.x-Linux/solr/build/solr-core/test/J0/./org.apache.solr.cloud.UnloadDistributedZkTest-jetty1-1362922366490/unloadcollection1
[junit4:junit4]   2> 5170 T263 oasc.ZkController.createCollectionZkNode Check for collection zkNode:unloadcollection
[junit4:junit4]   2> 5171 T263 oasc.ZkController.createCollectionZkNode Creating collection in ZooKeeper:unloadcollection
[junit4:junit4]   2> 5172 T263 oasc.ZkController.getConfName Looking for collection configName
[junit4:junit4]   2> 5173 T263 oasc.ZkController.getConfName Only one config set found in zk - using it:conf1
[junit4:junit4]   2> 5173 T263 oascc.SolrZkClient.makePath makePath: /collections/unloadcollection
[junit4:junit4]   2> 5177 T263 oasc.ZkController.readConfigName Load collection config from:/collections/unloadcollection
[junit4:junit4]   2> 5179 T263 oasc.SolrResourceLoader.<init> new SolrResourceLoader for directory: '/mnt/ssd/jenkins/workspace/Lucene-Solr-4.x-Linux/solr/build/solr-core/test/J0/./org.apache.solr.cloud.UnloadDistributedZkTest-jetty1-1362922366490/unloadcollection1/'
[junit4:junit4]   2> 5210 T263 oasc.SolrConfig.<init> Using Lucene MatchVersion: LUCENE_42
[junit4:junit4]   2> 5243 T263 oasc.SolrConfig.<init> Loaded SolrConfig: solrconfig.xml
[junit4:junit4]   2> 5244 T263 oass.IndexSchema.readSchema Reading Solr Schema
[junit4:junit4]   2> 5248 T263 oass.IndexSchema.readSchema Schema name=test
[junit4:junit4]   2> 5605 T263 oass.OpenExchangeRatesOrgProvider.init Initialized with rates=open-exchange-rates.json, refreshInterval=1440.
[junit4:junit4]   2> 5611 T263 oass.IndexSchema.readSchema default search field in schema is text
[junit4:junit4]   2> 5613 T263 oass.IndexSchema.readSchema unique key field: id
[junit4:junit4]   2> 5635 T263 oass.FileExchangeRateProvider.reload Reloading exchange rates from file currency.xml
[junit4:junit4]   2> 5640 T263 oass.FileExchangeRateProvider.reload Reloading exchange rates from file currency.xml
[junit4:junit4]   2> 5646 T263 oass.OpenExchangeRatesOrgProvider.reload Reloading exchange rates from open-exchange-rates.json
[junit4:junit4]   2> 5648 T263 oass.OpenExchangeRatesOrgProvider$OpenExchangeRates.<init> WARNING Unknown key IMPORTANT NOTE
[junit4:junit4]   2> 5649 T263 oass.OpenExchangeRatesOrgProvider$OpenExchangeRates.<init> WARNING Expected key, got STRING
[junit4:junit4]   2> 5650 T263 oass.OpenExchangeRatesOrgProvider.reload Reloading exchange rates from open-exchange-rates.json
[junit4:junit4]   2> 5652 T263 oass.OpenExchangeRatesOrgProvider$OpenExchangeRates.<init> WARNING Unknown key IMPORTANT NOTE
[junit4:junit4]   2> 5653 T263 oass.OpenExchangeRatesOrgProvider$OpenExchangeRates.<init> WARNING Expected key, got STRING
[junit4:junit4]   2> 5653 T263 oasc.SolrCore.<init> [unloadcollection1] Opening new SolrCore at /mnt/ssd/jenkins/workspace/Lucene-Solr-4.x-Linux/solr/build/solr-core/test/J0/./org.apache.solr.cloud.UnloadDistributedZkTest-jetty1-1362922366490/unloadcollection1/, dataDir=/mnt/ssd/jenkins/workspace/Lucene-Solr-4.x-Linux/solr/build/solr-core/test/J0/./solrtest-UnloadDistributedZkTest-1362922366005/1362922371164unloadcollection1_1n/
[junit4:junit4]   2> 5655 T263 oasc.JmxMonitoredMap.<init> JMX monitoring is enabled. Adding Solr mbeans to JMX Server: com.sun.jmx.mbeanserver.JmxMBeanServer@1b3704
[junit4:junit4]   2> 5656 T263 oasc.SolrCore.initDirectoryFactory org.apache.solr.core.MockDirectoryFactory
[junit4:junit4]   2> 5657 T263 oasc.CachingDirectoryFactory.get return new directory for /mnt/ssd/jenkins/workspace/Lucene-Solr-4.x-Linux/solr/build/solr-core/test/J0/./solrtest-UnloadDistributedZkTest-1362922366005/1362922371164unloadcollection1_1n forceNew: false
[junit4:junit4]   2> 5658 T263 oasc.SolrCore.getNewIndexDir New index directory detected: old=null new=/mnt/ssd/jenkins/workspace/Lucene-Solr-4.x-Linux/solr/build/solr-core/test/J0/./solrtest-UnloadDistributedZkTest-1362922366005/1362922371164unloadcollection1_1n/index/
[junit4:junit4]   2> 5659 T263 oasc.SolrCore.initIndex WARNING [unloadcollection1] Solr index directory '/mnt/ssd/jenkins/workspace/Lucene-Solr-4.x-Linux/solr/build/solr-core/test/J0/./solrtest-UnloadDistributedZkTest-1362922366005/1362922371164unloadcollection1_1n/index' doesn't exist. Creating new index...
[junit4:junit4]   2> 5665 T263 oasc.CachingDirectoryFactory.get return new directory for /mnt/ssd/jenkins/workspace/Lucene-Solr-4.x-Linux/solr/build/solr-core/test/J0/./solrtest-UnloadDistributedZkTest-1362922366005/1362922371164unloadcollection1_1n/index forceNew: false
[junit4:junit4]   2> 5670 T263 oasc.SolrDeletionPolicy.onCommit SolrDeletionPolicy.onCommit: commits:num=1
[junit4:junit4]   2> 		commit{dir=MockDirWrapper(org.apache.lucene.store.SimpleFSDirectory@/mnt/ssd/jenkins/workspace/Lucene-Solr-4.x-Linux/solr/build/solr-core/test/J0/index5249952501tmp lockFactory=org.apache.lucene.store.NativeFSLockFactory@6f2f57),segFN=segments_1,generation=1,filenames=[segments_1]
[junit4:junit4]   2> 5671 T263 oasc.SolrDeletionPolicy.updateCommits newest commit = 1[segments_1]
[junit4:junit4]   2> 5682 T263 oasup.UpdateRequestProcessorChain.init inserting DistributedUpdateProcessorFactory into updateRequestProcessorChain "dedupe"
[junit4:junit4]   2> 5683 T263 oasup.UpdateRequestProcessorChain.init inserting DistributedUpdateProcessorFactory into updateRequestProcessorChain "stored_sig"
[junit4:junit4]   2> 5684 T263 oasup.UpdateRequestProcessorChain.init inserting DistributedUpdateProcessorFactory into updateRequestProcessorChain "distrib-dup-test-chain-implicit"
[junit4:junit4]   2> 5685 T263 oasc.RequestHandlers.initHandlersFromConfig created standard: solr.StandardRequestHandler
[junit4:junit4]   2> 5686 T263 oasc.RequestHandlers.initHandlersFromConfig created /get: solr.RealTimeGetHandler
[junit4:junit4]   2> 5686 T263 oasc.RequestHandlers.initHandlersFromConfig adding lazy requestHandler: solr.ReplicationHandler
[junit4:junit4]   2> 5687 T263 oasc.RequestHandlers.initHandlersFromConfig created /replication: solr.ReplicationHandler
[junit4:junit4]   2> 5688 T263 oasc.RequestHandlers.initHandlersFromConfig created /update: solr.UpdateRequestHandler
[junit4:junit4]   2> 5688 T263 oasc.RequestHandlers.initHandlersFromConfig created /admin/: org.apache.solr.handler.admin.AdminHandlers
[junit4:junit4]   2> 5692 T263 oashl.XMLLoader.init xsltCacheLifetimeSeconds=60
[junit4:junit4]   2> 5695 T263 oass.SolrIndexSearcher.<init> Opening Searcher@10a5b1e main
[junit4:junit4]   2> 5695 T263 oasu.UpdateHandler.clearLog Clearing tlog files, tlogDir=/mnt/ssd/jenkins/workspace/Lucene-Solr-4.x-Linux/solr/build/solr-core/test/J0/./solrtest-UnloadDistributedZkTest-1362922366005/1362922371164unloadcollection1_1n/tlog
[junit4:junit4]   2> 5696 T263 oasu.CommitTracker.<init> Hard AutoCommit: disabled
[junit4:junit4]   2> 5696 T263 oasu.CommitTracker.<init> Soft AutoCommit: disabled
[junit4:junit4]   2> 5700 T313 oasc.SolrCore.registerSearcher [unloadcollection1] Registered new searcher Searcher@10a5b1e main{StandardDirectoryReader(segments_1:1)}
[junit4:junit4]   2> 5702 T263 oasc.ZkController.publish publishing core=unloadcollection1 state=down
[junit4:junit4]   2> 5703 T234 oazs.PrepRequestProcessor.pRequest Got user-level KeeperException when processing sessionid:0x13d5480e4860006 type:create cxid:0x40 zxid:0x4c txntype:-1 reqpath:n/a Error Path:/solr/overseer/queue Error:KeeperErrorCode = NoNode for /solr/overseer/queue
[junit4:junit4]   2> 6491 T252 oascc.ZkStateReader.updateClusterState Updating cloud state from ZooKeeper... 
[junit4:junit4]   2> 6492 T252 oasc.Overseer$ClusterStateUpdater.updateState Update state numShards=1 message={
[junit4:junit4]   2> 	  "shard":null,
[junit4:junit4]   2> 	  "operation":"state",
[junit4:junit4]   2> 	  "core":"unloadcollection1",
[junit4:junit4]   2> 	  "node_name":"127.0.0.1:54352_ks",
[junit4:junit4]   2> 	  "base_url":"http://127.0.0.1:54352/ks",
[junit4:junit4]   2> 	  "core_node_name":null,
[junit4:junit4]   2> 	  "collection":"unloadcollection",
[junit4:junit4]   2> 	  "state":"down",
[junit4:junit4]   2> 	  "roles":null,
[junit4:junit4]   2> 	  "numShards":"1"}
[junit4:junit4]   2> 6492 T252 oasc.Overseer$ClusterStateUpdater.createCollection Create collection unloadcollection with numShards 1
[junit4:junit4]   2> 6500 T252 oasc.Overseer$ClusterStateUpdater.updateState Assigning new node to shard shard=shard1
[junit4:junit4]   2> 6500 T234 oazs.PrepRequestProcessor.pRequest Got user-level KeeperException when processing sessionid:0x13d5480e4860003 type:create cxid:0x46 zxid:0x4f txntype:-1 reqpath:n/a Error Path:/solr/overseer/queue-work Error:KeeperErrorCode = NoNode for /solr/overseer/queue-work
[junit4:junit4]   2> 6512 T283 oascc.ZkStateReader$2.process A cluster state change: WatchedEvent state:SyncConnected type:NodeDataChanged path:/clusterstate.json, has occurred - updating... (live nodes size: 5)
[junit4:junit4]   2> 6512 T269 oascc.ZkStateReader$2.process A cluster state change: WatchedEvent state:SyncConnected type:NodeDataChanged path:/clusterstate.json, has occurred - updating... (live nodes size: 5)
[junit4:junit4]   2> 6512 T256 oascc.ZkStateReader$2.process A cluster state change: WatchedEvent state:SyncConnected type:NodeDataChanged path:/clusterstate.json, has occurred - updating... (live nodes size: 5)
[junit4:junit4]   2> 6513 T251 oascc.ZkStateReader$2.process A cluster state change: WatchedEvent state:SyncConnected type:NodeDataChanged path:/clusterstate.json, has occurred - updating... (live nodes size: 5)
[junit4:junit4]   2> 6512 T311 oascc.ZkStateReader$2.process A cluster state change: WatchedEvent state:SyncConnected type:NodeDataChanged path:/clusterstate.json, has occurred - updating... (live nodes size: 5)
[junit4:junit4]   2> 6512 T297 oascc.ZkStateReader$2.process A cluster state change: WatchedEvent state:SyncConnected type:NodeDataChanged path:/clusterstate.json, has occurred - updating... (live nodes size: 5)
[junit4:junit4]   2> 6708 T263 oasc.CoreContainer.registerCore registering core: unloadcollection1
[junit4:junit4]   2> 6708 T263 oasc.ZkController.register Register replica - core:unloadcollection1 address:http://127.0.0.1:54352/ks collection:unloadcollection shard:shard1
[junit4:junit4]   2> 6714 T263 oascsi.HttpClientUtil.createClient Creating new http client, config:maxConnections=10000&maxConnectionsPerHost=20&connTimeout=30000&socketTimeout=30000&retry=false
[junit4:junit4]   2> 6722 T263 oascc.SolrZkClient.makePath makePath: /collections/unloadcollection/leader_elect/shard1/election
[junit4:junit4]   2> 6737 T234 oazs.PrepRequestProcessor.pRequest Got user-level KeeperException when processing sessionid:0x13d5480e4860006 type:delete cxid:0x51 zxid:0x59 txntype:-1 reqpath:n/a Error Path:/solr/collections/unloadcollection/leaders Error:KeeperErrorCode = NoNode for /solr/collections/unloadcollection/leaders
[junit4:junit4]   2> 6738 T263 oasc.ShardLeaderElectionContext.runLeaderProcess Running the leader process.
[junit4:junit4]   2> 6739 T234 oazs.PrepRequestProcessor.pRequest Got user-level KeeperException when processing sessionid:0x13d5480e4860006 type:create cxid:0x52 zxid:0x5a txntype:-1 reqpath:n/a Error Path:/solr/overseer Error:KeeperErrorCode = NodeExists for /solr/overseer
[junit4:junit4]   2> 6742 T263 oasc.ShardLeaderElectionContext.waitForReplicasToComeUp Enough replicas found to continue.
[junit4:junit4]   2> 6743 T263 oasc.ShardLeaderElectionContext.runLeaderProcess I may be the new leader - try and sync
[junit4:junit4]   2> 6744 T263 oasc.SyncStrategy.sync Sync replicas to http://127.0.0.1:54352/ks/unloadcollection1/
[junit4:junit4]   2> 6745 T263 oasc.SyncStrategy.syncReplicas Sync Success - now sync replicas to me
[junit4:junit4]   2> 6745 T263 oasc.SyncStrategy.syncToMe http://127.0.0.1:54352/ks/unloadcollection1/ has no replicas
[junit4:junit4]   2> 6746 T263 oasc.ShardLeaderElectionContext.runLeaderProcess I am the new leader: http://127.0.0.1:54352/ks/unloadcollection1/
[junit4:junit4]   2> 6746 T263 oascc.SolrZkClient.makePath makePath: /collections/unloadcollection/leaders/shard1
[junit4:junit4]   2> 6754 T234 oazs.PrepRequestProcessor.pRequest Got user-level KeeperException when processing sessionid:0x13d5480e4860006 type:create cxid:0x5c zxid:0x5e txntype:-1 reqpath:n/a Error Path:/solr/overseer Error:KeeperErrorCode = NodeExists for /solr/overseer
[junit4:junit4]   2> 8019 T252 oascc.ZkStateReader.updateClusterState Updating cloud state from ZooKeeper... 
[junit4:junit4]   2> 8028 T256 oascc.ZkStateReader$2.process A cluster state change: WatchedEvent state:SyncConnected type:NodeDataChanged path:/clusterstate.json, has occurred - updating... (live nodes size: 5)
[junit4:junit4]   2> 8028 T269 oascc.ZkStateReader$2.process A cluster state change: WatchedEvent state:SyncConnected type:NodeDataChanged path:/clusterstate.json, has occurred - updating... (live nodes size: 5)
[junit4:junit4]   2> 8028 T283 oascc.ZkStateReader$2.process A cluster state change: WatchedEvent state:SyncConnected type:NodeDataChanged path:/clusterstate.json, has occurred - updating... (live nodes size: 5)
[junit4:junit4]   2> 8028 T297 oascc.ZkStateReader$2.process A cluster state change: WatchedEvent state:SyncConnected type:NodeDataChanged path:/clusterstate.json, has occurred - updating... (live nodes size: 5)
[junit4:junit4]   2> 8028 T311 oascc.ZkStateReader$2.process A cluster state change: WatchedEvent state:SyncConnected type:NodeDataChanged path:/clusterstate.json, has occurred - updating... (live nodes size: 5)
[junit4:junit4]   2> 8028 T251 oascc.ZkStateReader$2.process A cluster state change: WatchedEvent state:SyncConnected type:NodeDataChanged path:/clusterstate.json, has occurred - updating... (live nodes size: 5)
[junit4:junit4]   2> 8062 T263 oasc.ZkController.register We are http://127.0.0.1:54352/ks/unloadcollection1/ and leader is http://127.0.0.1:54352/ks/unloadcollection1/
[junit4:junit4]   2> 8062 T263 oasc.ZkController.register No LogReplay needed for core=unloadcollection1 baseURL=http://127.0.0.1:54352/ks
[junit4:junit4]   2> 8062 T263 oasc.ZkController.checkRecovery I am the leader, no recovery necessary
[junit4:junit4]   2> 8063 T263 oasc.ZkController.publish publishing core=unloadcollection1 state=active
[junit4:junit4]   2> 8065 T263 oascc.ZkStateReader.updateClusterState Updating cloud state from ZooKeeper... 
[junit4:junit4]   2> 8066 T263 oasc.CoreContainer.persistFile Persisting cores config to /mnt/ssd/jenkins/workspace/Lucene-Solr-4.x-Linux/solr/build/solr-core/test/J0/./org.apache.solr.cloud.UnloadDistributedZkTest-jetty1-1362922366490/solr.xml
[junit4:junit4]   2> 8072 T263 oasc.SolrXMLSerializer.persistFile Persisting cores config to /mnt/ssd/jenkins/workspace/Lucene-Solr-4.x-Linux/solr/build/solr-core/test/J0/./org.apache.solr.cloud.UnloadDistributedZkTest-jetty1-1362922366490/solr.xml
[junit4:junit4]   2> 8074 T263 oass.SolrDispatchFilter.handleAdminRequest /admin/cores {action=CREATE&name=unloadcollection1&wt=javabin&version=2&dataDir=/mnt/ssd/jenkins/workspace/Lucene-Solr-4.x-Linux/solr/build/solr-core/test/J0/./solrtest-UnloadDistributedZkTest-1362922366005/1362922371164unloadcollection1_1n&collection=unloadcollection&numShards=1} status=0 QTime=2908 
[junit4:junit4]   2> 8074 T229 oascsi.HttpClientUtil.createClient Creating new http client, config:
[junit4:junit4]   2> 8076 T229 oaz.ZooKeeper.<init> Initiating client connection, connectString=127.0.0.1:46789/solr sessionTimeout=10000 watcher=org.apache.solr.common.cloud.ConnectionManager@17243b6
[junit4:junit4]   2> 8077 T229 oascc.ConnectionManager.waitForConnected Waiting for client to connect to ZooKeeper
[junit4:junit4]   2> 8077 T314 oaz.ClientCnxn$SendThread.logStartConnect Opening socket connection to server localhost.localdomain/127.0.0.1:46789. Will not attempt to authenticate using SASL (access denied ("javax.security.auth.AuthPermission" "getLoginConfiguration"))
[junit4:junit4]   2> 8078 T314 oaz.ClientCnxn$SendThread.primeConnection Socket connection established to localhost.localdomain/127.0.0.1:46789, initiating session
[junit4:junit4]   2> 8078 T231 oazs.NIOServerCnxnFactory.run Accepted socket connection from /127.0.0.1:43375
[junit4:junit4]   2> 8079 T231 oazs.ZooKeeperServer.processConnectRequest Client attempting to establish new session at /127.0.0.1:43375
[junit4:junit4]   2> 8079 T233 oazs.ZooKeeperServer.finishSessionInit Established session 0x13d5480e486000d with negotiated timeout 10000 for client /127.0.0.1:43375
[junit4:junit4]   2> 8080 T314 oaz.ClientCnxn$SendThread.onConnected Session establishment complete on server localhost.localdomain/127.0.0.1:46789, sessionid = 0x13d5480e486000d, negotiated timeout = 10000
[junit4:junit4]   2> 8080 T315 oascc.ConnectionManager.process Watcher org.apache.solr.common.cloud.ConnectionManager@17243b6 name:ZooKeeperConnection Watcher:127.0.0.1:46789/solr got event WatchedEvent state:SyncConnected type:None path:null path:null type:None
[junit4:junit4]   2> 8080 T229 oascc.ConnectionManager.waitForConnected Client is connected to ZooKeeper
[junit4:junit4]   2> 8082 T229 oascc.ZkStateReader.createClusterStateWatchersAndUpdate Updating cluster state from ZooKeeper... 
[junit4:junit4]   2> 8086 T229 oascc.ZkStateReader.updateClusterState Updating cloud state from ZooKeeper... 
[junit4:junit4]   2> 8087 T229 oascsi.HttpClientUtil.createClient Creating new http client, config:maxConnections=128&maxConnectionsPerHost=32&followRedirects=false
[junit4:junit4]   2> 8092 T279 oasc.CoreContainer.create Creating SolrCore 'unloadcollection2' using instanceDir: /mnt/ssd/jenkins/workspace/Lucene-Solr-4.x-Linux/solr/build/solr-core/test/J0/./org.apache.solr.cloud.UnloadDistributedZkTest-jetty2-1362922367656/unloadcollection2
[junit4:junit4]   2> 8093 T279 oasc.ZkController.createCollectionZkNode Check for collection zkNode:unloadcollection
[junit4:junit4]   2> 8093 T279 oasc.ZkController.createCollectionZkNode Collection zkNode exists
[junit4:junit4]   2> 8094 T279 oasc.ZkController.readConfigName Load collection config from:/collections/unloadcollection
[junit4:junit4]   2> 8095 T279 oasc.SolrResourceLoader.<init> new SolrResourceLoader for directory: '/mnt/ssd/jenkins/workspace/Lucene-Solr-4.x-Linux/solr/build/solr-core/test/J0/./org.apache.solr.cloud.UnloadDistributedZkTest-jetty2-1362922367656/unloadcollection2/'
[junit4:junit4]   2> 8129 T279 oasc.SolrConfig.<init> Using Lucene MatchVersion: LUCENE_42
[junit4:junit4]   2> 8163 T279 oasc.SolrConfig.<init> Loaded SolrConfig: solrconfig.xml
[junit4:junit4]   2> 8164 T279 oass.IndexSchema.readSchema Reading Solr Schema
[junit4:junit4]   2> 8169 T279 oass.IndexSchema.readSchema Schema name=test
[junit4:junit4]   2> 8525 T279 oass.OpenExchangeRatesOrgProvider.init Initialized with rates=open-exchange-rates.json, refreshInterval=1440.
[junit4:junit4]   2> 8530 T279 oass.IndexSchema.readSchema default search field in schema is text
[junit4:junit4]   2> 8533 T279 oass.IndexSchema.readSchema unique key field: id
[junit4:junit4]   2> 8553 T279 oass.FileExchangeRateProvider.reload Reloading exchange rates from file currency.xml
[junit4:junit4]   2> 8560 T279 oass.FileExchangeRateProvider.reload Reloading exchange rates from file currency.xml
[junit4:junit4]   2> 8565 T279 oass.OpenExchangeRatesOrgProvider.reload Reloading exchange rates from open-exchange-rates.json
[junit4:junit4]   2> 8568 T279 oass.OpenExchangeRatesOrgProvider$OpenExchangeRates.<init> WARNING Unknown key IMPORTANT NOTE
[junit4:junit4]   2> 8569 T279 oass.OpenExchangeRatesOrgProvider$OpenExchangeRates.<init> WARNING Expected key, got STRING
[junit4:junit4]   2> 8570 T279 oass.OpenExchangeRatesOrgProvider.reload Reloading exchange rates from open-exchange-rates.json
[junit4:junit4]   2> 8572 T279 oass.OpenExchangeRatesOrgProvider$OpenExchangeRates.<init> WARNING Unknown key IMPORTANT NOTE
[junit4:junit4]   2> 8572 T279 oass.OpenExchangeRatesOrgProvider$OpenExchangeRates.<init> WARNING Expected key, got STRING
[junit4:junit4]   2> 8573 T279 oasc.SolrCore.<init> [unloadcollection2] Opening new SolrCore at /mnt/ssd/jenkins/workspace/Lucene-Solr-4.x-Linux/solr/build/solr-core/test/J0/./org.apache.solr.cloud.UnloadDistributedZkTest-jetty2-1362922367656/unloadcollection2/, dataDir=/mnt/ssd/jenkins/workspace/Lucene-Solr-4.x-Linux/solr/build/solr-core/test/J0/./solrtest-UnloadDistributedZkTest-1362922366005/1362922374092unloadcollection1_2n/
[junit4:junit4]   2> 8574 T279 oasc.JmxMonitoredMap.<init> JMX monitoring is enabled. Adding Solr mbeans to JMX Server: com.sun.jmx.mbeanserver.JmxMBeanServer@1b3704
[junit4:junit4]   2> 8574 T279 oasc.SolrCore.initDirectoryFactory org.apache.solr.core.MockDirectoryFactory
[junit4:junit4]   2> 8576 T279 oasc.CachingDirectoryFactory.get return new directory for /mnt/ssd/jenkins/workspace/Lucene-Solr-4.x-Linux/solr/build/solr-core/test/J0/./solrtest-UnloadDistributedZkTest-1362922366005/1362922374092unloadcollection1_2n forceNew: false
[junit4:junit4]   2> 8576 T279 oasc.SolrCore.getNewIndexDir New index directory detected: old=null new=/mnt/ssd/jenkins/workspace/Lucene-Solr-4.x-Linux/solr/build/solr-core/test/J0/./solrtest-UnloadDistributedZkTest-1362922366005/1362922374092unloadcollection1_2n/index/
[junit4:junit4]   2> 8577 T279 oasc.SolrCore.initIndex WARNING [unloadcollection2] Solr index directory '/mnt/ssd/jenkins/workspace/Lucene-Solr-4.x-Linux/solr/build/solr-core/test/J0/./solrtest-UnloadDistributedZkTest-1362922366005/1362922374092unloadcollection1_2n/index' doesn't exist. Creating new index...
[junit4:junit4]   2> 8578 T279 oasc.CachingDirectoryFactory.get return new directory for /mnt/ssd/jenkins/workspace/Lucene-Solr-4.x-Linux/solr/build/solr-core/test/J0/./solrtest-UnloadDistributedZkTest-1362922366005/1362922374092unloadcollection1_2n/index forceNew: false
[junit4:junit4]   2> 8584 T279 oasc.SolrDeletionPolicy.onCommit SolrDeletionPolicy.onCommit: commits:num=1
[junit4:junit4]   2> 		commit{dir=MockDirWrapper(org.apache.lucene.store.SimpleFSDirectory@/mnt/ssd/jenkins/workspace/Lucene-Solr-4.x-Linux/solr/build/solr-core/test/J0/index5249952502tmp lockFactory=org.apache.lucene.store.NativeFSLockFactory@8e5f4b),segFN=segments_1,generation=1,filenames=[segments_1]
[junit4:junit4]   2> 8584 T279 oasc.SolrDeletionPolicy.updateCommits newest commit = 1[segments_1]
[junit4:junit4]   2> 8587 T279 oasup.UpdateRequestProcessorChain.init inserting DistributedUpdateProcessorFactory into updateRequestProcessorChain "dedupe"
[junit4:junit4]   2> 8588 T279 oasup.UpdateRequestProcessorChain.init inserting DistributedUpdateProcessorFactory into updateRequestProcessorChain "stored_sig"
[junit4:junit4]   2> 8589 T279 oasup.UpdateRequestProcessorChain.init inserting DistributedUpdateProcessorFactory into updateRequestProcessorChain "distrib-dup-test-chain-implicit"
[junit4:junit4]   2> 8590 T279 oasc.RequestHandlers.initHandlersFromConfig created standard: solr.StandardRequestHandler
[junit4:junit4]   2> 8591 T279 oasc.RequestHandlers.initHandlersFromConfig created /get: solr.RealTimeGetHandler
[junit4:junit4]   2> 8591 T279 oasc.RequestHandlers.initHandlersFromConfig adding lazy requestHandler: solr.ReplicationHandler
[junit4:junit4]   2> 8592 T279 oasc.RequestHandlers.initHandlersFromConfig created /replication: solr.ReplicationHandler
[junit4:junit4]   2> 8592 T279 oasc.RequestHandlers.initHandlersFromConfig created /update: solr.UpdateRequestHandler
[junit4:junit4]   2> 8593 T279 oasc.RequestHandlers.initHandlersFromConfig created /admin/: org.apache.solr.handler.admin.AdminHandlers
[junit4:junit4]   2> 8598 T279 oashl.XMLLoader.init xsltCacheLifetimeSeconds=60
[junit4:junit4]   2> 8604 T279 oass.SolrIndexSearcher.<init> Opening Searcher@18f492f main
[junit4:junit4]   2> 8605 T279 oasu.UpdateHandler.clearLog Clearing tlog files, tlogDir=/mnt/ssd/jenkins/workspace/Lucene-Solr-4.x-Linux/solr/build/solr-core/test/J0/./solrtest-UnloadDistributedZkTest-1362922366005/1362922374092unloadcollection1_2n/tlog
[junit4:junit4]   2> 8606 T279 oasu.CommitTracker.<init> Hard AutoCommit: disabled
[junit4:junit4]   2> 8606 T279 oasu.CommitTracker.<init> Soft AutoCommit: disabled
[junit4:junit4]   2> 8612 T316 oasc.SolrCore.registerSearcher [unloadcollection2] Registered new searcher Searcher@18f492f main{StandardDirectoryReader(segments_1:1)}
[junit4:junit4]   2> 8613 T279 oasc.ZkController.publish publishing core=unloadcollection2 state=down
[junit4:junit4]   2> 8614 T279 oasc.ZkController.publish numShards not found on descriptor - reading it from system property
[junit4:junit4]   2> 9535 T252 oascc.ZkStateReader.updateClusterState Updating cloud state from ZooKeeper... 
[junit4:junit4]   2> 9536 T252 oasc.Overseer$ClusterStateUpdater.updateState Update state numShards=1 message={
[junit4:junit4]   2> 	  "shard":"shard1",
[junit4:junit4]   2> 	  "operation":"state",
[junit4:junit4]   2> 	  "core":"unloadcollection1",
[junit4:junit4]   2> 	  "node_name":"127.0.0.1:54352_ks",
[junit4:junit4]   2> 	  "base_url":"http://127.0.0.1:54352/ks",
[junit4:junit4]   2> 	  "core_node_name":null,
[junit4:junit4]   2> 	  "collection":"unloadcollection",
[junit4:junit4]   2> 	  "state":"active",
[junit4:junit4]   2> 	  "roles":null,
[junit4:junit4]   2> 	  "numShards":"1"}
[junit4:junit4]   2> 9540 T252 oasc.Overseer$ClusterStateUpdater.updateState Update state numShards=2 message={
[junit4:junit4]   2> 	  "shard":null,
[junit4:junit4]   2> 	  "operation":"state",
[junit4:junit4]   2> 	  "core":"unloadcollection2",
[junit4:junit4]   2> 	  "node_name":"127.0.0.1:34545_ks",
[junit4:junit4]   2> 	  "base_url":"http://127.0.0.1:34545/ks",
[junit4:junit4]   2> 	  "core_node_name":null,
[junit4:junit4]   2> 	  "collection":"unloadcollection",
[junit4:junit4]   2> 	  "state":"down",
[junit4:junit4]   2> 	  "roles":null,
[junit4:junit4]   2> 	  "numShards":"2"}
[junit4:junit4]   2> 9541 T252 oasc.Overseer$ClusterStateUpdater.updateState Collection already exists with numShards=1
[junit4:junit4]   2> 9541 T252 oasc.Overseer$ClusterStateUpdater.updateState Assigning new node to shard shard=shard1
[junit4:junit4]   2> 9546 T315 oascc.ZkStateReader$2.process A cluster state change: WatchedEvent state:SyncConnected type:NodeDataChanged path:/clusterstate.json, has occurred - updating... (live nodes size: 5)
[junit4:junit4]   2> 9546 T269 oascc.ZkStateReader$2.process A cluster state change: WatchedEvent state:SyncConnected type:NodeDataChanged path:/clusterstate.json, has occurred - updating... (live nodes size: 5)
[junit4:junit4]   2> 9546 T297 oascc.ZkStateReader$2.process A cluster state change: WatchedEvent state:SyncConnected type:NodeDataChanged path:/clusterstate.json, has occurred - updating... (live nodes size: 5)
[junit4:junit4]   2> 9546 T251 oascc.ZkStateReader$2.process A cluster state change: WatchedEvent state:SyncConnected type:NodeDataChanged path:/clusterstate.json, has occurred - updating... (live nodes size: 5)
[junit4:junit4]   2> 9546 T283 oascc.ZkStateReader$2.process A cluster state change: WatchedEvent state:SyncConnected type:NodeDataChanged path:/clusterstate.json, has occurred - updating... (live nodes size: 5)
[junit4:junit4]   2> 9546 T311 oascc.ZkStateReader$2.process A cluster state change: WatchedEvent state:SyncConnected type:NodeDataChanged path:/clusterstate.json, has occurred - updating... (live nodes size: 5)
[junit4:junit4]   2> 9546 T256 oascc.ZkStateReader$2.process A cluster state change: WatchedEvent state:SyncConnected type:NodeDataChanged path:/clusterstate.json, has occurred - updating... (live nodes size: 5)
[junit4:junit4]   2> 9616 T279 oasc.CoreContainer.registerCore registering core: unloadcollection2
[junit4:junit4]   2> 9616 T279 oasc.ZkController.register Register replica - core:unloadcollection2 address:http://127.0.0.1:34545/ks collection:unloadcollection shard:shard1
[junit4:junit4]   2> 9620 T279 oasc.ZkController.register We are http://127.0.0.1:34545/ks/unloadcollection2/ and leader is http://127.0.0.1:54352/ks/unloadcollection1/
[junit4:junit4]   2> 9621 T279 oasc.ZkController.register No LogReplay needed for core=unloadcollection2 baseURL=http://127.0.0.1:34545/ks
[junit4:junit4]   2> 9621 T279 oasc.ZkController.checkRecovery Core needs to recover:unloadcollection2
[junit4:junit4]   2> 9621 T279 oasu.DefaultSolrCoreState.doRecovery Running recovery - first canceling any ongoing recovery
[junit4:junit4]   2> ASYNC  NEW_CORE C9 name=unloadcollection2 org.apache.solr.core.SolrCore@168d2e2 url=http://127.0.0.1:34545/ks/unloadcollection2 node=127.0.0.1:34545_ks C9_STATE=coll:unloadcollection core:unloadcollection2 props:{core=unloadcollection2, node_name=127.0.0.1:34545_ks, base_url=http://127.0.0.1:34545/ks, collection=unloadcollection, state=down}
[junit4:junit4]   2> 9624 T317 C9 P34545 oasc.RecoveryStrategy.run Starting recovery process.  core=unloadcollection2 recoveringAfterStartup=true
[junit4:junit4]   2> 9625 T279 oascc.ZkStateReader.updateClusterState Updating cloud state from ZooKeeper... 
[junit4:junit4]   2> 9626 T317 C9 P34545 oasc.RecoveryStrategy.doRecovery ###### startupVersions=[]
[junit4:junit4]   2> 9626 T317 C9 P34545 oasc.ZkController.publish publishing core=unloadcollection2 state=recovering
[junit4:junit4]   2> 9626 T317 C9 P34545 oasc.ZkController.publish numShards not found on descriptor - reading it from system property
[junit4:junit4]   2> 9626 T279 oasc.CoreContainer.persistFile Persisting cores config to /mnt/ssd/jenkins/workspace/Lucene-Solr-4.x-Linux/solr/build/solr-core/test/J0/./org.apache.solr.cloud.UnloadDistributedZkTest-jetty2-1362922367656/solr.xml
[junit4:junit4]   2> 9627 T317 C9 P34545 oascsi.HttpClientUtil.createClient Creating new http client, config:maxConnections=128&maxConnectionsPerHost=32&followRedirects=false
[junit4:junit4]   2> 9633 T279 oasc.SolrXMLSerializer.persistFile Persisting cores config to /mnt/ssd/jenkins/workspace/Lucene-Solr-4.x-Linux/solr/build/solr-core/test/J0/./org.apache.solr.cloud.UnloadDistributedZkTest-jetty2-1362922367656/solr.xml
[junit4:junit4]   2> 9634 T279 oass.SolrDispatchFilter.handleAdminRequest /admin/cores {action=CREATE&name=unloadcollection2&wt=javabin&version=2&dataDir=/mnt/ssd/jenkins/workspace/Lucene-Solr-4.x-Linux/solr/build/solr-core/test/J0/./solrtest-UnloadDistributedZkTest-1362922366005/1362922374092unloadcollection1_2n&collection=unloadcollection} status=0 QTime=1542 
[junit4:junit4]   2> 9635 T229 oascc.ZkStateReader.updateClusterState Updating cloud state from ZooKeeper... 
[junit4:junit4]   2> 9636 T229 oasc.AbstractDistribZkTestBase.waitForRecoveriesToFinish Wait for recoveries to finish - collection: unloadcollection failOnTimeout:true timeout (sec):230
[junit4:junit4]   2> 9637 T229 oascc.ZkStateReader.updateClusterState Updating cloud state from ZooKeeper... 
[junit4:junit4]   2> 10639 T229 oascc.ZkStateReader.updateClusterState Updating cloud state from ZooKeeper... 
[junit4:junit4]   2> 11055 T252 oascc.ZkStateReader.updateClusterState Updating cloud state from ZooKeeper... 
[junit4:junit4]   2> 11055 T252 oasc.Overseer$ClusterStateUpdater.updateState Update state numShards=2 message={
[junit4:junit4]   2> 	  "shard":"shard1",
[junit4:junit4]   2> 	  "operation":"state",
[junit4:junit4]   2> 	  "core":"unloadcollection2",
[junit4:junit4]   2> 	  "node_name":"127.0.0.1:34545_ks",
[junit4:junit4]   2> 	  "base_url":"http://127.0.0.1:34545/ks",
[junit4:junit4]   2> 	  "core_node_name":null,
[junit4:junit4]   2> 	  "collection":"unloadcollection",
[junit4:junit4]   2> 	  "state":"recovering",
[junit4:junit4]   2> 	  "roles":null,
[junit4:junit4]   2> 	  "numShards":"2"}
[junit4:junit4]   2> 11060 T283 oascc.ZkStateReader$2.process A cluster state change: WatchedEvent state:SyncConnected type:NodeDataChanged path:/clusterstate.json, has occurred - updating... (live nodes size: 5)
[junit4:junit4]   2> 11060 T297 oascc.ZkStateReader$2.process A cluster state change: WatchedEvent state:SyncConnected type:NodeDataChanged path:/clusterstate.json, has occurred - updating... (live nodes size: 5)
[junit4:junit4]   2> 11061 T269 oascc.ZkStateReader$2.process A cluster state change: WatchedEvent state:SyncConnected type:NodeDataChanged path:/clusterstate.json, has occurred - updating... (live nodes size: 5)
[junit4:junit4]   2> 11061 T251 oascc.ZkStateReader$2.process A cluster state change: WatchedEvent state:SyncConnected type:NodeDataChanged path:/clusterstate.json, has occurred - updating... (live nodes size: 5)
[junit4:junit4]   2> 11061 T311 oascc.ZkStateReader$2.process A cluster state change: WatchedEvent state:SyncConnected type:NodeDataChanged path:/clusterstate.json, has occurred - updating... (live nodes size: 5)
[junit4:junit4]   2> 11061 T256 oascc.ZkStateReader$2.process A cluster state change: WatchedEvent state:SyncConnected type:NodeDataChanged path:/clusterstate.json, has occurred - updating... (live nodes size: 5)
[junit4:junit4]   2> 11061 T315 oascc.ZkStateReader$2.process A cluster state change: WatchedEvent state:SyncConnected type:NodeDataChanged path:/clusterstate.json, has occurred - updating... (live nodes size: 5)
[junit4:junit4]   2> 11632 T263 oass.SolrDispatchFilter.handleAdminRequest /admin/cores {action=PREPRECOVERY&wt=javabin&version=2&coreNodeName=127.0.0.1:34545_ks_unloadcollection2&core=unloadcollection1&checkLive=true&nodeName=127.0.0.1:34545_ks&onlyIfLeader=true&state=recovering} status=0 QTime=2000 
[junit4:junit4]   2> 11642 T229 oascc.ZkStateReader.updateClusterState Updating cloud state from ZooKeeper... 
[junit4:junit4]   2> 12645 T229 oascc.ZkStateReader.updateClusterState Updating cloud state from ZooKeeper... 
[junit4:junit4]   2>  C9_STATE=coll:unloadcollection core:unloadcollection2 props:{shard=shard1, core=unloadcollection2, node_name=127.0.0.1:34545_ks, base_url=http://127.0.0.1:34545/ks, collection=unloadcollection, state=recovering}
[junit4:junit4]   2> 13634 T317 C9 P34545 oasc.RecoveryStrategy.doRecovery Attempting to PeerSync from http://127.0.0.1:54352/ks/unloadcollection1/ core=unloadcollection2 - recoveringAfterStartup=true
[junit4:junit4]   2> 13635 T317 C9 P34545 oasu.PeerSync.sync PeerSync: core=unloadcollection2 url=http://127.0.0.1:34545/ks START replicas=[http://127.0.0.1:54352/ks/unloadcollection1/] nUpdates=100
[junit4:junit4]   2> 13635 T317 C9 P34545 oasu.PeerSync.sync WARNING no frame of reference to tell of we've missed updates
[junit4:junit4]   2> 13636 T317 C9 P34545 oasc.RecoveryStrategy.doRecovery PeerSync Recovery was not successful - trying replication. core=unloadcollection2
[junit4:junit4]   2> 13636 T317 C9 P34545 oasc.RecoveryStrategy.doRecovery Starting Replication Recovery. core=unloadcollection2
[junit4:junit4]   2> 13637 T317 C9 P34545 oasc.RecoveryStrategy.doRecovery Begin buffering updates. core=unloadcollection2
[junit4:junit4]   2> 13637 T317 C9 P34545 oasu.UpdateLog.bufferUpdates Starting to buffer updates. FSUpdateLog{state=ACTIVE, tlog=null}
[junit4:junit4]   2> 13638 T317 C9 P34545 oasc.RecoveryStrategy.replicate Attempting to replicate from http://127.0.0.1:54352/ks/unloadcollection1/. core=unloadcollection2
[junit4:junit4]   2> 13638 T317 C9 P34545 oascsi.HttpClientUtil.createClient Creating new http client, config:maxConnections=128&maxConnectionsPerHost=32&followRedirects=false
[junit4:junit4]   2> ASYNC  NEW_CORE C10 name=unloadcollection1 org.apache.solr.core.SolrCore@f72fa5 url=http://127.0.0.1:54352/ks/unloadcollection1 node=127.0.0.1:54352_ks C10_STATE=coll:unloadcollection core:unloadcollection1 props:{shard=shard1, core=unloadcollection1, node_name=127.0.0.1:54352_ks, base_url=http://127.0.0.1:54352/ks, collection=unloadcollection, state=active, leader=true}
[junit4:junit4]   2> 13646 T263 C10 P54352 REQ /get {getVersions=100&qt=/get&wt=javabin&version=2&distrib=false} status=0 QTime=0 
[junit4:junit4]   2> 13648 T229 oascc.ZkStateReader.updateClusterState Updating cloud state from ZooKeeper... 
[junit4:junit4]   2> 13656 T265 C10 P54352 oasu.DirectUpdateHandler2.commit start commit{,optimize=false,openSearcher=false,waitSearcher=true,expungeDeletes=false,softCommit=false,prepareCommit=false}
[junit4:junit4]   2> 13660 T265 C10 P54352 oasc.SolrDeletionPolicy.onInit SolrDeletionPolicy.onInit: commits:num=1
[junit4:junit4]   2> 		commit{dir=MockDirWrapper(org.apache.lucene.store.SimpleFSDirectory@/mnt/ssd/jenkins/workspace/Lucene-Solr-4.x-Linux/solr/build/solr-core/test/J0/index5249952501tmp lockFactory=org.apache.lucene.store.NativeFSLockFactory@6f2f57),segFN=segments_1,generation=1,filenames=[segments_1]
[junit4:junit4]   2> 13661 T265 C10 P54352 oasc.SolrDeletionPolicy.updateCommits newest commit = 1[segments_1]
[junit4:junit4]   2> 13675 T265 C10 P54352 oasc.SolrDeletionPolicy.onCommit SolrDeletionPolicy.onCommit: commits:num=2
[junit4:junit4]   2> 		commit{dir=MockDirWrapper(org.apache.lucene.store.SimpleFSDirectory@/mnt/ssd/jenkins/workspace/Lucene-Solr-4.x-Linux/solr/build/solr-core/test/J0/index5249952501tmp lockFactory=org.apache.lucene.store.NativeFSLockFactory@6f2f57),segFN=segments_1,generation=1,filenames=[segments_1]
[junit4:junit4]   2> 		commit{dir=MockDirWrapper(org.apache.lucene.store.SimpleFSDirectory@/mnt/ssd/jenkins/workspace/Lucene-Solr-4.x-Linux/solr/build/solr-core/test/J0/index5249952501tmp lockFactory=org.apache.lucene.store.NativeFSLockFactory@6f2f57),segFN=segments_2,generation=2,filenames=[segments_2]
[junit4:junit4]   2> 13676 T265 C10 P54352 oasc.SolrDeletionPolicy.updateCommits newest commit = 2[segments_2]
[junit4:junit4]   2> 13677 T265 C10 P54352 oass.SolrIndexSearcher.<init> Opening Searcher@d3e176 realtime
[junit4:junit4]   2> 13677 T265 C10 P54352 oasu.DirectUpdateHandler2.commit end_commit_flush
[junit4:junit4]   2> 13678 T265 C10 P54352 /update {wt=javabin&softCommit=false&commit=true&version=2&waitSearcher=true&openSearcher=false&commit_end_point=true} {commit=} 0 32
[junit4:junit4]   2> 13714 T317 C9 P34545 oash.ReplicationHandler.inform Commits will be reserved for  10000
[junit4:junit4]   2> 13714 T317 C9 P34545 oascsi.HttpClientUtil.createClient Creating new http client, config:connTimeout=5000&socketTimeout=20000&allowCompression=false&maxConnections=10000&maxConnectionsPerHost=10000
[junit4:junit4]   2> 13718 T317 C9 P34545 oash.SnapPuller.<init>  No value set for 'pollInterval'. Timer Task not started.
[junit4:junit4]   2> 13720 T264 C10 P54352 oash.ReplicationHandler.inform Commits will be reserved for  10000
[junit4:junit4]   2> 13721 T264 C10 P54352 REQ /replication {qt=/replication&wt=javabin&version=2&command=indexversion} status=0 QTime=1 
[junit4:junit4]   2> 13722 T317 C9 P34545 oash.SnapPuller.fetchLatestIndex Master's generation: 2
[junit4:junit4]   2> 13722 T317 C9 P34545 oash.SnapPuller.fetchLatestIndex Slave's generation: 1
[junit4:junit4]   2> 13723 T317 C9 P34545 oash.SnapPuller.fetchLatestIndex Starting replication process
[junit4:junit4]   2> 13725 T263 C10 P54352 REQ /replication {qt=/replication&wt=javabin&version=2&command=filelist&generation=2} status=0 QTime=0 
[junit4:junit4]   2> 13727 T317 C9 P34545 oash.SnapPuller.fetchLatestIndex Number of files in latest index in master: 1
[junit4:junit4]   2> 13729 T317 C9 P34545 oasc.CachingDirectoryFactory.get return new directory for /mnt/ssd/jenkins/workspace/Lucene-Solr-4.x-Linux/solr/build/solr-core/test/J0/./solrtest-UnloadDistributedZkTest-1362922366005/1362922374092unloadcollection1_2n/index.20130311003259728 forceNew: false
[junit4:junit4]   2> 13729 T317 C9 P34545 oash.SnapPuller.fetchLatestIndex Starting download to MockDirWrapper(org.apache.lucene.store.RAMDirectory@784600 lockFactory=org.apache.lucene.store.NativeFSLockFactory@14adf8f) fullCopy=false
[junit4:junit4]   2> 13738 T265 C10 P54352 REQ /replication {qt=/replication&file=segments_2&wt=filestream&command=filecontent&generation=2&checksum=true} status=0 QTime=3 
[junit4:junit4]   2> 13745 T317 C9 P34545 oash.SnapPuller.fetchLatestIndex Total time taken for download : 0 secs
[junit4:junit4]   2> 13748 T317 C9 P34545 oasu.DefaultSolrCoreState.newIndexWriter Creating new IndexWriter...
[junit4:junit4]   2> 13748 T317 C9 P34545 oasu.DefaultSolrCoreState.newIndexWriter Waiting until IndexWriter is unused... core=unloadcollection2
[junit4:junit4]   2> 13751 T317 C9 P34545 oasc.SolrDeletionPolicy.onInit SolrDeletionPolicy.onInit: commits:num=2
[junit4:junit4]   2> 		commit{dir=MockDirWrapper(org.apache.lucene.store.SimpleFSDirectory@/mnt/ssd/jenkins/workspace/Lucene-Solr-4.x-Linux/solr/build/solr-core/test/J0/index5249952502tmp lockFactory=org.apache.lucene.store.NativeFSLockFactory@8e5f4b),segFN=segments_1,generation=1,filenames=[segments_1]
[junit4:junit4]   2> 		commit{dir=MockDirWrapper(org.apache.lucene.store.SimpleFSDirectory@/mnt/ssd/jenkins/workspace/Lucene-Solr-4.x-Linux/solr/build/solr-core/test/J0/index5249952502tmp lockFactory=org.apache.lucene.store.NativeFSLockFactory@8e5f4b),segFN=segments_2,generation=2,filenames=[segments_2]
[junit4:junit4]   2> 13752 T317 C9 P34545 oasc.SolrDeletionPolicy.updateCommits newest commit = 2[segments_2]
[junit4:junit4]   2> 13752 T317 C9 P34545 oasu.DefaultSolrCoreState.newIndexWriter New IndexWriter is ready to be used.
[junit4:junit4]   2> 13753 T317 C9 P34545 oass.SolrIndexSearcher.<init> Opening Searcher@1646f1f main
[junit4:junit4]   2> 13754 T316 oasc.SolrCore.registerSearcher [unloadcollection2] Registered new searcher Searcher@1646f1f main{StandardDirectoryReader(segments_2:1:nrt)}
[junit4:junit4]   2> 13755 T317 C9 P34545 oash.SnapPuller.fetchLatestIndex removing temporary index download directory files MockDirWrapper(org.apache.lucene.store.RAMDirectory@784600 lockFactory=org.apache.lucene.store.NativeFSLockFactory@14adf8f)
[junit4:junit4]   2> 13756 T317 C9 P34545 oasc.RecoveryStrategy.replay No replay needed. core=unloadcollection2
[junit4:junit4]   2> 13756 T317 C9 P34545 oasc.RecoveryStrategy.doRecovery Replication Recovery was successful - registering as Active. core=unloadcollection2
[junit4:junit4]   2> 13756 T317 C9 P34545 oasc.ZkController.publish publishing core=unloadcollection2 state=active
[junit4:junit4]   2> 13756 T317 C9 P34545 oasc.ZkController.publish numShards not found on descriptor - reading it from system property
[junit4:junit4]   2> 13758 T317 C9 P34545 oasc.RecoveryStrategy.doRecovery Finished recovery process. core=unloadcollection2
[junit4:junit4]   2> 14071 T252 oascc.ZkStateReader.updateClusterState Updating cloud state from ZooKeeper... 
[junit4:junit4]   2> 14073 T252 oasc.Overseer$ClusterStateUpdater.updateState Update state numShards=2 message={
[junit4:junit4]   2> 	  "shard":"shard1",
[junit4:junit4]   2> 	  "operation":"state",
[junit4:junit4]   2> 	  "core":"unloadcollection2",
[junit4:junit4]   2> 	  "node_name":"127.0.0.1:34545_ks",
[junit4:junit4]   2> 	  "base_url":"http://127.0.0.1:34545/ks",
[junit4:junit4]   2> 	  "core_node_name":null,
[junit4:junit4]   2> 	  "collection":"unloadcollection",
[junit4:junit4]   2> 	  "state":"active",
[junit4:junit4]   2> 	  "roles":null,
[junit4:junit4]   2> 	  "numShards":"2"}
[junit4:junit4]   2> 14080 T315 oascc.ZkStateReader$2.process A cluster state change: WatchedEvent state:SyncConnected type:NodeDataChanged path:/clusterstate.json, has occurred - updating... (live nodes size: 5)
[junit4:junit4]   2> 14081 T256 oascc.ZkStateReader$2.process A cluster state change: WatchedEvent state:SyncConnected type:NodeDataChanged path:/clusterstate.json, has occurred - updating... (live nodes size: 5)
[junit4:junit4]   2> 14081 T297 oascc.ZkStateReader$2.process A cluster state change: WatchedEvent state:SyncConnected type:NodeDataChanged path:/clusterstate.json, has occurred - updating... (live nodes size: 5)
[junit4:junit4]   2> 14081 T283 oascc.ZkStateReader$2.process A cluster state change: WatchedEvent state:SyncConnected type:NodeDataChanged path:/clusterstate.json, has occurred - updating... (live nodes size: 5)
[junit4:junit4]   2> 14090 T251 oascc.ZkStateReader$2.process A cluster state change: WatchedEvent state:SyncConnected type:NodeDataChanged path:/clusterstate.json, has occurred - updating... (live nodes size: 5)
[junit4:junit4]   2> 14081 T311 oascc.ZkStateReader$2.process A cluster state change: WatchedEvent state:SyncConnected type:NodeDataChanged path:/clusterstate.json, has occurred - updating... (live nodes size: 5)
[junit4:junit4]   2> 14081 T269 oascc.ZkStateReader$2.process A cluster state change: WatchedEvent state:SyncConnected type:NodeDataChanged path:/clusterstate.json, has occurred - updating... (live nodes size: 5)
[junit4:junit4]   2> 14651 T229 oascc.ZkStateReader.updateClusterState Updating cloud state from ZooKeeper... 
[junit4:junit4]   2> 14653 T229 oasc.AbstractDistribZkTestBase.waitForRecoveriesToFinish Recoveries finished - collection: unloadcollection
[junit4:junit4]   2> 14654 T229 oascsi.HttpClientUtil.createClient Creating new http client, config:maxConnections=128&maxConnectionsPerHost=32&followRedirects=false
[junit4:junit4]   2> 14662 T291 oasc.CoreContainer.create Creating SolrCore 'unloadcollection3' using instanceDir: /mnt/ssd/jenkins/workspace/Lucene-Solr-4.x-Linux/solr/build/solr-core/test/J0/./org.apache.solr.cloud.UnloadDistributedZkTest-jetty3-1362922368825/unloadcollection3
[junit4:junit4]   2> 14663 T291 oasc.ZkController.createCollectionZkNode Check for collection zkNode:unloadcollection
[junit4:junit4]   2> 14664 T291 oasc.ZkController.createCollectionZkNode Collection zkNode exists
[junit4:junit4]   2> 14665 T291 oasc.ZkController.readConfigName Load collection config from:/collections/unloadcollection
[junit4:junit4]   2> 14667 T291 oasc.SolrResourceLoader.<init> new SolrResourceLoader for directory: '/mnt/ssd/jenkins/workspace/Lucene-Solr-4.x-Linux/solr/build/solr-core/test/J0/./org.apache.solr.cloud.UnloadDistributedZkTest-jetty3-1362922368825/unloadcollection3/'
[junit4:junit4]   2> 14708 T291 oasc.SolrConfig.<init> Using Lucene MatchVersion: LUCENE_42
[junit4:junit4]   2> 14742 T291 oasc.SolrConfig.<init> Loaded SolrConfig: solrconfig.xml
[junit4:junit4]   2> 14743 T291 oass.IndexSchema.readSchema Reading Solr Schema
[junit4:junit4]   2> 14747 T291 oass.IndexSchema.readSchema Schema name=test
[junit4:junit4]   2> 15100 T291 oass.OpenExchangeRatesOrgProvider.init Initialized with rates=open-exchange-rates.json, refreshInterval=1440.
[junit4:junit4]   2> 15105 T291 oass.IndexSchema.readSchema default search field in schema is text
[junit4:junit4]   2> 15108 T291 oass.IndexSchema.readSchema unique key field: id
[junit4:junit4]   2> 15129 T291 oass.FileExchangeRateProvider.reload Reloading exchange rates from file currency.xml
[junit4:junit4]   2> 15134 T291 oass.FileExchangeRateProvider.reload Reloading exchange rates from file currency.xml
[junit4:junit4]   2> 15140 T291 oass.OpenExchangeRatesOrgProvider.reload Reloading exchange rates from open-exchange-rates.json
[junit4:junit4]   2> 15142 T291 oass.OpenExchangeRatesOrgProvider$OpenExchangeRates.<init> WARNING Unknown key IMPORTANT NOTE
[junit4:junit4]   2> 15142 T291 oass.OpenExchangeRatesOrgProvider$OpenExchangeRates.<init> WARNING Expected key, got STRING
[junit4:junit4]   2> 15143 T291 oass.OpenExchangeRatesOrgProvider.reload Reloading exchange rates from open-exchange-rates.json
[junit4:junit4]   2> 15145 T291 oass.OpenExchangeRatesOrgProvider$OpenExchangeRates.<init> WARNING Unknown key IMPORTANT NOTE
[junit4:junit4]   2> 15145 T291 oass.OpenExchangeRatesOrgProvider$OpenExchangeRates.<init> WARNING Expected key, got STRING
[junit4:junit4]   2> 15146 T291 oasc.SolrCore.<init> [unloadcollection3] Opening new SolrCore at /mnt/ssd/jenkins/workspace/Lucene-Solr-4.x-Linux/solr/build/solr-core/test/J0/./org.apache.solr.cloud.UnloadDistributedZkTest-jetty3-1362922368825/unloadcollection3/, dataDir=/mnt/ssd/jenkins/workspace/Lucene-Solr-4.x-Linux/solr/build/solr-core/test/J0/./solrtest-UnloadDistributedZkTest-1362922366005/1362922380661unloadcollection_3n/
[junit4:junit4]   2> 15146 T291 oasc.JmxMonitoredMap.<init> JMX monitoring is enabled. Adding Solr mbeans to JMX Server: com.sun.jmx.mbeanserver.JmxMBeanServer@1b3704
[junit4:junit4]   2> 15147 T291 oasc.SolrCore.initDirectoryFactory org.apache.solr.core.MockDirectoryFactory
[junit4:junit4]   2> 15149 T291 oasc.CachingDirectoryFactory.get return new directory for /mnt/ssd/jenkins/workspace/Lucene-Solr-4.x-Linux/solr/build/solr-core/test/J0/./solrtest-UnloadDistributedZkTest-1362922366005/1362922380661unloadcollection_3n forceNew: false
[junit4:junit4]   2> 15149 T291 oasc.SolrCore.getNewIndexDir New index directory detected: old=null new=/mnt/ssd/jenkins/workspace/Lucene-Solr-4.x-Linux/solr/build/solr-core/test/J0/./solrtest-UnloadDistributedZkTest-1362922366005/1362922380661unloadcollection_3n/index/
[junit4:junit4]   2> 15150 T291 oasc.SolrCore.initIndex WARNING [unloadcollection3] Solr index directory '/mnt/ssd/jenkins/workspace/Lucene-Solr-4.x-Linux/solr/build/solr-core/test/J0/./solrtest-UnloadDistributedZkTest-1362922366005/1362922380661unloadcollection_3n/index' doesn't exist. Creating new index...
[junit4:junit4]   2> 15151 T291 oasc.CachingDirectoryFactory.get return new directory for /mnt/ssd/jenkins/workspace/Lucene-Solr-4.x-Linux/solr/build/solr-core/test/J0/./solrtest-UnloadDistributedZkTest-1362922366005/1362922380661unloadcollection_3n/index forceNew: false
[junit4:junit4]   2> 15156 T291 oasc.SolrDeletionPolicy.onCommit SolrDeletionPolicy.onCommit: commits:num=1
[junit4:junit4]   2> 		commit{dir=MockDirWrapper(org.apache.lucene.store.SimpleFSDirectory@/mnt/ssd/jenkins/workspace/Lucene-Solr-4.x-Linux/solr/build/solr-core/test/J0/index5249952503tmp lockFactory=org.apache.lucene.store.NativeFSLockFactory@104f922),segFN=segments_1,generation=1,filenames=[segments_1]
[junit4:junit4]   2> 15157 T291 oasc.SolrDeletionPolicy.updateCommits newest commit = 1[segments_1]
[junit4:junit4]   2> 15159 T291 oasup.UpdateRequestProcessorChain.init inserting DistributedUpdateProcessorFactory into updateRequestProcessorChain "dedupe"
[junit4:junit4]   2> 15160 T291 oasup.UpdateRequestProcessorChain.init inserting DistributedUpdateProcessorFactory into updateRequestProcessorChain "stored_sig"
[junit4:junit4]   2> 15161 T291 oasup.UpdateRequestProcessorChain.init inserting DistributedUpdateProcessorFactory into updateRequestProcessorChain "distrib-dup-test-chain-implicit"
[junit4:junit4]   2> 15162 T291 oasc.RequestHandlers.initHandlersFromConfig created standard: solr.StandardRequestHandler
[junit4:junit4]   2> 15163 T291 oasc.RequestHandlers.initHandlersFromConfig created /get: solr.RealTimeGetHandler
[junit4:junit4]   2> 15164 T291 oasc.RequestHandlers.initHandlersFromConfig adding lazy requestHandler: solr.ReplicationHandler
[junit4:junit4]   2> 15164 T291 oasc.RequestHandlers.initHandlersFromConfig created /replication: solr.ReplicationHandler
[junit4:junit4]   2> 15165 T291 oasc.RequestHandlers.initHandlersFromConfig created /update: solr.UpdateRequestHandler
[junit4:junit4]   2> 15166 T291 oasc.RequestHandlers.initHandlersFromConfig created /admin/: org.apache.solr.handler.admin.AdminHandlers
[junit4:junit4]   2> 15171 T291 oashl.XMLLoader.init xsltCacheLifetimeSeconds=60
[junit4:junit4]   2> 15176 T291 oass.SolrIndexSearcher.<init> Opening Searcher@de7ef1 main
[junit4:junit4]   2> 15177 T291 oasu.UpdateHandler.clearLog Clearing tlog files, tlogDir=/mnt/ssd/jenkins/workspace/Lucene-Solr-4.x-Linux/solr/build/solr-core/test/J0/./solrtest-UnloadDistributedZkTest-1362922366005/1362922380661unloadcollection_3n/tlog
[junit4:junit4]   2> 15178 T291 oasu.CommitTracker.<init> Hard AutoCommit: disabled
[junit4:junit4]   2> 15179 T291 oasu.CommitTracker.<init> Soft AutoCommit: disabled
[junit4:junit4]   2> 15184 T320 oasc.SolrCore.registerSearcher [unloadcollection3] Registered new searcher Searcher@de7ef1 main{StandardDirectoryReader(segments_1:1)}
[junit4:junit4]   2> 15186 T291 oasc.ZkController.publish publishing core=unloadcollection3 state=down
[junit4:junit4]   2> 15186 T291 oasc.ZkController.publish numShards not found on descriptor - reading it from system property
[junit4:junit4]   2> 15600 T252 oascc.ZkStateReader.updateClusterState Updating cloud state from ZooKeeper... 
[junit4:junit4]   2> 15601 T252 oasc.Overseer$ClusterStateUpdater.updateState Update state numShards=2 message={
[junit4:junit4]   2> 	  "shard":null,
[junit4:junit4]   2> 	  "operation":"state",
[junit4:junit4]   2> 	  "core":"unloadcollection3",
[junit4:junit4]   2> 	  "node_name":"127.0.0.1:40211_ks",
[junit4:junit4]   2> 	  "base_url":"http://127.0.0.1:40211/ks",
[junit4:junit4]   2> 	  "core_node_name":null,
[junit4:junit4]   2> 	  "collection":"unloadcollection",
[junit4:junit4]   2> 	  "state":"down",
[junit4:junit4]   2> 	  "roles":null,
[junit4:junit4]   2> 	  "numShards":"2"}
[junit4:junit4]   2> 15602 T252 oasc.Overseer$ClusterStateUpdater.updateState Collection already exists with numShards=1
[junit4:junit4]   2> 15602 T252 oasc.Overseer$ClusterStateUpdater.updateState Assigning new node to shard shard=shard1
[junit4:junit4]   2> 15612 T315 oascc.ZkStateReader$2.process A cluster state change: WatchedEvent state:SyncConnected type:NodeDataChanged path:/clusterstate.json, has occurred - updating... (live nodes size: 5)
[junit4:junit4]   2> 15612 T251 oascc.ZkStateReader$2.process A cluster state change: WatchedEvent state:SyncConnected type:NodeDataChanged path:/clusterstate.json, has occurred - updating... (live nodes size: 5)
[junit4:junit4]   2> 15612 T297 oascc.ZkStateReader$2.process A cluster state change: WatchedEvent state:SyncConnected type:NodeDataChanged path:/clusterstate.json, has occurred - updating... (live nodes size: 5)
[junit4:junit4]   2> 15613 T311 oascc.ZkStateReader$2.process A cluster state change: WatchedEvent state:SyncConnected type:NodeDataChanged path:/clusterstate.json, has occurred - updating... (live nodes size: 5)
[junit4:junit4]   2> 15612 T269 oascc.ZkStateReader$2.process A cluster state change: WatchedEvent state:SyncConnected type:NodeDataChanged path:/clusterstate.json, has occurred - updating... (live nodes size: 5)
[junit4:junit4]   2> 15612 T256 oascc.ZkStateReader$2.process A cluster state change: WatchedEvent state:SyncConnected type:NodeDataChanged path:/clusterstate.json, has occurred - updating... (live nodes size: 5)
[junit4:junit4]   2> 15612 T283 oascc.ZkStateReader$2.process A cluster state change: WatchedEvent state:SyncConnected type:NodeDataChanged path:/clusterstate.json, has occurred - updating... (live nodes size: 5)
[junit4:junit4]   2> 16189 T291 oasc.CoreContainer.registerCore registering core: unloadcollection3
[junit4:junit4]   2> 16189 T291 oasc.ZkController.register Register replica - core:unloadcollection3 address:http://127.0.0.1:40211/ks collection:unloadcollection shard:shard1
[junit4:junit4]   2> 16196 T291 oasc.ZkController.register We are http://127.0.0.1:40211/ks/unloadcollection3/ and leader is http://127.0.0.1:54352/ks/unloadcollection1/
[junit4:junit4]   2> 16197 T291 oasc.ZkController.register No LogReplay needed for core=unloadcollection3 baseURL=http://127.0.0.1:40211/ks
[junit4:junit4]   2> 16197 T291 oasc.ZkController.checkRecovery Core needs to recover:unloadcollection3
[junit4:junit4]   2> 16197 T291 oasu.DefaultSolrCoreState.doRecovery Running recovery - first canceling any ongoing recovery
[junit4:junit4]   2> ASYNC  NEW_CORE C11 name=unloadcollection3 org.apache.solr.core.SolrCore@1605ed3 url=http://127.0.0.1:40211/ks/unloadcollection3 node=127.0.0.1:40211_ks C11_STATE=coll:unloadcollection core:unloadcollection3 props:{core=unloadcollection3, node_name=127.0.0.1:40211_ks, base_url=http://127.0.0.1:40211/ks, collection=unloadcollection, state=down}
[junit4:junit4]   2> 16198 T321 C11 P40211 oasc.RecoveryStrategy.run Starting recovery process.  core=unloadcollection3 recoveringAfterStartup=true
[junit4:junit4]   2> 16200 T321 C11 P40211 oasc.RecoveryStrategy.doRecovery ###### startupVersions=[]
[junit4:junit4]   2> 16200 T321 C11 P40211 oasc.ZkController.publish publishing core=unloadcollection3 state=recovering
[junit4:junit4]   2> 16200 T291 oascc.ZkStateReader.updateClusterState Updating cloud state from ZooKeeper... 
[junit4:junit4]   2> 16200 T321 C11 P40211 oasc.ZkController.publish numShards not found on descriptor - reading it from system property
[junit4:junit4]   2> 16202 T291 oasc.CoreContainer.persistFile Persisting cores config to /mnt/ssd/jenkins/workspace/Lucene-Solr-4.x-Linux/solr/build/solr-core/test/J0/./org.apache.solr.cloud.UnloadDistributedZkTest-jetty3-1362922368825/solr.xml
[junit4:junit4]   2> 16203 T321 C11 P40211 oascsi.HttpClientUtil.createClient Creating new http client, config:maxConnections=128&maxConnectionsPerHost=32&followRedirects=false
[junit4:junit4]   2> 16215 T291 oasc.SolrXMLSerializer.persistFile Persisting cores config to /mnt/ssd/jenkins/workspace/Lucene-Solr-4.x-Linux/solr/build/solr-core/test/J0/./org.apache.solr.cloud.UnloadDistributedZkTest-jetty3-1362922368825/solr.xml
[junit4:junit4]   2> 16216 T291 oass.SolrDispatchFilter.handleAdminRequest /admin/cores {action=CREATE&name=unloadcollection3&wt=javabin&version=2&dataDir=/mnt/ssd/jenkins/workspace/Lucene-Solr-4.x-Linux/solr/build/solr-core/test/J0/./solrtest-UnloadDistributedZkTest-1362922366005/1362922380661unloadcollection_3n&collection=unloadcollection} status=0 QTime=1554 
[junit4:junit4]   2> 16217 T229 oasc.AbstractDistribZkTestBase.waitForRecoveriesToFinish Wait for recoveries to finish - collection: unloadcollection failOnTimeout:true timeout (sec):230
[junit4:junit4]   2> 16219 T229 oascc.ZkStateReader.updateClusterState Updating cloud state from ZooKeeper... 
[junit4:junit4]   2> 17122 T252 oascc.ZkStateReader.updateClusterState Updating cloud state from ZooKeeper... 
[junit4:junit4]   2> 17124 T252 oasc.Overseer$ClusterStateUpdater.updateState Update state numShards=2 message={
[junit4:junit4]   2> 	  "shard":"shard1",
[junit4:junit4]   2> 	  "operation":"state",
[junit4:junit4]   2> 	  "core":"unloadcollection3",
[junit4:junit4]   2> 	  "node_name":"127.0.0.1:40211_ks",
[junit4:junit4]   2> 	  "base_url":"http://127.0.0.1:40211/ks",
[junit4:junit4]   2> 	  "core_node_name":null,
[junit4:junit4]   2> 	  "collection":"unloadcollection",
[junit4:junit4]   2> 	  "state":"recovering",
[junit4:junit4]   2> 	  "roles":null,
[junit4:junit4]   2> 	  "numShards":"2"}
[junit4:junit4]   2> 17131 T256 oascc.ZkStateReader$2.process A cluster state change: WatchedEvent state:SyncConnected type:NodeDataChanged path:/clusterstate.json, has occurred - updating... (live nodes size: 5)
[junit4:junit4]   2> 17131 T311 oascc.ZkStateReader$2.process A cluster state change: WatchedEvent state:SyncConnected type:NodeDataChanged path:/clusterstate.json, has occurred - updating... (live nodes size: 5)
[junit4:junit4]   2> 17132 T251 oascc.ZkStateReader$2.process A cluster state change: WatchedEvent state:SyncConnected type:NodeDataChanged path:/clusterstate.json, has occurred - updating... (live nodes size: 5)
[junit4:junit4]   2> 17132 T297 oascc.ZkStateReader$2.process A cluster state change: WatchedEvent state:SyncConnected type:NodeDataChanged path:/clusterstate.json, has occurred - updating... (live nodes size: 5)
[junit4:junit4]   2> 17131 T269 oascc.ZkStateReader$2.process A cluster state change: WatchedEvent state:SyncConnected type:NodeDataChanged path:/clusterstate.json, has occurred - updating... (live nodes size: 5)
[junit4:junit4]   2> 17131 T315 oascc.ZkStateReader$2.process A cluster state change: WatchedEvent state:SyncConnected type:NodeDataChanged path:/clusterstate.json, has occurred - updating... (live nodes size: 5)
[junit4:junit4]   2> 17132 T283 oascc.ZkStateReader$2.process A cluster state change: WatchedEvent state:SyncConnected type:NodeDataChanged path:/clusterstate.json, has occurred - updating... (live nodes size: 5)
[junit4:junit4]   2> 17211 T264 oass.SolrDispatchFilter.handleAdminRequest /admin/cores {action=PREPRECOVERY&wt=javabin&version=2&coreNodeName=127.0.0.1:40211_ks_unloadcollection3&core=unloadcollection1&checkLive=true&nodeName=127.0.0.1:40211_ks&onlyIfLeader=true&state=recovering} status=0 QTime=1001 
[junit4:junit4]   2> 17222 T229 oascc.ZkStateReader.updateClusterState Updating cloud state from ZooKeeper... 
[junit4:junit4]   2> 18225 T229 oascc.ZkStateReader.updateClusterState Updating cloud state from ZooKeeper... 
[junit4:junit4]   2>  C11_STATE=coll:unloadcollection core:unloadcollection3 props:{shard=shard1, core=unloadcollection3, node_name=127.0.0.1:40211_ks, base_url=http://127.0.0.1:40211/ks, collection=unloadcollection, state=recovering}
[junit4:junit4]   2> 19212 T321 C11 P40211 oasc.RecoveryStrategy.doRecovery Attempting to PeerSync from http://127.0.0.1:54352/ks/unloadcollection1/ core=unloadcollection3 - recoveringAfterStartup=true
[junit4:junit4]   2> 19213 T321 C11 P40211 oasu.PeerSync.sync PeerSync: core=unloadcollection3 url=http://127.0.0.1:40211/ks START replicas=[http://127.0.0.1:54352/ks/unloadcollection1/] nUpdates=100
[junit4:junit4]   2> 19213 T321 C11 P40211 oasu.PeerSync.sync WARNING no frame of reference to tell of we've missed updates
[junit4:junit4]   2> 19213 T321 C11 P40211 oasc.RecoveryStrategy.doRecovery PeerSync Recovery was not successful - trying replication. core=unloadcollection3
[junit4:junit4]   2> 19214 T321 C11 P40211 oasc.RecoveryStrategy.doRecovery Starting Replication Recovery. core=unloadcollection3
[junit4:junit4]   2> 19214 T321 C11 P40211 oasc.RecoveryStrategy.doRecovery Begin buffering updates. core=unloadcollection3
[junit4:junit4]   2> 19214 T321 C11 P40211 oasu.UpdateLog.bufferUpdates Starting to buffer updates. FSUpdateLog{state=ACTIVE, tlog=null}
[junit4:junit4]   2> 19215 T321 C11 P40211 oasc.RecoveryStrategy.replicate Attempting to replicate from http://127.0.0.1:54352/ks/unloadcollection1/. core=unloadcollection3
[junit4:junit4]   2> 19215 T321 C11 P40211 oascsi.HttpClientUtil.createClient Creating new http client, config:maxConnections=128&maxConnectionsPerHost=32&followRedirects=false
[junit4:junit4]   2> 19216 T264 C10 P54352 REQ /get {getVersions=100&qt=/get&wt=javabin&version=2&distrib=false} status=0 QTime=0 
[junit4:junit4]   2> 19223 T265 C10 P54352 oasu.DirectUpdateHandler2.commit start commit{,optimize=false,openSearcher=false,waitSearcher=true,expungeDeletes=false,softCommit=false,prepareCommit=false}
[junit4:junit4]   2> 19228 T229 oascc.ZkStateReader.updateClusterState Updating cloud state from ZooKeeper... 
[junit4:junit4]   2> 19235 T265 C10 P54352 oasc.SolrDeletionPolicy.onCommit SolrDeletionPolicy.onCommit: commits:num=2
[junit4:junit4]   2> 		commit{dir=MockDirWrapper(org.apache.lucene.store.SimpleFSDirectory@/mnt/ssd/jenkins/workspace/Lucene-Solr-4.x-Linux/solr/build/solr-core/test/J0/index5249952501tmp lockFactory=org.apache.lucene.store.NativeFSLockFactory@6f2f57),segFN=segments_2,generation=2,filenames=[segments_2]
[junit4:junit4]   2> 		commit{dir=MockDirWrapper(org.apache.lucene.store.SimpleFSDirectory@/mnt/ssd/jenkins/workspace/Lucene-Solr-4.x-Linux/solr/build/solr-core/test/J0/index5249952501tmp lockFactory=org.apache.lucene.store.NativeFSLockFactory@6f2f57),segFN=segments_3,generation=3,filenames=[segments_3]
[junit4:junit4]   2> 19236 T265 C10 P54352 oasc.SolrDeletionPolicy.updateCommits newest commit = 3[segments_3]
[junit4:junit4]   2> 19237 T265 C10 P54352 oasu.DirectUpdateHandler2.commit end_commit_flush
[junit4:junit4]   2> 19237 T265 C10 P54352 /update {wt=javabin&softCommit=false&commit=true&version=2&waitSearcher=true&openSearcher=false&commit_end_point=true} {commit=} 0 14
[junit4:junit4]   2> 19239 T321 C11 P40211 oash.ReplicationHandler.inform Commits will be reserved for  10000
[junit4:junit4]   2> 19239 T321 C11 P40211 oash.SnapPuller.<init>  No value set for 'pollInterval'. Timer Task not started.
[junit4:junit4]   2> 19242 T263 C10 P54352 REQ /replication {qt=/replication&wt=javabin&version=2&command=indexversion} status=0 QTime=0 
[junit4:junit4]   2> 19242 T321 C11 P40211 oash.SnapPuller.fetchLatestIndex Master's generation: 3
[junit4:junit4]   2> 19243 T321 C11 P40211 oash.SnapPuller.fetchLatestIndex Slave's generation: 1
[junit4:junit4]   2> 19243 T321 C11 P40211 oash.SnapPuller.fetchLatestIndex Starting replication process
[junit4:junit4]   2> 19246 T264 C10 P54352 REQ /replication {qt=/replication&wt=javabin&version=2&command=filelist&generation=3} status=0 QTime=1 
[junit4:junit4]   2> 19247 T321 C11 P40211 oash.SnapPuller.fetchLatestIndex Number of files in latest index in master: 1
[junit4:junit4]   2> 19247 T321 C11 P40211 oasc.CachingDirectoryFactory.get return new directory for /mnt/ssd/jenkins/workspace/Lucene-Solr-4.x-Linux/solr/build/solr-core/test/J0/./solrtest-UnloadDistributedZkTest-1362922366005/1362922380661unloadcollection_3n/index.20130311003305248 forceNew: false
[junit4:junit4]   2> 19248 T321 C11 P40211 oash.SnapPuller.fetchLatestIndex Starting download to MockDirWrapper(org.apache.lucene.store.RAMDirectory@176c4be lockFactory=org.apache.lucene.store.NativeFSLockFactory@6b4d22) fullCopy=false
[junit4:junit4]   2> 19250 T265 C10 P54352 REQ /replication {qt=/replication&file=segments_3&wt=filestream&command=filecontent&generation=3&checksum=true} status=0 QTime=0 
[junit4:junit4]   2> 19252 T321 C11 P40211 oash.SnapPuller.fetchLatestIndex Total time taken for download : 0 secs
[junit4:junit4]   2> 19252 T321 C11 P40211 oasu.DefaultSolrCoreState.newIndexWriter Creating new IndexWriter...
[junit4:junit4]   2> 19253 T321 C11 P40211 oasu.DefaultSolrCoreState.newIndexWriter Waiting until IndexWriter is unused... core=unloadcollection3
[junit4:junit4]   2> 19254 T321 C11 P40211 oasc.SolrDeletionPolicy.onInit SolrDeletionPolicy.onInit: commits:num=2
[junit4:junit4]   2> 		commit{dir=MockDirWrapper(org.apache.lucene.store.SimpleFSDirectory@/mnt/ssd/jenkins/workspace/Lucene-Solr-4.x-Linux/solr/build/solr-core/test/J0/index5249952503tmp lockFactory=org.apache.lucene.store.NativeFSLockFactory@104f922),segFN=segments_1,generation=1,filenames=[segments_1]
[junit4:junit4]   2> 		commit{dir=MockDirWrapper(org.apache.lucene.store.SimpleFSDirectory@/mnt/ssd/jenkins/workspace/Lucene-Solr-4.x-Linux/solr/build/solr-core/test/J0/index5249952503tmp lockFactory=org.apache.lucene.store.NativeFSLockFactory@104f922),segFN=segments_3,generation=3,filenames=[segments_3]
[junit4:junit4]   2> 19254 T321 C11 P40211 oasc.SolrDeletionPolicy.updateCommits newest commit = 3[segments_3]
[junit4:junit4]   2> 19255 T321 C11 P40211 oasu.DefaultSolrCoreState.newIndexWriter New IndexWriter is ready to be used.
[junit4:junit4]   2> 19255 T321 C11 P40211 oass.SolrIndexSearcher.<init> Opening Searcher@1c65a2a main
[junit4:junit4]   2> 19256 T320 oasc.SolrCore.registerSearcher [unloadcollection3] Registered new searcher Searcher@1c65a2a main{StandardDirectoryReader(segments_3:1:nrt)}
[junit4:junit4]   2> 19257 T321 C11 P40211 oash.SnapPuller.fetchLatestIndex removing temporary index download directory files MockDirWrapper(org.apache.lucene.store.RAMDirectory@176c4be lockFactory=org.apache.lucene.store.NativeFSLockFactory@6b4d22)
[junit4:junit4]   2> 19257 T321 C11 P40211 oasc.RecoveryStrategy.replay No replay needed. core=unloadcollection3
[junit4:junit4]   2> 19257 T321 C11 P40211 oasc.RecoveryStrategy.doRecovery Replication Recovery was successful - registering as Active. core=unloadcollection3
[junit4:junit4]   2> 19257 T321 C11 P40211 oasc.ZkController.publish publishing core=unloadcollection3 state=active
[junit4:junit4]   2> 19257 T321 C11 P40211 oasc.ZkController.publish numShards not found on descriptor - reading it from system property
[junit4:junit4]   2> 19259 T321 C11 P40211 oasc.RecoveryStrategy.doRecovery Finished recovery process. core=unloadcollection3
[junit4:junit4]   2> 20144 T252 oascc.ZkStateReader.updateClusterState Updating cloud state from ZooKeeper... 
[junit4:junit4]   2> 20145 T252 oasc.Overseer$ClusterStateUpdater.updateState Update state numShards=2 message={
[junit4:junit4]   2> 	  "shard":"shard1",
[junit4:junit4]   2> 	  "operation":"state",
[junit4:junit4]   2> 	  "core":"unloadcollection3",
[junit4:junit4]   2> 	  "node_name":"127.0.0.1:40211_ks",
[junit4:junit4]   2> 	  "base_url":"http://127.0.0.1:40211/ks",
[junit4:junit4]   2> 	  "core_node_name":null,
[junit4:junit4]   2> 	  "collection":"unloadcollection",
[junit4:junit4]   2> 	  "state":"active",
[junit4:junit4]   2> 	  "roles":null,
[junit4:junit4]   2> 	  "numShards":"2"}
[junit4:junit4]   2> 20156 T269 oascc.ZkStateReader$2.process A cluster state change: WatchedEvent state:SyncConnected type:NodeDataChanged path:/clusterstate.json, has occurred - updating... (live nodes size: 5)
[junit4:junit4]   2> 20156 T256 oascc.ZkStateReader$2.process A cluster state change: WatchedEvent state:SyncConnected type:NodeDataChanged path:/clusterstate.json, has occurred - updating... (live nodes size: 5)
[junit4:junit4]   2> 20156 T311 oascc.ZkStateReader$2.process A cluster state change: WatchedEvent state:SyncConnected type:NodeDataChanged path:/clusterstate.json, has occurred - updating... (live nodes size: 5)
[junit4:junit4]   2> 20156 T297 oascc.ZkStateReader$2.process A cluster state change: WatchedEvent state:SyncConnected type:NodeDataChanged path:/clusterstate.json, has occurred - updating... (live nodes size: 5)
[junit4:junit4]   2> 20156 T315 oascc.ZkStateReader$2.process A cluster state change: WatchedEvent state:SyncConnected type:NodeDataChanged path:/clusterstate.json, has occurred - updating... (live nodes size: 5)
[junit4:junit4]   2> 20156 T283 oascc.ZkStateReader$2.process A cluster state change: WatchedEvent state:SyncConnected type:NodeDataChanged path:/clusterstate.json, has occurred - updating... (live nodes size: 5)
[junit4:junit4]   2> 20156 T251 oascc.ZkStateReader$2.process A cluster state change: WatchedEvent state:SyncConnected type:NodeDataChanged path:/clusterstate.json, has occurred - updating... (live nodes size: 5)
[junit4:junit4]   2> 20231 T229 oascc.ZkStateReader.updateClusterState Updating cloud state from ZooKeeper... 
[junit4:junit4]   2> 20233 T229 oasc.AbstractDistribZkTestBase.waitForRecoveriesToFinish Recoveries finished - collection: unloadcollection
[junit4:junit4]   2> 20233 T229 oascsi.HttpClientUtil.createClient Creating new http client, config:maxConnections=128&maxConnectionsPerHost=32&followRedirects=false
[junit4:junit4]   2>  C11_STATE=coll:unloadcollection core:unloadcollection3 props:{shard=shard1, core=unloadcollection3, node_name=127.0.0.1:40211_ks, base_url=http://127.0.0.1:40211/ks, collection=unloadcollection, state=active}
[junit4:junit4]   2> 20272 T293 C11 P40211 /update {update.distrib=FROMLEADER&wt=javabin&distrib.from=http://127.0.0.1:54352/ks/unloadcollection1/&version=2} {add=[20 (1429127704099160064)]} 0 2
[junit4:junit4]   2>  C9_STATE=coll:unloadcollection core:unloadcollection2 props:{shard=shard1, core=unloadcollection2, node_name=127.0.0.1:34545_ks, base_url=http://127.0.0.1:34545/ks, collection=unloadcollection, state=active}
[junit4:junit4]   2> 20279 T276 C9 P34545 /update {update.distrib=FROMLEADER&wt=javabin&distrib.from=http://127.0.0.1:54352/ks/unloadcollection1/&version=2} {add=[20 (1429127704099160064)]} 0 3
[junit4:junit4]   2> 20280 T262 C10 P54352 /update {update.distrib=TOLEADER&wt=javabin&distrib.from=http://127.0.0.1:40211/ks/unloadcollection3/&version=2} {add=[20 (1429127704099160064)]} 0 17
[junit4:junit4]   2> 20281 T292 C11 P40211 /update {wt=javabin&version=2} {add=[20]} 0 32
[junit4:junit4]   2> 20293 T279 C9 P34545 /update {update.distrib=FROMLEADER&wt=javabin&distrib.from=http://127.0.0.1:54352/ks/unloadcollection1/&version=2} {add=[21 (1429127704124325888)]} 0 2
[junit4:junit4]   2> 20293 T291 C11 P40211 /update {update.distrib=FROMLEADER&wt=javabin&distrib.from=http://127.0.0.1:54352/ks/unloadcollection1/&version=2} {add=[21 (1429127704124325888)]} 0 1
[junit4:junit4]   2> 20294 T263 C10 P54352 /update {update.distrib=TOLEADER&wt=javabin&distrib.from=http://127.0.0.1:40211/ks/unloadcollection3/&version=2} {add=[21 (1429127704124325888)]} 0 7
[junit4:junit4]   2> 20295 T290 C11 P40211 /update {wt=javabin&version=2} {add=[21]} 0 10
[junit4:junit4]   2> 20307 T292 C11 P40211 /update {update.distrib=FROMLEADER&wt=javabin&distrib.from=http://127.0.0.1:54352/ks/unloadcollection1/&version=2} {add=[22 (1429127704139005952)]} 0 1
[junit4:junit4]   2> 20307 T277 C9 P34545 /update {update.distrib=FROMLEADER&wt=javabin&distrib.from=http://127.0.0.1:54352/ks/unloadcollection1/&version=2} {add=[22 (1429127704139005952)]} 0 1
[junit4:junit4]   2> 20308 T264 C10 P54352 /update {update.distrib=TOLEADER&wt=javabin&distrib.from=http://127.0.0.1:40211/ks/unloadcollection3/&version=2} {add=[22 (1429127704139005952)]} 0 7
[junit4:junit4]   2> 20309 T293 C11 P40211 /update {wt=javabin&version=2} {add=[22]} 0 10
[junit4:junit4]   2> 20320 T290 C11 P40211 /update {update.distrib=FROMLEADER&wt=javabin&distrib.from=http://127.0.0.1:54352/ks/unloadcollection1/&version=2} {add=[23 (1429127704153686016)]} 0 1
[junit4:junit4]   2> 20320 T278 C9 P34545 /update {update.distrib=FROMLEADER&wt=javabin&distrib.from=http://127.0.0.1:54352/ks/unloadcollection1/&version=2} {add=[23 (1429127704153686016)]} 0 1
[junit4:junit4]   2> 20321 T265 C10 P54352 /update {update.distrib=TOLEADER&wt=javabin&distrib.from=http://127.0.0.1:40211/ks/unloadcollection3/&version=2} {add=[23 (1429127704153686016)]} 0 6
[junit4:junit4]   2> 20323 T291 C11 P40211 /update {wt=javabin&version=2} {add=[23]} 0 11
[junit4:junit4]   2> 20333 T293 C11 P40211 /update {update.distrib=FROMLEADER&wt=javabin&distrib.from=http://127.0.0.1:54352/ks/unloadcollection1/&version=2} {add=[24 (1429127704167317504)]} 0 1
[junit4:junit4]   2> 20333 T276 C9 P34545 /update {update.distrib=FROMLEADER&wt=javabin&distrib.from=http://127.0.0.1:54352/ks/unloadcollection1/&version=2} {add=[24 (1429127704167317504)]} 0 1
[junit4:junit4]   2> 20335 T262 C10 P54352 /update {update.distrib=TOLEADER&wt=javabin&distrib.from=http://127.0.0.1:40211/ks/unloadcollection3/&version=2} {add=[24 (1429127704167317504)]} 0 7
[junit4:junit4]   2> 20336 T292 C11 P40211 /update {wt=javabin&version=2} {add=[24]} 0 10
[junit4:junit4]   2> 20347 T291 C11 P40211 /update {update.distrib=FROMLEADER&wt=javabin&distrib.from=http://127.0.0.1:54352/ks/unloadcollection1/&version=2} {add=[25 (1429127704180948992)]} 0 2
[junit4:junit4]   2> 20347 T279 C9 P34545 /update {update.distrib=FROMLEADER&wt=javabin&distrib.from=http://127.0.0.1:54352/ks/unloadcollection1/&version=2} {add=[25 (1429127704180948992)]} 0 2
[junit4:junit4]   2> 20348 T263 C10 P54352 /update {update.distrib=TOLEADER&wt=javabin&distrib.from=http://127.0.0.1:40211/ks/unloadcollection3/&version=2} {add=[25 (1429127704180948992)]} 0 7
[junit4:junit4]   2> 20349 T290 C11 P40211 /update {wt=javabin&version=2} {add=[25]} 0 10
[junit4:junit4]   2> 20360 T292 C11 P40211 /update {update.distrib=FROMLEADER&wt=javabin&distrib.from=http://127.0.0.1:54352/ks/unloadcollection1/&version=2} {add=[26 (1429127704195629056)]} 0 2
[junit4:junit4]   2> 20360 T277 C9 P34545 /update {update.distrib=FROMLEADER&wt=javabin&distrib.from=http://127.0.0.1:54352/ks/unloadcollection1/&version=2} {add=[26 (1429127704195629056)]} 0 2
[junit4:junit4]   2> 20361 T264 C10 P54352 /update {update.distrib=TOLEADER&wt=javabin&distrib.from=http://127.0.0.1:40211/ks/unloadcollection3/&version=2} {add=[26 (1429127704195629056)]} 0 6
[junit4:junit4]   2> 20362 T293 C11 P40211 /update {wt=javabin&version=2} {add=[26]} 0 10
[junit4:junit4]   2> 20372 T278 C9 P34545 /update {update.distrib=FROMLEADER&wt=javabin&distrib.from=http://127.0.0.1:54352/ks/unloadcollection1/&version=2} {add=[27 (1429127704209260544)]} 0 1
[junit4:junit4]   2> 20372 T290 C11 P40211 /update {update.distrib=FROMLEADER&wt=javabin&distrib.from=http://127.0.0.1:54352/ks/unloadcollection1/&version=2} {add=[27 (1429127704209260544)]} 0 1
[junit4:junit4]   2> 20374 T265 C10 P54352 /update {update.distrib=TOLEADER&wt=javabin&distrib.from=http://127.0.0.1:40211/ks/unloadcollection3/&version=2} {add=[27 (1429127704209260544)]} 0 6
[junit4:junit4]   2> 20375 T291 C11 P40211 /update {wt=javabin&version=2} {add=[27]} 0 10
[junit4:junit4]   2> 20385 T276 C9 P34545 /update {update.distrib=FROMLEADER&wt=javabin&distrib.from=http://127.0.0.1:54352/ks/unloadcollection1/&version=2} {add=[28 (1429127704222892032)]} 0 1
[junit4:junit4]   2> 20385 T293 C11 P40211 /update {update.distrib=FROMLEADER&wt=javabin&distrib.from=http://127.0.0.1:54352/ks/unloadcollection1/&version=2} {add=[28 (1429127704222892032)]} 0 1
[junit4:junit4]   2> 20387 T262 C10 P54352 /update {update.distrib=TOLEADER&wt=javabin&distrib.from=http://127.0.0.1:40211/ks/unloadcollection3/&version=2} {add=[28 (1429127704222892032)]} 0 7
[junit4:junit4]   2> 20388 T292 C11 P40211 /update {wt=javabin&version=2} {add=[28]} 0 10
[junit4:junit4]   2> 20398 T291 C11 P40211 /update {update.distrib=FROMLEADER&wt=javabin&distrib.from=http://127.0.0.1:54352/ks/unloadcollection1/&version=2} {add=[29 (1429127704235474944)]} 0 1
[junit4:junit4]   2> 20398 T279 C9 P34545 /update {update.distrib=FROMLEADER&wt=javabin&distrib.from=http://127.0.0.1:54352/ks/unloadcollection1/&version=2} {add=[29 (1429127704235474944)]} 0 1
[junit4:junit4]   2> 20400 T263 C10 P54352 /update {update.distrib=TOLEADER&wt=javabin&distrib.from=http://127.0.0.1:40211/ks/unloadcollection3/&version=2} {add=[29 (1429127704235474944)]} 0 7
[junit4:junit4]   2> 20401 T290 C11 P40211 /update {wt=javabin&version=2} {add=[29]} 0 10
[junit4:junit4]   2> 20411 T277 C9 P34545 /update {update.distrib=FROMLEADER&wt=javabin&distrib.from=http://127.0.0.1:54352/ks/unloadcollection1/&version=2} {add=[30 (1429127704250155008)]} 0 1
[junit4:junit4]   2> 20411 T292 C11 P40211 /update {update.distrib=FROMLEADER&wt=javabin&distrib.from=http://127.0.0.1:54352/ks/unloadcollection1/&version=2} {add=[30 (1429127704250155008)]} 0 1
[junit4:junit4]   2> 20413 T264 C10 P54352 /update {update.distrib=TOLEADER&wt=javabin&distrib.from=http://127.0.0.1:40211/ks/unloadcollection3/&version=2} {add=[30 (1429127704250155008)]} 0 7
[junit4:junit4]   2> 20414 T293 C11 P40211 /update {wt=javabin&version=2} {add=[30]} 0 10
[junit4:junit4]   2> 20424 T278 C9 P34545 /update {update.distrib=FROMLEADER&wt=javabin&distrib.from=http://127.0.0.1:54352/ks/unloadcollection1/&version=2} {add=[31 (1429127704262737920)]} 0 1
[junit4:junit4]   2> 20424 T290 C11 P40211 /update {update.distrib=FROMLEADER&wt=javabin&distrib.from=http://127.0.0.1:54352/ks/unloadcollection1/&version=2} {add=[31 (1429127704262737920)]} 0 1
[junit4:junit4]   2> 20425 T265 C10 P54352 /update {update.distrib=TOLEADER&wt=javabin&distrib.from=http://127.0.0.1:40211/ks/unloadcollection3/&version=2} {add=[31 (1429127704262737920)]} 0 6
[junit4:junit4]   2> 20426 T291 C11 P40211 /update {wt=javabin&version=2} {add=[31]} 0 9
[junit4:junit4]   2> 20436 T276 C9 P34545 /update {update.distrib=FROMLEADER&wt=javabin&distrib.from=http://127.0.0.1:54352/ks/unloadcollection1/&version=2} {add=[32 (1429127704276369408)]} 0 1
[junit4:junit4]   2> 20436 T293 C11 P40211 /update {update.distrib=FROMLEADER&wt=javabin&distrib.from=http://127.0.0.1:54352/ks/unloadcollection1/&version=2} {add=[32 (1429127704276369408)]} 0 1
[junit4:junit4]   2> 20438 T262 C10 P54352 /update {update.distrib=TOLEADER&wt=javabin&distrib.from=http://127.0.0.1:40211/ks/unloadcollection3/&version=2} {add=[32 (1429127704276369408)]} 0 6
[junit4:junit4]   2> 20439 T292 C11 P40211 /update {wt=javabin&version=2} {add=[32]} 0 10
[junit4:junit4]   2> 20449 T291 C11 P40211 /update {update.distrib=FROMLEADER&wt=javabin&distrib.from=http://127.0.0.1:54352/ks/unloadcollection1/&version=2} {add=[33 (1429127704290000896)]} 0 1
[junit4:junit4]   2> 20450 T279 C9 P34545 /update {update.distrib=FROMLEADER&wt=javabin&distrib.from=http://127.0.0.1:54352/ks/unloadcollection1/&version=2} {add=[33 (1429127704290000896)]} 0 2
[junit4:junit4]   2> 20451 T263 C10 P54352 /update {update.distrib=TOLEADER&wt=javabin&distrib.from=http://127.0.0.1:40211/ks/unloadcollection3/&version=2} {add=[33 (1429127704290000896)]} 0 6
[junit4:junit4]   2> 20452 T290 C11 P40211 /update {wt=javabin&version=2} {add=[33]} 0 10
[junit4:junit4]   2> 20463 T292 C11 P40211 /update {update.distrib=FROMLEADER&wt=javabin&distrib.from=http://127.0.0.1:54352/ks/unloadcollection1/&version=2} {add=[34 (1429127704303632384)]} 0 1
[junit4:junit4]   2> 20463 T277 C9 P34545 /update {update.distrib=FROMLEADER&wt=javabin&distrib.from=http://127.0.0.1:54352/ks/unloadcollection1/&version=2} {add=[34 (1429127704303632384)]} 0 1
[junit4:junit4]   2> 20464 T264 C10 P54352 /update {update.distrib=TOLEADER&wt=javabin&distrib.from=http://127.0.0.1:40211/ks/unloadcollection3/&version=2} {add=[34 (1429127704303632384)]} 0 7
[junit4:junit4]   2> 20465 T293 C11 P40211 /update {wt=javabin&version=2} {add=[34]} 0 10
[junit4:junit4]   2> 20474 T290 C11 P40211 /update {update.distrib=FROMLEADER&wt=javabin&distrib.from=http://127.0.0.1:54352/ks/unloadcollection1/&version=2} {add=[35 (1429127704317263872)]} 0 1
[junit4:junit4]   2> 20474 T278 C9 P34545 /update {update.distrib=FROMLEADER&wt=javabin&distrib.from=http://127.0.0.1:54352/ks/unloadcollection1/&version=2} {add=[35 (1429127704317263872)]} 0 1
[junit4:junit4]   2> 20475 T265 C10 P54352 /update {update.distrib=TOLEADER&wt=javabin&distrib.from=http://127.0.0.1:40211/ks/unloadcollection3/&version=2} {add=[35 (1429127704317263872)]} 0 4
[junit4:junit4]   2> 20476 T291 C11 P40211 /update {wt=javabin&version=2} {add=[35]} 0 8
[junit4:junit4]   2> 20486 T293 C11 P40211 /update {update.distrib=FROMLEADER&wt=javabin&distrib.from=http://127.0.0.1:54352/ks/unloadcollection1/&version=2} {add=[36 (1429127704327749632)]} 0 1
[junit4:junit4]   2> 20486 T276 C9 P34545 /update {update.distrib=FROMLEADER&wt=javabin&distrib.from=http://127.0.0.1:54352/ks/unloadcollection1/&version=2} {add=[36 (1429127704327749632)]} 0 1
[junit4:junit4]   2> 20487 T262 C10 P54352 /update {update.distrib=TOLEADER&wt=javabin&distrib.from=http://127.0.0.1:40211/ks/unloadcollection3/&version=2} {add=[36 (1429127704327749632)]} 0 6
[junit4:junit4]   2> 20488 T292 C11 P40211 /update {wt=javabin&version=2} {add=[36]} 0 9
[junit4:junit4]   2> 20498 T291 C11 P40211 /update {update.distrib=FROMLEADER&wt=javabin&distrib.from=http://127.0.0.1:54352/ks/unloadcollection1/&version=2} {add=[37 (1429127704341381120)]} 0 1
[junit4:junit4]   2> 20498 T279 C9 P34545 /update {update.distrib=FROMLEADER&wt=javabin&distrib.from=http://127.0.0.1:54352/ks/unloadcollection1/&version=2} {add=[37 (1429127704341381120)]} 0 1
[junit4:junit4]   2> 20500 T263 C10 P54352 /update {update.distrib=TOLEADER&wt=javabin&distrib.from=http://127.0.0.1:40211/ks/unloadcollection3/&version=2} {add=[37 (1429127704341381120)]} 0 7
[junit4:junit4]   2> 20501 T290 C11 P40211 /update {wt=javabin&version=2} {add=[37]} 0 10
[junit4:junit4]   2> 20511 T277 C9 P34545 /update {update.distrib=FROMLEADER&wt=javabin&distrib.from=http://127.0.0.1:54352/ks/unloadcollection1/&version=2} {add=[38 (1429127704353964032)]} 0 1
[junit4:junit4]   2> 20511 T292 C11 P40211 /update {update.distrib=FROMLEADER&wt=javabin&distrib.from=http://127.0.0.1:54352/ks/unloadcollection1/&version=2} {add=[38 (1429127704353964032)]} 0 1
[junit4:junit4]   2> 20512 T264 C10 P54352 /update {update.distrib=TOLEADER&wt=javabin&distrib.from=http://127.0.0.1:40211/ks/unloadcollection3/&version=2} {add=[38 (1429127704353964032)]} 0 6
[junit4:junit4]   2> 20513 T293 C11 P40211 /update {wt=javabin&version=2} {add=[38]} 0 9
[junit4:junit4]   2> 20524 T278 C9 P34545 /update {update.distrib=FROMLEADER&wt=javabin&distrib.from=http://127.0.0.1:54352/ks/unloadcollection1/&version=2} {add=[39 (1429127704367595520)]} 0 1
[junit4:junit4]   2> 20524 T290 C11 P40211 /update {update.distrib=FROMLEADER&wt=javabin&distrib.from=http://127.0.0.1:54352/ks/unloadcollection1/&version=2} {add=[39 (1429127704367595520)]} 0 1
[junit4:junit4]   2> 20525 T265 C10 P54352 /update {update.distrib=TOLEADER&wt=javabin&distrib.from=http://127.0.0.1:40211/ks/unloadcollection3/&version=2} {add=[39 (1429127704367595520)]} 0 6
[junit4:junit4]   2> 20526 T291 C11 P40211 /update {wt=javabin&version=2} {add=[39]} 0 9
[junit4:junit4]   2> 20536 T293 C11 P40211 /update {update.distrib=FROMLEADER&wt=javabin&distrib.from=http://127.0.0.1:54352/ks/unloadcollection1/&version=2} {add=[40 (1429127704381227008)]} 0 1
[junit4:junit4]   2> 20536 T276 C9 P34545 /update {update.distrib=FROMLEADER&wt=javabin&distrib.from=http://127.0.0.1:54352/ks/unloadcollection1/&version=2} {add=[40 (1429127704381227008)]} 0 1
[junit4:junit4]   2> 20538 T262 C10 P54352 /update {update.distrib=TOLEADER&wt=javabin&distrib.from=http://127.0.0.1:40211/ks/unloadcollection3/&version=2} {add=[40 (1429127704381227008)]} 0 6
[junit4:junit4]   2> 20539 T292 C11 P40211 /update {wt=javabin&version=2} {add=[40]} 0 10
[junit4:junit4]   2> 20551 T291 C11 P40211 /update {update.distrib=FROMLEADER&wt=javabin&distrib.from=http://127.0.0.1:54352/ks/unloadcollection1/&version=2} {add=[41 (1429127704395907072)]} 0 2
[junit4:junit4]   2> 20551 T279 C9 P34545 /update {update.distrib=FROMLEADER&wt=javabin&distrib.from=http://127.0.0.1:54352/ks/unloadcollection1/&version=2} {add=[41 (1429127704395907072)]} 0 2
[junit4:junit4]   2> 20553 T263 C10 P54352 /update {update.distrib=TOLEADER&wt=javabin&distrib.from=http://127.0.0.1:40211/ks/unloadcollection3/&version=2} {add=[41 (1429127704395907072)]} 0 8
[junit4:junit4]   2> 20554 T290 C11 P40211 /update {wt=javabin&version=2} {add=[41]} 0 12
[junit4:junit4]   2> 20564 T292 C11 P40211 /update {update.distrib=FROMLEADER&wt=javabin&distrib.from=http://127.0.0.1:54352/ks/unloadcollection1/&version=2} {add=[42 (1429127704410587136)]} 0 1
[junit4:junit4]   2> 20564 T278 C9 P34545 /update {update.distrib=FROMLEADER&wt=javabin&distrib.from=http://127.0.0.1:54352/ks/unloadcollection1/&version=2} {add=[42 (1429127704410587136)]} 0 1
[junit4:junit4]   2> 20565 T264 C10 P54352 /update {update.distrib=TOLEADER&wt=javabin&distrib.from=http://127.0.0.1:40211/ks/unloadcollection3/&version=2} {add=[42 (1429127704410587136)]} 0 6
[junit4:junit4]   2> 20566 T293 C11 P40211 /update {wt=javabin&version=2} {add=[42]} 0 9
[junit4:junit4]   2> 20577 T276 C9 P34545 /update {update.distrib=FROMLEADER&wt=javabin&distrib.from=http://127.0.0.1:54352/ks/unloadcollection1/&version=2} {add=[43 (1429127704423170048)]} 0 1
[junit4:junit4]   2> 20577 T290 C11 P40211 /update {update.distrib=FROMLEADER&wt=javabin&distrib.from=http://127.0.0.1:54352/ks/unloadcollection1/&version=2} {add=[43 (1429127704423170048)]} 0 1
[junit4:junit4]   2> 20578 T265 C10 P54352 /update {update.distrib=TOLEADER&wt=javabin&distrib.from=http://127.0.0.1:40211/ks/unloadcollection3/&version=2} {add=[43 (1429127704423170048)]} 0 6
[junit4:junit4]   2> 20579 T291 C11 P40211 /update {wt=javabin&version=2} {add=[43]} 0 10
[junit4:junit4]   2> 20591 T293 C11 P40211 /update {update.distrib=FROMLEADER&wt=javabin&distrib.from=http://127.0.0.1:54352/ks/unloadcollection1/&version=2} {add=[44 (1429127704436801536)]} 0 1
[junit4:junit4]   2> 20592 T277 C9 P34545 /update {update.distrib=FROMLEADER&wt=javabin&distrib.from=http://127.0.0.1:54352/ks/unloadcollection1/&version=2} {add=[44 (1429127704436801536)]} 0 2
[junit4:junit4]   2> 20593 T262 C10 P54352 /update {update.distrib=TOLEADER&wt=javabin&distrib.from=http://127.0.0.1:40211/ks/unloadcollection3/&version=2} {add=[44 (1429127704436801536)]} 0 8
[junit4:junit4]   2> 20594 T292 C11 P40211 /update {wt=javabin&version=2} {add=[44]} 0 12
[junit4:junit4]   2> 20604 T279 C9 P34545 /update {update.distrib=FROMLEADER&wt=javabin&distrib.from=http://127.0.0.1:54352/ks/unloadcollection1/&version=2} {add=[45 (1429127704452530176)]} 0 1
[junit4:junit4]   2> 20604 T291 C11 P40211 /update {update.distrib=FROMLEADER&wt=javabin&distrib.from=http://127.0.0.1:54352/ks/unloadcollection1/&version=2} {add=[45 (1429127704452530176)]} 0 1
[junit4:junit4]   2> 20605 T263 C10 P54352 /update {update.distrib=TOLEADER&wt=javabin&distrib.from=http://127.0.0.1:40211/ks/unloadcollection3/&version=2} {add=[45 (1429127704452530176)]} 0 6
[junit4:junit4]   2> 20606 T290 C11 P40211 /update {wt=javabin&version=2} {add=[45]} 0 9
[junit4:junit4]   2> 20616 T278 C9 P34545 /update {update.distrib=FROMLEADER&wt=javabin&distrib.from=http://127.0.0.1:54352/ks/unloadcollection1/&version=2} {add=[46 (1429127704465113088)]} 0 1
[junit4:junit4]   2> 20617 T292 C11 P40211 /update {update.distrib=FROMLEADER&wt=javabin&distrib.from=http://127.0.0.1:54352/ks/unloadcollection1/&version=2} {add=[46 (1429127704465113088)]} 0 1
[junit4:junit4]   2> 20618 T264 C10 P54352 /update {update.distrib=TOLEADER&wt=javabin&distrib.from=http://127.0.0.1:40211/ks/unloadcollection3/&version=2} {add=[46 (1429127704465113088)]} 0 6
[junit4:junit4]   2> 20619 T293 C11 P40211 /update {wt=javabin&version=2} {add=[46]} 0 10
[junit4:junit4]   2> 20629 T290 C11 P40211 /update {update.distrib=FROMLEADER&wt=javabin&distrib.from=http://127.0.0.1:54352/ks/unloadcollection1/&version=2} {add=[47 (1429127704478744576)]} 0 0
[junit4:junit4]   2> 20629 T276 C9 P34545 /update {update.distrib=FROMLEADER&wt=javabin&distrib.from=http://127.0.0.1:54352/ks/unloadcollection1/&version=2} {add=[47 (1429127704478744576)]} 0 0
[junit4:junit4]   2> 20631 T265 C10 P54352 /update {update.distrib=TOLEADER&wt=javabin&distrib.from=http://127.0.0.1:40211/ks/unloadcollection3/&version=2} {add=[47 (1429127704478744576)]} 0 6
[junit4:junit4]   2> 20632 T291 C11 P40211 /update {wt=javabin&version=2} {add=[47]} 0 10
[junit4:junit4]   2> 20642 T292 C11 P40211 /update {update.distrib=FROMLEADER&wt=javabin&distrib.from=http://127.0.0.1:54352/ks/unloadcollection1/&version=2} {add=[48 (1429127704491327488)]} 0 1
[junit4:junit4]   2> 20642 T277 C9 P34545 /update {update.distrib=FROMLEADER&wt=javabin&distrib.from=http://127.0.0.1:54352/ks/unloadcollection1/&version=2} {add=[48 (1429127704491327488)]} 0 1
[junit4:junit4]   2> 20643 T262 C10 P54352 /update {update.distrib=TOLEADER&wt=javabin&distrib.from=http://127.0.0.1:40211/ks/unloadcollection3/&version=2} {add=[48 (1429127704491327488)]} 0 6
[junit4:junit4]   2> 20644 T293 C11 P40211 /update {wt=javabin&version=2} {add=[48]} 0 9
[junit4:junit4]   2> 20654 T292 C11 P40211 /update {update.distrib=FROMLEADER&wt=javabin&distrib.from=http://127.0.0.1:54352/ks/unloadcollection1/&version=2} {add=[49 (1429127704503910400)]} 0 1
[junit4:junit4]   2> 20654 T279 C9 P34545 /update {update.distrib=FROMLEADER&wt=javabin&distrib.from=http://127.0.0.1:54352/ks/unloadcollection1/&version=2} {add=[49 (1429127704503910400)]} 0 1
[junit4:junit4]   2> 20655 T263 C10 P54352 /update {update.distrib=TOLEADER&wt=javabin&distrib.from=http://127.0.0.1:40211/ks/unloadcollection3/&version=2} {add=[49 (1429127704503910400)]} 0 6
[junit4:junit4]   2> 20656 T291 C11 P40211 /update {wt=javabin&version=2} {add=[49]} 0 9
[junit4:junit4]   2> 20666 T278 C9 P34545 /update {update.distrib=FROMLEADER&wt=javabin&distrib.from=http://127.0.0.1:54352/ks/unloadcollection1/&version=2} {add=[50 (1429127704516493312)]} 0 1
[junit4:junit4]   2> 20666 T290 C11 P40211 /update {update.distrib=FROMLEADER&wt=javabin&distrib.from=http://127.0.0.1:54352/ks/unloadcollection1/&version=2} {add=[50 (1429127704516493312)]} 0 1
[junit4:junit4]   2> 20668 T264 C10 P54352 /update {update.distrib=TOLEADER&wt=javabin&distrib.from=http://127.0.0.1:40211/ks/unloadcollection3/&version=2} {add=[50 (1429127704516493312)]} 0 7
[junit4:junit4]   2> 20668 T293 C11 P40211 /update {wt=javabin&version=2} {add=[50]} 0 9
[junit4:junit4]   2> 20679 T291 C11 P40211 /update {update.distrib=FROMLEADER&wt=javabin&distrib.from=http://127.0.0.1:54352/ks/unloadcollection1/&version=2} {add=[51 (1429127704530124800)]} 0 1
[junit4:junit4]   2> 20679 T276 C9 P34545 /update {update.distrib=FROMLEADER&wt=javabin&distrib.from=http://127.0.0.1:54352/ks/unloadcollection1/&version=2} {add=[51 (1429127704530124800)]} 0 1
[junit4:junit4]   2> 20680 T262 C10 P54352 /update {update.distrib=TOLEADER&wt=javabin&distrib.from=http://127.0.0.1:40211/ks/unloadcollection3/&version=2} {add=[51 (1429127704530124800)]} 0 6
[junit4:junit4]   2> 20681 T292 C11 P40211 /update {wt=javabin&version=2} {add=[51]} 0 10
[junit4:junit4]   2> 20691 T277 C9 P34545 /update {update.distrib=FROMLEADER&wt=javabin&distrib.from=http://127.0.0.1:54352/ks/unloadcollection1/&version=2} {add=[52 (1429127704543756288)]} 0 1
[junit4:junit4]   2> 20691 T293 C11 P40211 /update {update.distrib=FROMLEADER&wt=javabin&distrib.from=http://127.0.0.1:54352/ks/unloadcollection1/&version=2} {add=[52 (1429127704543756288)]} 0 1
[junit4:junit4]   2> 20692 T263 C10 P54352 /update {update.distrib=TOLEADER&wt=javabin&distrib.from=http://127.0.0.1:40211/ks/unloadcollection3/&version=2} {add=[52 (1429127704543756288)]} 0 5
[junit4:junit4]   2> 20693 T290 C11 P40211 /update {wt=javabin&version=2} {add=[52]} 0 9
[junit4:junit4]   2> 20703 T292 C11 P40211 /update {update.distrib=FROMLEADER&wt=javabin&distrib.from=http://127.0.0.1:54352/ks/unloadcollection1/&version=2} {add=[53 (1429127704556339200)]} 0 1
[junit4:junit4]   2> 20703 T279 C9 P34545 /update {update.distrib=FROMLEADER&wt=javabin&distrib.from=http://127.0.0.1:54352/ks/unloadcollection1/&version=2} {add=[53 (1429127704556339200)]} 0 0
[junit4:junit4]   2> 20705 T264 C10 P54352 /update {update.distrib=TOLEADER&wt=javabin&distrib.from=http://127.0.0.1:40211/ks/unloadcollection3/&version=2} {add=[53 (1429127704556339200)]} 0 6
[junit4:junit4]   2> 20706 T291 C11 P40211 /update {wt=javabin&version=2} {add=[53]} 0 9
[junit4:junit4]   2> 20716 T290 C11 P40211 /update {update.distrib=FROMLEADER&wt=javabin&distrib.from=http://127.0.0.1:54352/ks/unloadcollection1/&version=2} {add=[54 (1429127704569970688)]} 0 1
[junit4:junit4]   2> 20716 T278 C9 P34545 /update {update.distrib=FROMLEADER&wt=javabin&distrib.from=http://127.0.0.1:54352/ks/unloadcollection1/&version=2} {add=[54 (1429127704569970688)]} 0 1
[junit4:junit4]   2> 20717 T265 C10 P54352 /update {update.distrib=TOLEADER&wt=javabin&distrib.from=http://127.0.0.1:40211/ks/unloadcollection3/&version=2} {add=[54 (1429127704569970688)]} 0 6
[junit4:junit4]   2> 20718 T293 C11 P40211 /update {wt=javabin&version=2} {add=[54]} 0 9
[junit4:junit4]   2> 20728 T276 C9 P34545 /update {update.distrib=FROMLEADER&wt=javabin&distrib.from=http://127.0.0.1:54352/ks/unloadcollection1/&version=2} {add=[55 (1429127704582553600)]} 0 1
[junit4:junit4]   2> 20728 T291 C11 P40211 /update {update.distrib=FROMLEADER&wt=javabin&distrib.from=http://127.0.0.1:54352/ks/unloadcollection1/&version=2} {add=[55 (1429127704582553600)]} 0 1
[junit4:junit4]   2> 20729 T262 C10 P54352 /update {update.distrib=TOLEADER&wt=javabin&distrib.from=http://127.0.0.1:40211/ks/unloadcollection3/&version=2} {add=[55 (1429127704582553600)]} 0 5
[junit4:junit4]   2> 20730 T292 C11 P40211 /update {wt=javabin&version=2} {add=[55]} 0 9
[junit4:junit4]   2> 20740 T277 C9 P34545 /update {update.distrib=FROMLEADER&wt=javabin&distrib.from=http://127.0.0.1:54352/ks/unloadcollection1/&version=2} {add=[56 (1429127704595136512)]} 0 1
[junit4:junit4]   2> 20740 T293 C11 P40211 /update {update.distrib=FROMLEADER&wt=javabin&distrib.from=http://127.0.0.1:54352/ks/unloadcollection1/&version=2} {add=[56 (1429127704595136512)]} 0 1
[junit4:junit4]   2> 20742 T263 C10 P54352 /update {update.distrib=TOLEADER&wt=javabin&distrib.from=http://127.0.0.1:40211/ks/unloadcollection3/&version=2} {add=[56 (1429127704595136512)]} 0 6
[junit4:junit4]   2> 20743 T290 C11 P40211 /update {wt=javabin&version=2} {add=[56]} 0 10
[junit4:junit4]   2> 20752 T292 C11 P40211 /update {update.distrib=FROMLEADER&wt=javabin&distrib.from=http://127.0.0.1:54352/ks/unloadcollection1/&version=2} {add=[57 (1429127704607719424)]} 0 0
[junit4:junit4]   2> 20753 T279 C9 P34545 /update {update.distrib=FROMLEADER&wt=javabin&distrib.from=http://127.0.0.1:54352/ks/unloadcollection1/&version=2} {add=[57 (1429127704607719424)]} 0 1
[junit4:junit4]   2> 20754 T264 C10 P54352 /update {update.distrib=TOLEADER&wt=javabin&distrib.from=http://127.0.0.1:40211/ks/unloadcollection3/&version=2} {add=[57 (1429127704607719424)]} 0 6
[junit4:junit4]   2> 20755 T291 C11 P40211 /update {wt=javabin&version=2} {add=[57]} 0 9
[junit4:junit4]   2> 20765 T278 C9 P34545 /update {update.distrib=FROMLEADER&wt=javabin&distrib.from=http://127.0.0.1:54352/ks/unloadcollection1/&version=2} {add=[58 (1429127704621350912)]} 0 1
[junit4:junit4]   2> 20765 T290 C11 P40211 /update {update.distrib=FROMLEADER&wt=javabin&distrib.from=http://127.0.0.1:54352/ks/unloadcollection1/&version=2} {add=[58 (1429127704621350912)]} 0 1
[junit4:junit4]   2> 20766 T265 C10 P54352 /update {update.distrib=TOLEADER&wt=javabin&distrib.from=http://127.0.0.1:40211/ks/unloadcollection3/&version=2} {add=[58 (1429127704621350912)]} 0 5
[junit4:junit4]   2> 20767 T293 C11 P40211 /update {wt=javabin&version=2} {add=[58]} 0 9
[junit4:junit4]   2> 20777 T276 C9 P34545 /update {update.distrib=FROMLEADER&wt=javabin&distrib.from=http://127.0.0.1:54352/ks/unloadcollection1/&version=2} {add=[59 (1429127704633933824)]} 0 1
[junit4:junit4]   2> 20777 T291 C11 P40211 /update {update.distrib=FROMLEADER&wt=javabin&distrib.from=http://127.0.0.1:54352/ks/unloadcollection1/&version=2} {add=[59 (1429127704633933824)]} 0 1
[junit4:junit4]   2> 20778 T262 C10 P54352 /update {update.distrib=TOLEADER&wt=javabin&distrib.from=http://127.0.0.1:40211/ks/unloadcollection3/&version=2} {add=[59 (1429127704633933824)]} 0 6
[junit4:junit4]   2> 20779 T292 C11 P40211 /update {wt=javabin&version=2} {add=[59]} 0 9
[junit4:junit4]   2> 20790 T277 C9 P34545 /update {update.distrib=FROMLEADER&wt=javabin&distrib.from=http://127.0.0.1:54352/ks/unloadcollection1/&version=2} {add=[60 (1429127704646516736)]} 0 1
[junit4:junit4]   2> 20790 T293 C11 P40211 /update {update.distrib=FROMLEADER&wt=javabin&distrib.from=http://127.0.0.1:54352/ks/unloadcollection1/&version=2} {add=[60 (1429127704646516736)]} 0 1
[junit4:junit4]   2> 20791 T263 C10 P54352 /update {update.distrib=TOLEADER&wt=javabin&distrib.from=http://127.0.0.1:40211/ks/unloadcollection3/&version=2} {add=[60 (1429127704646516736)]} 0 6
[junit4:junit4]   2> 20792 T290 C11 P40211 /update {wt=javabin&version=2} {add=[60]} 0 10
[junit4:junit4]   2> 20802 T279 C9 P34545 /update {update.distrib=FROMLEADER&wt=javabin&distrib.from=http://127.0.0.1:54352/ks/unloadcollection1/&version=2} {add=[61 (1429127704660148224)]} 0 1
[junit4:junit4]   2> 20802 T292 C11 P40211 /update {update.distrib=FROMLEADER&wt=javabin&distrib.from=http://127.0.0.1:54352/ks/unloadcollection1/&version=2} {add=[61 (1429127704660148224)]} 0 1
[junit4:junit4]   2> 20803 T264 C10 P54352 /update {update.distrib=TOLEADER&wt=javabin&distrib.from=http://127.0.0.1:40211/ks/unloadcollection3/&version=2} {add=[61 (1429127704660148224)]} 0 5
[junit4:junit4]   2> 20804 T291 C11 P40211 /update {wt=javabin&version=2} {add=[61]} 0 9
[junit4:junit4]   2> 20815 T278 C9 P34545 /update {update.distrib=FROMLEADER&wt=javabin&distrib.from=http://127.0.0.1:54352/ks/unloadcollection1/&version=2} {add=[62 (1429127704672731136)]} 0 2
[junit4:junit4]   2> 20815 T290 C11 P40211 /update {update.distrib=FROMLEADER&wt=javabin&distrib.from=http://127.0.0.1:54352/ks/unloadcollection1/&version=2} {add=[62 (1429127704672731136)]} 0 2
[junit4:junit4]   2> 20816 T265 C10 P54352 /update {update.distrib=TOLEADER&wt=javabin&distrib.from=http://127.0.0.1:40211/ks/unloadcollection3/&version=2} {add=[62 (1429127704672731136)]} 0 6
[junit4:junit4]   2> 20817 T293 C11 P40211 /update {wt=javabin&version=2} {add=[62]} 0 10
[junit4:junit4]   2> 20826 T276 C9 P34545 /update {update.distrib=FROMLEADER&wt=javabin&distrib.from=http://127.0.0.1:54352/ks/unloadcollection1/&version=2} {add=[63 (1429127704685314048)]} 0 1
[junit4:junit4]   2> 20826 T291 C11 P40211 /update {update.distrib=FROMLEADER&wt=javabin&distrib.from=http://127.0.0.1:54352/ks/unloadcollection1/&version=2} {add=[63 (1429127704685314048)]} 0 1
[junit4:junit4]   2> 20827 T262 C10 P54352 /update {update.distrib=TOLEADER&wt=javabin&distrib.from=http://127.0.0.1:40211/ks/unloadcollection3/&version=2} {add=[63 (1429127704685314048)]} 0 5
[junit4:junit4]   2> 20828 T292 C11 P40211 /update {wt=javabin&version=2} {add=[63]} 0 9
[junit4:junit4]   2> 20838 T277 C9 P34545 /update {update.distrib=FROMLEADER&wt=javabin&distrib.from=http://127.0.0.1:54352/ks/unloadcollection1/&version=2} {add=[64 (1429127704697896960)]} 0 0
[junit4:junit4]   2> 20839 T293 C11 P40211 /update {update.distrib=FROMLEADER&wt=javabin&distrib.from=http://127.0.0.1:54352/ks/unloadcollection1/&version=2} {add=[64 (1429127704697896960)]} 0 2
[junit4:junit4]   2> 20840 T263 C10 P54352 /update {update.distrib=TOLEADER&wt=javabin&distrib.from=http://127.0.0.1:40211/ks/unloadcollection3/&version=2} {add=[64 (1429127704697896960)]} 0 6
[junit4:junit4]   2> 20841 T290 C11 P40211 /update {wt=javabin&version=2} {add=[64]} 0 10
[junit4:junit4]   2> 20850 T279 C9 P34545 /update {update.distrib=FROMLEADER&wt=javabin&distrib.from=http://127.0.0.1:54352/ks/unloadcollection1/&version=2} {add=[65 (1429127704710479872)]} 0 0
[junit4:junit4]   2> 20851 T292 C11 P40211 /update {update.distrib=FROMLEADER&wt=javabin&distrib.from=http://127.0.0.1:54352/ks/unloadcollection1/&version=2} {add=[65 (1429127704710479872)]} 0 1
[junit4:junit4]   2> 20852 T264 C10 P54352 /update {update.distrib=TOLEADER&wt=javabin&distrib.from=http://127.0.0.1:40211/ks/unloadcollection3/&version=2} {add=[65 (1429127704710479872)]} 0 6
[junit4:junit4]   2> 20853 T291 C11 P40211 /update {wt=javabin&version=2} {add=[65]} 0 9
[junit4:junit4]   2> 20863 T290 C11 P40211 /update {update.distrib=FROMLEADER&wt=javabin&distrib.from=http://127.0.0.1:54352/ks/unloadcollection1/&version=2} {add=[66 (1429127704724111360)]} 0 1
[junit4:junit4]   2> 20863 T278 C9 P34545 /update {update.distrib=FROMLEADER&wt=javabin&distrib.from=http://127.0.0.1:54352/ks/unloadcollection1/&version=2} {add=[66 (1429127704724111360)]} 0 1
[junit4:junit4]   2> 20865 T262 C10 P54352 /update {update.distrib=TOLEADER&wt=javabin&distrib.from=http://127.0.0.1:40211/ks/unloadcollection3/&version=2} {add=[66 (1429127704724111360)]} 0 7
[junit4:junit4]   2> 20866 T293 C11 P40211 /update {wt=javabin&version=2} {add=[66]} 0 10
[junit4:junit4]   2> 20875 T291 C11 P40211 /update {update.distrib=FROMLEADER&wt=javabin&distrib.from=http://127.0.0.1:54352/ks/unloadcollection1/&version=2} {add=[67 (1429127704736694272)]} 0 1
[junit4:junit4]   2> 20876 T276 C9 P34545 /update {update.distrib=FROMLEADER&wt=javabin&distrib.from=http://127.0.0.1:54352/ks/unloadcollection1/&version=2} {add=[67 (1429127704736694272)]} 0 2
[junit4:junit4]   2> 20877 T263 C10 P54352 /update {update.distrib=TOLEADER&wt=javabin&distrib.from=http://127.0.0.1:40211/ks/unloadcollection3/&version=2} {add=[67 (1429127704736694272)]} 0 6
[junit4:junit4]   2> 20878 T292 C11 P40211 /update {wt=javabin&version=2} {add=[67]} 0 9
[junit4:junit4]   2> 20889 T293 C11 P40211 /update {update.distrib=FROMLEADER&wt=javabin&distrib.from=http://127.0.0.1:54352/ks/unloadcollection1/&version=2} {add=[68 (1429127704750325760)]} 0 1
[junit4:junit4]   2> 20889 T277 C9 P34545 /update {update.distrib=FROMLEADER&wt=javabin&distrib.from=http://127.0.0.1:54352/ks/unloadcollection1/&version=2} {add=[68 (1429127704750325760)]} 0 1
[junit4:junit4]   2> 20891 T264 C10 P54352 /update {update.distrib=TOLEADER&wt=javabin&distrib.from=http://127.0.0.1:40211/ks/unloadcollection3/&version=2} {add=[68 (1429127704750325760)]} 0 7
[junit4:junit4]   2> 20892 T290 C11 P40211 /update {wt=javabin&version=2} {add=[68]} 0 11
[junit4:junit4]   2> 20902 T279 C9 P34545 /update {update.distrib=FROMLEADER&wt=javabin&distrib.from=http://127.0.0.1:54352/ks/unloadcollection1/&version=2} {add=[69 (1429127704765005824)]} 0 1
[junit4:junit4]   2> 20902 T292 C11 P40211 /update {update.distrib=FROMLEADER&wt=javabin&distrib.from=http://127.0.0.1:54352/ks/unloadcollection1/&version=2} {add=[69 (1429127704765005824)]} 0 1
[junit4:junit4]   2> 20903 T265 C10 P54352 /update {update.distrib=TOLEADER&wt=javabin&distrib.from=http://127.0.0.1:40211/ks/unloadcollection3/&version=2} {add=[69 (1429127704765005824)]} 0 6
[junit4:junit4]   2> 20904 T291 C11 P40211 /update {wt=javabin&version=2} {add=[69]} 0 9
[junit4:junit4]   2> 20914 T278 C9 P34545 /update {update.distrib=FROMLEADER&wt=javabin&distrib.from=http://127.0.0.1:54352/ks/unloadcollection1/&version=2} {add=[70 (1429127704777588736)]} 0 1
[junit4:junit4]   2> 20914 T290 C11 P40211 /update {update.distrib=FROMLEADER&wt=javabin&distrib.from=http://127.0.0.1:54352/ks/unloadcollection1/&version=2} {add=[70 (1429127704777588736)]} 0 1
[junit4:junit4]   2> 20915 T262 C10 P54352 /update {update.distrib=TOLEADER&wt=javabin&distrib.from=http://127.0.0.1:40211/ks/unloadcollection3/&version=2} {add=[70 (1429127704777588736)]} 0 6
[junit4:junit4]   2> 20916 T293 C11 P40211 /update {wt=javabin&version=2} {add=[70]} 0 9
[junit4:junit4]   2> 20926 T291 C11 P40211 /update {update.distrib=FROMLEADER&wt=javabin&distrib.from=http://127.0.0.1:54352/ks/unloadcollection1/&version=2} {add=[71 (1429127704790171648)]} 0 1
[junit4:junit4]   2> 20926 T276 C9 P34545 /update {update.distrib=FROMLEADER&wt=javabin&distrib.from=http://127.0.0.1:54352/ks/unloadcollection1/&version=2} {add=[71 (1429127704790171648)]} 0 1
[junit4:junit4]   2> 20927 T263 C10 P54352 /update {update.distrib=TOLEADER&wt=javabin&distrib.from=http://127.0.0.1:40211/ks/unloadcollection3/&version=2} {add=[71 (1429127704790171648)]} 0 5
[junit4:junit4]   2> 20928 T292 C11 P40211 /update {wt=javabin&version=2} {add=[71]} 0 9
[junit4:junit4]   2> 20938 T293 C11 P40211 /update {update.distrib=FROMLEADER&wt=javabin&distrib.from=http://127.0.0.1:54352/ks/unloadcollection1/&version=2} {add=[72 (1429127704802754560)]} 0 1
[junit4:junit4]   2> 20938 T277 C9 P34545 /update {update.distrib=FROMLEADER&wt=javabin&distrib.from=http://127.0.0.1:54352/ks/unloadcollection1/&version=2} {add=[72 (1429127704802754560)]} 0 1
[junit4:junit4]   2> 20939 T264 C10 P54352 /update {update.distrib=TOLEADER&wt=javabin&distrib.from=http://127.0.0.1:40211/ks/unloadcollection3/&version=2} {add=[72 (1429127704802754560)]} 0 5
[junit4:junit4]   2> 20940 T290 C11 P40211 /update {wt=javabin&version=2} {add=[72]} 0 9
[junit4:junit4]   2> 20950 T292 C11 P40211 /update {update.distrib=FROMLEADER&wt=javabin&distrib.from=http://127.0.0.1:54352/ks/unloadcollection1/&version=2} {add=[73 (1429127704815337472)]} 0 1
[junit4:junit4]   2> 20950 T278 C9 P34545 /update {update.distrib=FROMLEADER&wt=javabin&distrib.from=http://127.0.0.1:54352/ks/unloadcollection1/&version=2} {add=[73 (1429127704815337472)]} 0 1
[junit4:junit4]   2> 20951 T265 C10 P54352 /update {update.distrib=TOLEADER&wt=javabin&distrib.from=http://127.0.0.1:40211/ks/unloadcollection3/&version=2} {add=[73 (1429127704815337472)]} 0 5
[junit4:junit4]   2> 20952 T291 C11 P40211 /update {wt=javabin&version=2} {add=[73]} 0 9
[junit4:junit4]   2> 20962 T290 C11 P40211 /update {update.distrib=FROMLEADER&wt=javabin&distrib.from=http://127.0.0.1:54352/ks/unloadcollection1/&version=2} {add=[74 (1429127704827920384)]} 0 1
[junit4:junit4]   2> 20962 T277 C9 P34545 /update {update.distrib=FROMLEADER&wt=javabin&distrib.from=http://127.0.0.1:54352/ks/unloadcollection1/&version=2} {add=[74 (1429127704827920384)]} 0 1
[junit4:junit4]   2> 20964 T262 C10 P54352 /update {update.distrib=TOLEADER&wt=javabin&distrib.from=http://127.0.0.1:40211/ks/unloadcollection3/&version=2} {add=[74 (1429127704827920384)]} 0 7
[junit4:junit4]   2> 20965 T293 C11 P40211 /update {wt=javabin&version=2} {add=[74]} 0 10
[junit4:junit4]   2> 20974 T291 C11 P40211 /update {update.distrib=FROMLEADER&wt=javabin&distrib.from=http://127.0.0.1:54352/ks/unloadcollection1/&version=2} {add=[75 (1429127704840503296)]} 0 1
[junit4:junit4]   2> 20974 T279 C9 P34545 /update {update.distrib=FROMLEADER&wt=javabin&distrib.from=http://127.0.0.1:54352/ks/unloadcollection1/&version=2} {add=[75 (1429127704840503296)]} 0 1
[junit4:junit4]   2> 20975 T263 C10 P54352 /update {update.distrib=TOLEADER&wt=javabin&distrib.from=http://127.0.0.1:40211/ks/unloadcollection3/&version=2} {add=[75 (1429127704840503296)]} 0 5
[junit4:junit4]   2> 20976 T292 C11 P40211 /update {wt=javabin&version=2} {add=[75]} 0 8
[junit4:junit4]   2> 20986 T293 C11 P40211 /update {update.distrib=FROMLEADER&wt=javabin&distrib.from=http://127.0.0.1:54352/ks/unloadcollection1/&version=2} {add=[76 (1429127704853086208)]} 0 1
[junit4:junit4]   2> 20986 T278 C9 P34545 /update {update.distrib=FROMLEADER&wt=javabin&distrib.from=http://127.0.0.1:54352/ks/unloadcollection1/&version=2} {add=[76 (1429127704853086208)]} 0 1
[junit4:junit4]   2> 20988 T264 C10 P54352 /update {update.distrib=TOLEADER&wt=javabin&distrib.from=http:

[...truncated too long message...]

_collection/leader_elect/shard2/election/89320480183812102-127.0.0.1:54352_ks_test_unload_shard_and_collection_1-n_0000000000 (0)
[junit4:junit4]   1>      /solr/collections/test_unload_shard_and_collection/leader_elect/shard1 (1)
[junit4:junit4]   1>       /solr/collections/test_unload_shard_and_collection/leader_elect/shard1/election (0)
[junit4:junit4]   1>     /solr/collections/test_unload_shard_and_collection/leaders (2)
[junit4:junit4]   1>      /solr/collections/test_unload_shard_and_collection/leaders/shard2 (0)
[junit4:junit4]   1>      DATA:
[junit4:junit4]   1>          {
[junit4:junit4]   1>            "core":"test_unload_shard_and_collection_1",
[junit4:junit4]   1>            "node_name":"127.0.0.1:54352_ks",
[junit4:junit4]   1>            "base_url":"http://127.0.0.1:54352/ks"}
[junit4:junit4]   1>      /solr/collections/test_unload_shard_and_collection/leaders/shard1 (0)
[junit4:junit4]   1>      DATA:
[junit4:junit4]   1>          {
[junit4:junit4]   1>            "core":"test_unload_shard_and_collection_2",
[junit4:junit4]   1>            "node_name":"127.0.0.1:54352_ks",
[junit4:junit4]   1>            "base_url":"http://127.0.0.1:54352/ks"}
[junit4:junit4]   1>   /solr/overseer_elect (2)
[junit4:junit4]   1>    /solr/overseer_elect/election (5)
[junit4:junit4]   1>     /solr/overseer_elect/election/89320480183812104-127.0.0.1:34545_ks-n_0000000002 (0)
[junit4:junit4]   1>     /solr/overseer_elect/election/89320480183812108-127.0.0.1:34590_ks-n_0000000004 (0)
[junit4:junit4]   1>     /solr/overseer_elect/election/89320480183812106-127.0.0.1:40211_ks-n_0000000003 (0)
[junit4:junit4]   1>     /solr/overseer_elect/election/89320480183812102-127.0.0.1:54352_ks-n_0000000001 (0)
[junit4:junit4]   1>     /solr/overseer_elect/election/89320480183812099-127.0.0.1:36166_ks-n_0000000000 (0)
[junit4:junit4]   1>    /solr/overseer_elect/leader (0)
[junit4:junit4]   1>    DATA:
[junit4:junit4]   1>        {"id":"89320480183812099-127.0.0.1:36166_ks-n_0000000000"}
[junit4:junit4]   1>  /zookeeper (1)
[junit4:junit4]   1>  DATA:
[junit4:junit4]   1>      
[junit4:junit4]   1> 
[junit4:junit4]   2> NOTE: reproduce with: ant test  -Dtestcase=UnloadDistributedZkTest -Dtests.method=testDistribSearch -Dtests.seed=768E6FF7ADAC39EA -Dtests.multiplier=3 -Dtests.slow=true -Dtests.locale=ar_QA -Dtests.timezone=Pacific/Efate -Dtests.file.encoding=UTF-8
[junit4:junit4] FAILURE  137s J0 | UnloadDistributedZkTest.testDistribSearch <<<
[junit4:junit4]    > Throwable #1: java.lang.AssertionError: Still found shard
[junit4:junit4]    > 	at __randomizedtesting.SeedInfo.seed([768E6FF7ADAC39EA:F768E1EFDAF359D6]:0)
[junit4:junit4]    > 	at org.junit.Assert.fail(Assert.java:93)
[junit4:junit4]    > 	at org.apache.solr.cloud.UnloadDistributedZkTest.testUnloadShardAndCollection(UnloadDistributedZkTest.java:124)
[junit4:junit4]    > 	at org.apache.solr.cloud.UnloadDistributedZkTest.doTest(UnloadDistributedZkTest.java:77)
[junit4:junit4]    > 	at org.apache.solr.BaseDistributedSearchTestCase.testDistribSearch(BaseDistributedSearchTestCase.java:806)
[junit4:junit4]    > 	at sun.reflect.NativeMethodAccessorImpl.invoke0(Native Method)
[junit4:junit4]    > 	at sun.reflect.NativeMethodAccessorImpl.invoke(NativeMethodAccessorImpl.java:57)
[junit4:junit4]    > 	at sun.reflect.DelegatingMethodAccessorImpl.invoke(DelegatingMethodAccessorImpl.java:43)
[junit4:junit4]    > 	at java.lang.reflect.Method.invoke(Method.java:487)
[junit4:junit4]    > 	at com.carrotsearch.randomizedtesting.RandomizedRunner.invoke(RandomizedRunner.java:1559)
[junit4:junit4]    > 	at com.carrotsearch.randomizedtesting.RandomizedRunner.access$600(RandomizedRunner.java:79)
[junit4:junit4]    > 	at com.carrotsearch.randomizedtesting.RandomizedRunner$6.evaluate(RandomizedRunner.java:737)
[junit4:junit4]    > 	at com.carrotsearch.randomizedtesting.RandomizedRunner$7.evaluate(RandomizedRunner.java:773)
[junit4:junit4]    > 	at com.carrotsearch.randomizedtesting.RandomizedRunner$8.evaluate(RandomizedRunner.java:787)
[junit4:junit4]    > 	at com.carrotsearch.randomizedtesting.rules.SystemPropertiesRestoreRule$1.evaluate(SystemPropertiesRestoreRule.java:53)
[junit4:junit4]    > 	at org.apache.lucene.util.TestRuleSetupTeardownChained$1.evaluate(TestRuleSetupTeardownChained.java:50)
[junit4:junit4]    > 	at org.apache.lucene.util.TestRuleFieldCacheSanity$1.evaluate(TestRuleFieldCacheSanity.java:51)
[junit4:junit4]    > 	at org.apache.lucene.util.AbstractBeforeAfterRule$1.evaluate(AbstractBeforeAfterRule.java:46)
[junit4:junit4]    > 	at com.carrotsearch.randomizedtesting.rules.SystemPropertiesInvariantRule$1.evaluate(SystemPropertiesInvariantRule.java:55)
[junit4:junit4]    > 	at org.apache.lucene.util.TestRuleThreadAndTestName$1.evaluate(TestRuleThreadAndTestName.java:49)
[junit4:junit4]    > 	at org.apache.lucene.util.TestRuleIgnoreAfterMaxFailures$1.evaluate(TestRuleIgnoreAfterMaxFailures.java:70)
[junit4:junit4]    > 	at org.apache.lucene.util.TestRuleMarkFailure$1.evaluate(TestRuleMarkFailure.java:48)
[junit4:junit4]    > 	at com.carrotsearch.randomizedtesting.rules.StatementAdapter.evaluate(StatementAdapter.java:36)
[junit4:junit4]    > 	at com.carrotsearch.randomizedtesting.ThreadLeakControl$StatementRunner.run(ThreadLeakControl.java:358)
[junit4:junit4]    > 	at com.carrotsearch.randomizedtesting.ThreadLeakControl.forkTimeoutingTask(ThreadLeakControl.java:782)
[junit4:junit4]    > 	at com.carrotsearch.randomizedtesting.ThreadLeakControl$3.evaluate(ThreadLeakControl.java:442)
[junit4:junit4]    > 	at com.carrotsearch.randomizedtesting.RandomizedRunner.runSingleTest(RandomizedRunner.java:746)
[junit4:junit4]    > 	at com.carrotsearch.randomizedtesting.RandomizedRunner$3.evaluate(RandomizedRunner.java:648)
[junit4:junit4]    > 	at com.carrotsearch.randomizedtesting.RandomizedRunner$4.evaluate(RandomizedRunner.java:682)
[junit4:junit4]    > 	at com.carrotsearch.randomizedtesting.RandomizedRunner$5.evaluate(RandomizedRunner.java:693)
[junit4:junit4]    > 	at com.carrotsearch.randomizedtesting.rules.StatementAdapter.evaluate(StatementAdapter.java:36)
[junit4:junit4]    > 	at com.carrotsearch.randomizedtesting.rules.SystemPropertiesRestoreRule$1.evaluate(SystemPropertiesRestoreRule.java:53)
[junit4:junit4]    > 	at org.apache.lucene.util.AbstractBeforeAfterRule$1.evaluate(AbstractBeforeAfterRule.java:46)
[junit4:junit4]    > 	at org.apache.lucene.util.TestRuleStoreClassName$1.evaluate(TestRuleStoreClassName.java:42)
[junit4:junit4]    > 	at com.carrotsearch.randomizedtesting.rules.SystemPropertiesInvariantRule$1.evaluate(SystemPropertiesInvariantRule.java:55)
[junit4:junit4]    > 	at com.carrotsearch.randomizedtesting.rules.NoShadowingOrOverridesOnMethodsRule$1.evaluate(NoShadowingOrOverridesOnMethodsRule.java:39)
[junit4:junit4]    > 	at com.carrotsearch.randomizedtesting.rules.NoShadowingOrOverridesOnMethodsRule$1.evaluate(NoShadowingOrOverridesOnMethodsRule.java:39)
[junit4:junit4]    > 	at com.carrotsearch.randomizedtesting.rules.StatementAdapter.evaluate(StatementAdapter.java:36)
[junit4:junit4]    > 	at org.apache.lucene.util.TestRuleAssertionsRequired$1.evaluate(TestRuleAssertionsRequired.java:43)
[junit4:junit4]    > 	at org.apache.lucene.util.TestRuleMarkFailure$1.evaluate(TestRuleMarkFailure.java:48)
[junit4:junit4]    > 	at org.apache.lucene.util.TestRuleIgnoreAfterMaxFailures$1.evaluate(TestRuleIgnoreAfterMaxFailures.java:70)
[junit4:junit4]    > 	at org.apache.lucene.util.TestRuleIgnoreTestSuites$1.evaluate(TestRuleIgnoreTestSuites.java:55)
[junit4:junit4]    > 	at com.carrotsearch.randomizedtesting.rules.StatementAdapter.evaluate(StatementAdapter.java:36)
[junit4:junit4]    > 	at com.carrotsearch.randomizedtesting.ThreadLeakControl$StatementRunner.run(ThreadLeakControl.java:358)
[junit4:junit4]    > 	at java.lang.Thread.run(Thread.java:722)
[junit4:junit4]   2> 136876 T229 oas.SolrTestCaseJ4.deleteCore ###deleteCore
[junit4:junit4]   2> 136886 T228 ccr.ThreadLeakControl.checkThreadLeaks WARNING Will linger awaiting termination of 2 leaked thread(s).
[junit4:junit4]   2> 136999 T232 oazs.SessionTrackerImpl.run SessionTrackerImpl exited loop!
[junit4:junit4]   2> NOTE: test params are: codec=Lucene41, sim=RandomSimilarityProvider(queryNorm=true,coord=crazy): {}, locale=ar_QA, timezone=Pacific/Efate
[junit4:junit4]   2> NOTE: Linux 3.2.0-38-generic i386/Oracle Corporation 1.8.0-ea (32-bit)/cpus=8,threads=2,free=137172048,total=236191744
[junit4:junit4]   2> NOTE: All tests run in this JVM: [TestStressVersions, TestFieldResource, TestExtendedDismaxParser, TestFunctionQuery, TestStressRecovery, PeerSyncTest, FileBasedSpellCheckerTest, TestBadConfig, TestWriterPerf, UnloadDistributedZkTest]
[junit4:junit4] Completed on J0 in 137.17s, 1 test, 1 failure <<< FAILURES!

[...truncated 701 lines...]
BUILD FAILED
/mnt/ssd/jenkins/workspace/Lucene-Solr-4.x-Linux/build.xml:381: The following error occurred while executing this line:
/mnt/ssd/jenkins/workspace/Lucene-Solr-4.x-Linux/build.xml:361: The following error occurred while executing this line:
/mnt/ssd/jenkins/workspace/Lucene-Solr-4.x-Linux/build.xml:39: The following error occurred while executing this line:
/mnt/ssd/jenkins/workspace/Lucene-Solr-4.x-Linux/solr/build.xml:183: The following error occurred while executing this line:
/mnt/ssd/jenkins/workspace/Lucene-Solr-4.x-Linux/solr/common-build.xml:449: The following error occurred while executing this line:
/mnt/ssd/jenkins/workspace/Lucene-Solr-4.x-Linux/lucene/common-build.xml:1213: The following error occurred while executing this line:
/mnt/ssd/jenkins/workspace/Lucene-Solr-4.x-Linux/lucene/common-build.xml:877: There were test failures: 270 suites, 1140 tests, 1 failure, 14 ignored (8 assumptions)

Total time: 58 minutes 11 seconds
Build step 'Invoke Ant' marked build as failure
Archiving artifacts
Recording test results
Description set: Java: 32bit/jdk1.8.0-ea-b79 -client -XX:+UseParallelGC
Email was triggered for: Failure
Sending email for trigger: Failure