You are viewing a plain text version of this content. The canonical link for it is here.
Posted to dev@zookeeper.apache.org by Apache Jenkins Server <je...@builds.apache.org> on 2018/07/02 11:51:09 UTC
ZooKeeper_branch35_jdk8 - Build # 1025 - Still Failing
See https://builds.apache.org/job/ZooKeeper_branch35_jdk8/1025/
###################################################################################
########################## LAST 60 LINES OF THE CONSOLE ###########################
[...truncated 9.82 KB...]
at jenkins.scm.SCMCheckoutStrategy.checkout(SCMCheckoutStrategy.java:86)
at hudson.model.AbstractBuild$AbstractBuildExecution.run(AbstractBuild.java:499)
at hudson.model.Run.execute(Run.java:1794)
at hudson.model.FreeStyleBuild.run(FreeStyleBuild.java:43)
at hudson.model.ResourceController.execute(ResourceController.java:97)
at hudson.model.Executor.run(Executor.java:429)
Caused by: hudson.plugins.git.GitException: Command "git reset --hard" returned status code 128:
stdout:
stderr: fatal: unable to read tree 4f85cd3d86b81f6681d798a8d285a5604532b518
at org.jenkinsci.plugins.gitclient.CliGitAPIImpl.launchCommandIn(CliGitAPIImpl.java:2002)
at org.jenkinsci.plugins.gitclient.CliGitAPIImpl.launchCommandIn(CliGitAPIImpl.java:1970)
at org.jenkinsci.plugins.gitclient.CliGitAPIImpl.launchCommandIn(CliGitAPIImpl.java:1966)
at org.jenkinsci.plugins.gitclient.CliGitAPIImpl.launchCommand(CliGitAPIImpl.java:1597)
at org.jenkinsci.plugins.gitclient.CliGitAPIImpl.reset(CliGitAPIImpl.java:463)
at org.jenkinsci.plugins.gitclient.CliGitAPIImpl.clean(CliGitAPIImpl.java:786)
at hudson.plugins.git.GitAPI.clean(GitAPI.java:311)
at sun.reflect.GeneratedMethodAccessor102.invoke(Unknown Source)
at sun.reflect.DelegatingMethodAccessorImpl.invoke(DelegatingMethodAccessorImpl.java:43)
at java.lang.reflect.Method.invoke(Method.java:498)
at hudson.remoting.RemoteInvocationHandler$RPCRequest.perform(RemoteInvocationHandler.java:929)
at hudson.remoting.RemoteInvocationHandler$RPCRequest.call(RemoteInvocationHandler.java:903)
at hudson.remoting.RemoteInvocationHandler$RPCRequest.call(RemoteInvocationHandler.java:855)
at hudson.remoting.UserRequest.perform(UserRequest.java:212)
at hudson.remoting.UserRequest.perform(UserRequest.java:54)
at hudson.remoting.Request$2.run(Request.java:369)
at hudson.remoting.InterceptingExecutorService$1.call(InterceptingExecutorService.java:72)
at java.util.concurrent.FutureTask.run(FutureTask.java:266)
at java.util.concurrent.ThreadPoolExecutor.runWorker(ThreadPoolExecutor.java:1142)
at java.util.concurrent.ThreadPoolExecutor$Worker.run(ThreadPoolExecutor.java:617)
at java.lang.Thread.run(Thread.java:748)
Suppressed: hudson.remoting.Channel$CallSiteStackTrace: Remote call to H30
at hudson.remoting.Channel.attachCallSiteStackTrace(Channel.java:1741)
at hudson.remoting.UserRequest$ExceptionResponse.retrieve(UserRequest.java:357)
at hudson.remoting.Channel.call(Channel.java:955)
at hudson.remoting.RemoteInvocationHandler.invoke(RemoteInvocationHandler.java:283)
at com.sun.proxy.$Proxy112.clean(Unknown Source)
at org.jenkinsci.plugins.gitclient.RemoteGitImpl.clean(RemoteGitImpl.java:450)
at hudson.plugins.git.extensions.impl.CleanBeforeCheckout.decorateFetchCommand(CleanBeforeCheckout.java:30)
at hudson.plugins.git.GitSCM.fetchFrom(GitSCM.java:884)
at hudson.plugins.git.GitSCM.retrieveChanges(GitSCM.java:1155)
at hudson.plugins.git.GitSCM.checkout(GitSCM.java:1186)
at hudson.scm.SCM.checkout(SCM.java:504)
at hudson.model.AbstractProject.checkout(AbstractProject.java:1208)
at hudson.model.AbstractBuild$AbstractBuildExecution.defaultCheckout(AbstractBuild.java:574)
at jenkins.scm.SCMCheckoutStrategy.checkout(SCMCheckoutStrategy.java:86)
at hudson.model.AbstractBuild$AbstractBuildExecution.run(AbstractBuild.java:499)
at hudson.model.Run.execute(Run.java:1794)
at hudson.model.FreeStyleBuild.run(FreeStyleBuild.java:43)
at hudson.model.ResourceController.execute(ResourceController.java:97)
at hudson.model.Executor.run(Executor.java:429)
ERROR: Error fetching remote repo 'origin'
Archiving artifacts
Recording test results
ERROR: Step ?Publish JUnit test result report? failed: Test reports were found but none of them are new. Did leafNodes run?
For example, /home/jenkins/jenkins-slave/workspace/ZooKeeper_branch35_jdk8/build/test/logs/TEST-org.apache.jute.BinaryInputArchiveTest.xml is 20 days old
Email was triggered for: Failure - Any
Sending email for trigger: Failure - Any
###################################################################################
############################## FAILED TESTS (if any) ##############################
No tests ran.
ZooKeeper_branch35_jdk8 - Build # 1028 - Still Failing
Posted by Apache Jenkins Server <je...@builds.apache.org>.
See https://builds.apache.org/job/ZooKeeper_branch35_jdk8/1028/
###################################################################################
########################## LAST 60 LINES OF THE CONSOLE ###########################
[...truncated 62.26 KB...]
[junit] Running org.apache.zookeeper.test.ServerCnxnTest in thread 1
[junit] Tests run: 1, Failures: 0, Errors: 0, Skipped: 0, Time elapsed: 1.309 sec, Thread: 8, Class: org.apache.zookeeper.test.SaslSuperUserTest
[junit] Running org.apache.zookeeper.test.SessionInvalidationTest in thread 8
[junit] Tests run: 1, Failures: 0, Errors: 0, Skipped: 0, Time elapsed: 1.39 sec, Thread: 8, Class: org.apache.zookeeper.test.SessionInvalidationTest
[junit] Tests run: 1, Failures: 0, Errors: 0, Skipped: 0, Time elapsed: 3.35 sec, Thread: 1, Class: org.apache.zookeeper.test.ServerCnxnTest
[junit] Running org.apache.zookeeper.test.SessionTest in thread 8
[junit] Running org.apache.zookeeper.test.SessionTimeoutTest in thread 1
[junit] Tests run: 4, Failures: 0, Errors: 0, Skipped: 0, Time elapsed: 2.263 sec, Thread: 1, Class: org.apache.zookeeper.test.SessionTimeoutTest
[junit] Running org.apache.zookeeper.test.SessionTrackerCheckTest in thread 1
[junit] Tests run: 2, Failures: 0, Errors: 0, Skipped: 0, Time elapsed: 0.081 sec, Thread: 1, Class: org.apache.zookeeper.test.SessionTrackerCheckTest
[junit] Running org.apache.zookeeper.test.SessionUpgradeTest in thread 1
[junit] Tests run: 5, Failures: 0, Errors: 0, Skipped: 0, Time elapsed: 13.208 sec, Thread: 8, Class: org.apache.zookeeper.test.SessionTest
[junit] Running org.apache.zookeeper.test.StandaloneTest in thread 8
[junit] Tests run: 1, Failures: 0, Errors: 0, Skipped: 0, Time elapsed: 134.547 sec, Thread: 2, Class: org.apache.zookeeper.test.RecoveryTest
[junit] Running org.apache.zookeeper.test.StatTest in thread 2
[junit] Tests run: 4, Failures: 0, Errors: 0, Skipped: 0, Time elapsed: 2.715 sec, Thread: 8, Class: org.apache.zookeeper.test.StandaloneTest
[junit] Running org.apache.zookeeper.test.StaticHostProviderTest in thread 8
[junit] Tests run: 4, Failures: 0, Errors: 0, Skipped: 0, Time elapsed: 2.419 sec, Thread: 2, Class: org.apache.zookeeper.test.StatTest
[junit] Running org.apache.zookeeper.test.StringUtilTest in thread 2
[junit] Tests run: 1, Failures: 0, Errors: 0, Skipped: 0, Time elapsed: 0.064 sec, Thread: 2, Class: org.apache.zookeeper.test.StringUtilTest
[junit] Running org.apache.zookeeper.test.SyncCallTest in thread 2
[junit] Tests run: 13, Failures: 0, Errors: 0, Skipped: 0, Time elapsed: 2.719 sec, Thread: 8, Class: org.apache.zookeeper.test.StaticHostProviderTest
[junit] Tests run: 1, Failures: 0, Errors: 0, Skipped: 0, Time elapsed: 1.051 sec, Thread: 2, Class: org.apache.zookeeper.test.SyncCallTest
[junit] Running org.apache.zookeeper.test.TruncateTest in thread 8
[junit] Running org.apache.zookeeper.test.WatchEventWhenAutoResetTest in thread 2
[junit] Tests run: 1, Failures: 0, Errors: 0, Skipped: 0, Time elapsed: 90.46 sec, Thread: 3, Class: org.apache.zookeeper.test.RestoreCommittedLogTest
[junit] Running org.apache.zookeeper.test.WatchedEventTest in thread 3
[junit] Tests run: 4, Failures: 0, Errors: 0, Skipped: 0, Time elapsed: 0.078 sec, Thread: 3, Class: org.apache.zookeeper.test.WatchedEventTest
[junit] Running org.apache.zookeeper.test.WatcherFuncTest in thread 3
[junit] Tests run: 4, Failures: 0, Errors: 0, Skipped: 0, Time elapsed: 26.788 sec, Thread: 1, Class: org.apache.zookeeper.test.SessionUpgradeTest
[junit] Tests run: 6, Failures: 0, Errors: 0, Skipped: 0, Time elapsed: 3.931 sec, Thread: 3, Class: org.apache.zookeeper.test.WatcherFuncTest
[junit] Running org.apache.zookeeper.test.WatcherTest in thread 1
[junit] Running org.apache.zookeeper.test.X509AuthTest in thread 3
[junit] Tests run: 3, Failures: 0, Errors: 0, Skipped: 0, Time elapsed: 0.078 sec, Thread: 3, Class: org.apache.zookeeper.test.X509AuthTest
[junit] Running org.apache.zookeeper.test.ZkDatabaseCorruptionTest in thread 3
[junit] Tests run: 3, Failures: 0, Errors: 0, Skipped: 0, Time elapsed: 15.908 sec, Thread: 8, Class: org.apache.zookeeper.test.TruncateTest
[junit] Running org.apache.zookeeper.test.ZooKeeperQuotaTest in thread 8
[junit] Tests run: 1, Failures: 0, Errors: 0, Skipped: 0, Time elapsed: 1.603 sec, Thread: 8, Class: org.apache.zookeeper.test.ZooKeeperQuotaTest
[junit] Tests run: 4, Failures: 0, Errors: 0, Skipped: 0, Time elapsed: 22.564 sec, Thread: 2, Class: org.apache.zookeeper.test.WatchEventWhenAutoResetTest
[junit] Tests run: 2, Failures: 0, Errors: 0, Skipped: 0, Time elapsed: 15.11 sec, Thread: 3, Class: org.apache.zookeeper.test.ZkDatabaseCorruptionTest
[junit] Tests run: 8, Failures: 0, Errors: 0, Skipped: 0, Time elapsed: 34.364 sec, Thread: 1, Class: org.apache.zookeeper.test.WatcherTest
[junit] Tests run: 13, Failures: 0, Errors: 0, Skipped: 0, Time elapsed: 290.59 sec, Thread: 7, Class: org.apache.zookeeper.test.ReconfigTest
[junit] Tests run: 103, Failures: 0, Errors: 0, Skipped: 0, Time elapsed: 512.93 sec, Thread: 4, Class: org.apache.zookeeper.test.NettyNettySuiteTest
[junit] Tests run: 4, Failures: 0, Errors: 1, Skipped: 0, Time elapsed: 608.582 sec, Thread: 6, Class: org.apache.zookeeper.test.DisconnectedWatcherTest
[junit] Test org.apache.zookeeper.test.DisconnectedWatcherTest FAILED
[junit] Tests run: 103, Failures: 0, Errors: 0, Skipped: 0, Time elapsed: 573.627 sec, Thread: 5, Class: org.apache.zookeeper.test.NioNettySuiteTest
fail.build.on.test.failure:
BUILD FAILED
/home/jenkins/jenkins-slave/workspace/ZooKeeper_branch35_jdk8/build.xml:1302: The following error occurred while executing this line:
/home/jenkins/jenkins-slave/workspace/ZooKeeper_branch35_jdk8/build.xml:1306: Tests failed!
Total time: 16 minutes 9 seconds
Build step 'Invoke Ant' marked build as failure
Archiving artifacts
Recording test results
Email was triggered for: Failure - Any
Sending email for trigger: Failure - Any
###################################################################################
############################## FAILED TESTS (if any) ##############################
6 tests failed.
FAILED: org.apache.zookeeper.test.LocalSessionRequestTest.testLocalSessionsOnFollower
Error Message:
waiting for server up
Stack Trace:
junit.framework.AssertionFailedError: waiting for server up
at org.apache.zookeeper.test.QuorumBase.startServers(QuorumBase.java:223)
at org.apache.zookeeper.test.QuorumBase.setUp(QuorumBase.java:120)
at org.apache.zookeeper.test.QuorumBase.setUp(QuorumBase.java:78)
at org.apache.zookeeper.test.LocalSessionRequestTest.setUp(LocalSessionRequestTest.java:53)
FAILED: org.apache.zookeeper.test.MultiTransactionTest.testMultiRollback[1]
Error Message:
Unable to connect to server
Stack Trace:
junit.framework.AssertionFailedError: Unable to connect to server
at org.apache.zookeeper.test.ClientBase.createClient(ClientBase.java:232)
at org.apache.zookeeper.test.ClientBase.createClient(ClientBase.java:221)
at org.apache.zookeeper.test.ClientBase.createClient(ClientBase.java:206)
at org.apache.zookeeper.test.ClientBase.createClient(ClientBase.java:199)
at org.apache.zookeeper.test.MultiTransactionTest.testMultiRollback(MultiTransactionTest.java:260)
at org.apache.zookeeper.JUnit4ZKTestRunner$LoggedInvokeMethod.evaluate(JUnit4ZKTestRunner.java:79)
FAILED: org.apache.zookeeper.test.AsyncHammerTest.testHammer
Error Message:
thread HammerThread-11 still alive after join
Stack Trace:
junit.framework.AssertionFailedError: thread HammerThread-11 still alive after join
at org.apache.zookeeper.test.ClientBase.verifyThreadTerminated(ClientBase.java:367)
at org.apache.zookeeper.test.AsyncHammerTest.testHammer(AsyncHammerTest.java:184)
at org.apache.zookeeper.JUnit4ZKTestRunner$LoggedInvokeMethod.evaluate(JUnit4ZKTestRunner.java:79)
FAILED: org.apache.zookeeper.test.AsyncHammerTest.testObserversHammer
Error Message:
unable to create new native thread
Stack Trace:
java.lang.OutOfMemoryError: unable to create new native thread
at java.lang.Thread.start0(Native Method)
at java.lang.Thread.start(Thread.java:717)
at org.apache.zookeeper.test.AsyncHammerTest.testObserversHammer(AsyncHammerTest.java:207)
at org.apache.zookeeper.JUnit4ZKTestRunner$LoggedInvokeMethod.evaluate(JUnit4ZKTestRunner.java:79)
FAILED: org.apache.zookeeper.test.ObserverLETest.testLEWithObserver
Error Message:
unable to create new native thread
Stack Trace:
java.lang.OutOfMemoryError: unable to create new native thread
at java.lang.Thread.start0(Native Method)
at java.lang.Thread.start(Thread.java:717)
at org.apache.zookeeper.server.quorum.QuorumPeer.createElectionAlgorithm(QuorumPeer.java:1063)
at org.apache.zookeeper.server.quorum.QuorumPeer.startLeaderElection(QuorumPeer.java:951)
at org.apache.zookeeper.server.quorum.QuorumPeer.start(QuorumPeer.java:875)
at org.apache.zookeeper.test.QuorumBase.startServers(QuorumBase.java:218)
at org.apache.zookeeper.test.QuorumBase.setUp(QuorumBase.java:120)
at org.apache.zookeeper.test.ObserverLETest.establishThreeParticipantOneObserverEnsemble(ObserverLETest.java:37)
FAILED: org.apache.zookeeper.test.DisconnectedWatcherTest.testManyChildWatchersAutoReset
Error Message:
test timed out after 600000 milliseconds
Stack Trace:
org.junit.runners.model.TestTimedOutException: test timed out after 600000 milliseconds
at java.lang.Object.wait(Native Method)
at java.lang.Object.wait(Object.java:502)
at org.apache.zookeeper.ClientCnxn.submitRequest(ClientCnxn.java:1510)
at org.apache.zookeeper.ClientCnxn.submitRequest(ClientCnxn.java:1498)
at org.apache.zookeeper.ZooKeeper.create(ZooKeeper.java:1448)
at org.apache.zookeeper.test.DisconnectedWatcherTest.testManyChildWatchersAutoReset(DisconnectedWatcherTest.java:229)
at org.apache.zookeeper.JUnit4ZKTestRunner$LoggedInvokeMethod.evaluate(JUnit4ZKTestRunner.java:79)
at java.util.concurrent.FutureTask.run(FutureTask.java:266)
at java.lang.Thread.run(Thread.java:748)
ZooKeeper_branch35_jdk8 - Build # 1027 - Still Failing
Posted by Apache Jenkins Server <je...@builds.apache.org>.
See https://builds.apache.org/job/ZooKeeper_branch35_jdk8/1027/
###################################################################################
########################## LAST 60 LINES OF THE CONSOLE ###########################
[...truncated 62.38 KB...]
[junit] Running org.apache.zookeeper.test.ServerCnxnTest in thread 5
[junit] Tests run: 1, Failures: 0, Errors: 0, Skipped: 0, Time elapsed: 1.147 sec, Thread: 4, Class: org.apache.zookeeper.test.SaslSuperUserTest
[junit] Running org.apache.zookeeper.test.SessionInvalidationTest in thread 4
[junit] Tests run: 1, Failures: 0, Errors: 0, Skipped: 0, Time elapsed: 1.703 sec, Thread: 4, Class: org.apache.zookeeper.test.SessionInvalidationTest
[junit] Tests run: 1, Failures: 0, Errors: 0, Skipped: 0, Time elapsed: 3.434 sec, Thread: 5, Class: org.apache.zookeeper.test.ServerCnxnTest
[junit] Running org.apache.zookeeper.test.SessionTest in thread 4
[junit] Running org.apache.zookeeper.test.SessionTimeoutTest in thread 5
[junit] Tests run: 1, Failures: 0, Errors: 0, Skipped: 0, Time elapsed: 151.311 sec, Thread: 2, Class: org.apache.zookeeper.test.RecoveryTest
[junit] Running org.apache.zookeeper.test.SessionTrackerCheckTest in thread 2
[junit] Tests run: 2, Failures: 0, Errors: 0, Skipped: 0, Time elapsed: 0.089 sec, Thread: 2, Class: org.apache.zookeeper.test.SessionTrackerCheckTest
[junit] Tests run: 4, Failures: 0, Errors: 0, Skipped: 0, Time elapsed: 2.492 sec, Thread: 5, Class: org.apache.zookeeper.test.SessionTimeoutTest
[junit] Running org.apache.zookeeper.test.SessionUpgradeTest in thread 2
[junit] Running org.apache.zookeeper.test.StandaloneTest in thread 5
[junit] Tests run: 4, Failures: 0, Errors: 0, Skipped: 0, Time elapsed: 2.898 sec, Thread: 5, Class: org.apache.zookeeper.test.StandaloneTest
[junit] Running org.apache.zookeeper.test.StatTest in thread 5
[junit] Tests run: 4, Failures: 0, Errors: 0, Skipped: 0, Time elapsed: 2.362 sec, Thread: 5, Class: org.apache.zookeeper.test.StatTest
[junit] Running org.apache.zookeeper.test.StaticHostProviderTest in thread 5
[junit] Tests run: 1, Failures: 0, Errors: 0, Skipped: 0, Time elapsed: 96.64 sec, Thread: 3, Class: org.apache.zookeeper.test.RestoreCommittedLogTest
[junit] Tests run: 5, Failures: 0, Errors: 0, Skipped: 0, Time elapsed: 13.207 sec, Thread: 4, Class: org.apache.zookeeper.test.SessionTest
[junit] Running org.apache.zookeeper.test.StringUtilTest in thread 3
[junit] Tests run: 1, Failures: 0, Errors: 0, Skipped: 0, Time elapsed: 0.098 sec, Thread: 3, Class: org.apache.zookeeper.test.StringUtilTest
[junit] Tests run: 13, Failures: 0, Errors: 0, Skipped: 0, Time elapsed: 2.855 sec, Thread: 5, Class: org.apache.zookeeper.test.StaticHostProviderTest
[junit] Running org.apache.zookeeper.test.SyncCallTest in thread 4
[junit] Running org.apache.zookeeper.test.TruncateTest in thread 3
[junit] Running org.apache.zookeeper.test.WatchEventWhenAutoResetTest in thread 5
[junit] Tests run: 1, Failures: 0, Errors: 0, Skipped: 0, Time elapsed: 1.041 sec, Thread: 4, Class: org.apache.zookeeper.test.SyncCallTest
[junit] Running org.apache.zookeeper.test.WatchedEventTest in thread 4
[junit] Tests run: 4, Failures: 0, Errors: 0, Skipped: 0, Time elapsed: 0.141 sec, Thread: 4, Class: org.apache.zookeeper.test.WatchedEventTest
[junit] Running org.apache.zookeeper.test.WatcherFuncTest in thread 4
[junit] Tests run: 6, Failures: 0, Errors: 0, Skipped: 0, Time elapsed: 4.533 sec, Thread: 4, Class: org.apache.zookeeper.test.WatcherFuncTest
[junit] Running org.apache.zookeeper.test.WatcherTest in thread 4
[junit] Tests run: 3, Failures: 0, Errors: 0, Skipped: 0, Time elapsed: 15.596 sec, Thread: 3, Class: org.apache.zookeeper.test.TruncateTest
[junit] Running org.apache.zookeeper.test.X509AuthTest in thread 3
[junit] Tests run: 3, Failures: 0, Errors: 0, Skipped: 0, Time elapsed: 0.088 sec, Thread: 3, Class: org.apache.zookeeper.test.X509AuthTest
[junit] Tests run: 4, Failures: 0, Errors: 0, Skipped: 0, Time elapsed: 27.223 sec, Thread: 2, Class: org.apache.zookeeper.test.SessionUpgradeTest
[junit] Running org.apache.zookeeper.test.ZkDatabaseCorruptionTest in thread 3
[junit] Running org.apache.zookeeper.test.ZooKeeperQuotaTest in thread 2
[junit] Tests run: 1, Failures: 0, Errors: 0, Skipped: 0, Time elapsed: 1.534 sec, Thread: 2, Class: org.apache.zookeeper.test.ZooKeeperQuotaTest
[junit] Tests run: 4, Failures: 0, Errors: 0, Skipped: 0, Time elapsed: 22.99 sec, Thread: 5, Class: org.apache.zookeeper.test.WatchEventWhenAutoResetTest
[junit] Tests run: 2, Failures: 0, Errors: 0, Skipped: 0, Time elapsed: 14.377 sec, Thread: 3, Class: org.apache.zookeeper.test.ZkDatabaseCorruptionTest
[junit] Tests run: 8, Failures: 0, Errors: 0, Skipped: 0, Time elapsed: 34.236 sec, Thread: 4, Class: org.apache.zookeeper.test.WatcherTest
[junit] Tests run: 13, Failures: 0, Errors: 0, Skipped: 0, Time elapsed: 297.654 sec, Thread: 7, Class: org.apache.zookeeper.test.ReconfigTest
[junit] Tests run: 4, Failures: 0, Errors: 1, Skipped: 0, Time elapsed: 608.978 sec, Thread: 8, Class: org.apache.zookeeper.test.DisconnectedWatcherTest
[junit] Test org.apache.zookeeper.test.DisconnectedWatcherTest FAILED
[junit] Tests run: 103, Failures: 0, Errors: 0, Skipped: 0, Time elapsed: 566.06 sec, Thread: 1, Class: org.apache.zookeeper.test.NettyNettySuiteTest
[junit] Tests run: 103, Failures: 0, Errors: 0, Skipped: 0, Time elapsed: 597.819 sec, Thread: 6, Class: org.apache.zookeeper.test.NioNettySuiteTest
fail.build.on.test.failure:
BUILD FAILED
/home/jenkins/jenkins-slave/workspace/ZooKeeper_branch35_jdk8/build.xml:1302: The following error occurred while executing this line:
/home/jenkins/jenkins-slave/workspace/ZooKeeper_branch35_jdk8/build.xml:1306: Tests failed!
Total time: 16 minutes 28 seconds
Build step 'Invoke Ant' marked build as failure
Archiving artifacts
Recording test results
Email was triggered for: Failure - Any
Sending email for trigger: Failure - Any
###################################################################################
############################## FAILED TESTS (if any) ##############################
2 tests failed.
FAILED: org.apache.zookeeper.server.quorum.ReconfigRecoveryTest.testCurrentServersAreObserversInNextConfig
Error Message:
waiting for server 3 being up
Stack Trace:
junit.framework.AssertionFailedError: waiting for server 3 being up
at org.apache.zookeeper.server.quorum.ReconfigRecoveryTest.testCurrentServersAreObserversInNextConfig(ReconfigRecoveryTest.java:223)
at org.apache.zookeeper.JUnit4ZKTestRunner$LoggedInvokeMethod.evaluate(JUnit4ZKTestRunner.java:79)
FAILED: org.apache.zookeeper.test.DisconnectedWatcherTest.testManyChildWatchersAutoReset
Error Message:
test timed out after 600000 milliseconds
Stack Trace:
org.junit.runners.model.TestTimedOutException: test timed out after 600000 milliseconds
at java.lang.Object.wait(Native Method)
at java.lang.Object.wait(Object.java:502)
at org.apache.zookeeper.ClientCnxn.submitRequest(ClientCnxn.java:1510)
at org.apache.zookeeper.ClientCnxn.submitRequest(ClientCnxn.java:1498)
at org.apache.zookeeper.ZooKeeper.create(ZooKeeper.java:1448)
at org.apache.zookeeper.test.DisconnectedWatcherTest.testManyChildWatchersAutoReset(DisconnectedWatcherTest.java:236)
at org.apache.zookeeper.JUnit4ZKTestRunner$LoggedInvokeMethod.evaluate(JUnit4ZKTestRunner.java:79)
at java.util.concurrent.FutureTask.run(FutureTask.java:266)
at java.lang.Thread.run(Thread.java:748)
ZooKeeper_branch35_jdk8 - Build # 1026 - Still Failing
Posted by Apache Jenkins Server <je...@builds.apache.org>.
See https://builds.apache.org/job/ZooKeeper_branch35_jdk8/1026/
###################################################################################
########################## LAST 60 LINES OF THE CONSOLE ###########################
[...truncated 62.36 KB...]
[junit] Running org.apache.zookeeper.test.ServerCnxnTest in thread 3
[junit] Tests run: 1, Failures: 0, Errors: 0, Skipped: 0, Time elapsed: 1.244 sec, Thread: 5, Class: org.apache.zookeeper.test.SaslSuperUserTest
[junit] Running org.apache.zookeeper.test.SessionInvalidationTest in thread 5
[junit] Tests run: 1, Failures: 0, Errors: 0, Skipped: 0, Time elapsed: 1.586 sec, Thread: 5, Class: org.apache.zookeeper.test.SessionInvalidationTest
[junit] Tests run: 1, Failures: 0, Errors: 0, Skipped: 0, Time elapsed: 3.386 sec, Thread: 3, Class: org.apache.zookeeper.test.ServerCnxnTest
[junit] Running org.apache.zookeeper.test.SessionTest in thread 5
[junit] Running org.apache.zookeeper.test.SessionTimeoutTest in thread 3
[junit] Tests run: 4, Failures: 0, Errors: 0, Skipped: 0, Time elapsed: 2.557 sec, Thread: 3, Class: org.apache.zookeeper.test.SessionTimeoutTest
[junit] Running org.apache.zookeeper.test.SessionTrackerCheckTest in thread 3
[junit] Tests run: 2, Failures: 0, Errors: 0, Skipped: 0, Time elapsed: 0.104 sec, Thread: 3, Class: org.apache.zookeeper.test.SessionTrackerCheckTest
[junit] Running org.apache.zookeeper.test.SessionUpgradeTest in thread 3
[junit] Tests run: 1, Failures: 0, Errors: 0, Skipped: 0, Time elapsed: 127.988 sec, Thread: 6, Class: org.apache.zookeeper.test.RecoveryTest
[junit] Running org.apache.zookeeper.test.StandaloneTest in thread 6
[junit] Tests run: 4, Failures: 0, Errors: 0, Skipped: 0, Time elapsed: 2.928 sec, Thread: 6, Class: org.apache.zookeeper.test.StandaloneTest
[junit] Running org.apache.zookeeper.test.StatTest in thread 6
[junit] Tests run: 5, Failures: 0, Errors: 0, Skipped: 0, Time elapsed: 13.779 sec, Thread: 5, Class: org.apache.zookeeper.test.SessionTest
[junit] Running org.apache.zookeeper.test.StaticHostProviderTest in thread 5
[junit] Tests run: 4, Failures: 0, Errors: 0, Skipped: 0, Time elapsed: 2.434 sec, Thread: 6, Class: org.apache.zookeeper.test.StatTest
[junit] Tests run: 13, Failures: 0, Errors: 0, Skipped: 0, Time elapsed: 2.025 sec, Thread: 5, Class: org.apache.zookeeper.test.StaticHostProviderTest
[junit] Running org.apache.zookeeper.test.StringUtilTest in thread 6
[junit] Tests run: 1, Failures: 0, Errors: 0, Skipped: 0, Time elapsed: 0.064 sec, Thread: 6, Class: org.apache.zookeeper.test.StringUtilTest
[junit] Running org.apache.zookeeper.test.SyncCallTest in thread 5
[junit] Running org.apache.zookeeper.test.TruncateTest in thread 6
[junit] Tests run: 1, Failures: 0, Errors: 0, Skipped: 0, Time elapsed: 1.272 sec, Thread: 5, Class: org.apache.zookeeper.test.SyncCallTest
[junit] Running org.apache.zookeeper.test.WatchEventWhenAutoResetTest in thread 5
[junit] Tests run: 1, Failures: 0, Errors: 0, Skipped: 0, Time elapsed: 89.053 sec, Thread: 1, Class: org.apache.zookeeper.test.RestoreCommittedLogTest
[junit] Running org.apache.zookeeper.test.WatchedEventTest in thread 1
[junit] Tests run: 4, Failures: 0, Errors: 0, Skipped: 0, Time elapsed: 0.088 sec, Thread: 1, Class: org.apache.zookeeper.test.WatchedEventTest
[junit] Running org.apache.zookeeper.test.WatcherFuncTest in thread 1
[junit] Tests run: 6, Failures: 0, Errors: 0, Skipped: 0, Time elapsed: 4.89 sec, Thread: 1, Class: org.apache.zookeeper.test.WatcherFuncTest
[junit] Running org.apache.zookeeper.test.WatcherTest in thread 1
[junit] Tests run: 4, Failures: 0, Errors: 0, Skipped: 0, Time elapsed: 24.411 sec, Thread: 3, Class: org.apache.zookeeper.test.SessionUpgradeTest
[junit] Running org.apache.zookeeper.test.X509AuthTest in thread 3
[junit] Tests run: 3, Failures: 0, Errors: 0, Skipped: 0, Time elapsed: 0.097 sec, Thread: 3, Class: org.apache.zookeeper.test.X509AuthTest
[junit] Running org.apache.zookeeper.test.ZkDatabaseCorruptionTest in thread 3
[junit] Tests run: 3, Failures: 0, Errors: 0, Skipped: 0, Time elapsed: 16.25 sec, Thread: 6, Class: org.apache.zookeeper.test.TruncateTest
[junit] Running org.apache.zookeeper.test.ZooKeeperQuotaTest in thread 6
[junit] Tests run: 1, Failures: 0, Errors: 0, Skipped: 0, Time elapsed: 1.658 sec, Thread: 6, Class: org.apache.zookeeper.test.ZooKeeperQuotaTest
[junit] Tests run: 4, Failures: 0, Errors: 0, Skipped: 0, Time elapsed: 24.159 sec, Thread: 5, Class: org.apache.zookeeper.test.WatchEventWhenAutoResetTest
[junit] Tests run: 2, Failures: 0, Errors: 0, Skipped: 0, Time elapsed: 20.929 sec, Thread: 3, Class: org.apache.zookeeper.test.ZkDatabaseCorruptionTest
[junit] Tests run: 8, Failures: 0, Errors: 0, Skipped: 0, Time elapsed: 34.325 sec, Thread: 1, Class: org.apache.zookeeper.test.WatcherTest
[junit] Tests run: 13, Failures: 0, Errors: 0, Skipped: 0, Time elapsed: 282.721 sec, Thread: 7, Class: org.apache.zookeeper.test.ReconfigTest
[junit] Tests run: 103, Failures: 0, Errors: 0, Skipped: 0, Time elapsed: 525.305 sec, Thread: 8, Class: org.apache.zookeeper.test.NettyNettySuiteTest
[junit] Tests run: 4, Failures: 0, Errors: 1, Skipped: 0, Time elapsed: 608.624 sec, Thread: 4, Class: org.apache.zookeeper.test.DisconnectedWatcherTest
[junit] Test org.apache.zookeeper.test.DisconnectedWatcherTest FAILED
[junit] Tests run: 103, Failures: 0, Errors: 0, Skipped: 0, Time elapsed: 560.933 sec, Thread: 2, Class: org.apache.zookeeper.test.NioNettySuiteTest
fail.build.on.test.failure:
BUILD FAILED
/home/jenkins/jenkins-slave/workspace/ZooKeeper_branch35_jdk8/build.xml:1302: The following error occurred while executing this line:
/home/jenkins/jenkins-slave/workspace/ZooKeeper_branch35_jdk8/build.xml:1306: Tests failed!
Total time: 15 minutes 12 seconds
Build step 'Invoke Ant' marked build as failure
Archiving artifacts
Recording test results
Email was triggered for: Failure - Any
Sending email for trigger: Failure - Any
###################################################################################
############################## FAILED TESTS (if any) ##############################
1 tests failed.
FAILED: org.apache.zookeeper.test.DisconnectedWatcherTest.testManyChildWatchersAutoReset
Error Message:
test timed out after 600000 milliseconds
Stack Trace:
org.junit.runners.model.TestTimedOutException: test timed out after 600000 milliseconds
at java.lang.Object.wait(Native Method)
at java.lang.Object.wait(Object.java:502)
at org.apache.zookeeper.ClientCnxn.submitRequest(ClientCnxn.java:1510)
at org.apache.zookeeper.ClientCnxn.submitRequest(ClientCnxn.java:1498)
at org.apache.zookeeper.ZooKeeper.create(ZooKeeper.java:1448)
at org.apache.zookeeper.test.DisconnectedWatcherTest.testManyChildWatchersAutoReset(DisconnectedWatcherTest.java:236)
at org.apache.zookeeper.JUnit4ZKTestRunner$LoggedInvokeMethod.evaluate(JUnit4ZKTestRunner.java:79)
at java.util.concurrent.FutureTask.run(FutureTask.java:266)
at java.lang.Thread.run(Thread.java:748)