You are viewing a plain text version of this content. The canonical link for it is here.
Posted to builds@cassandra.apache.org by Apache Jenkins Server <je...@builds.apache.org> on 2023/07/28 03:36:05 UTC

Build complete: Cassandra-trunk #1647 [UNSTABLE] 3ba4cd24a0c6b5a90ac0ed57ec2eec152308f211

-------------------------------------------------------------------------------
Build Cassandra-trunk #1647 Still Unstable
URL: https://ci-cassandra.apache.org/job/Cassandra-trunk/1647/
-------------------------------------------------------------------------------
Changes:
[Caleb Rackliffe] ninja-fix: make sure testVirtualTableThroughIndexLifeCycle disabled


-------------------------------------------------------------------------------
Failed Tests:
44 tests failed.
FAILED:  dtest-offheap.bootstrap_test.TestBootstrap.test_simultaneous_bootstrap
FAILED:  dtest-offheap.sslnodetonode_test.TestNodeToNodeSSLEncryption.test_ssl_correct_hostname_with_validation
FAILED:  dtest-upgrade.upgrade_tests.bootstrap_upgrade_test.TestBootstrapUpgrade.test_simultaneous_bootstrap
FAILED:  dtest.materialized_views_test.TestMaterializedViewsConsistency.test_multi_partition_consistent_reads_after_write
FAILED:  dtest.replace_address_test.TestReplaceAddress.test_fail_without_replace
FAILED:  org.apache.cassandra.tools.nodetool.ForceCompactionTest.forceCompactMultipleRowsTombstoneTest-compression.jdk11
FAILED:  dtest-upgrade.upgrade_tests.cql_tests.TestCQLNodes3RF3_Upgrade_indev_4_0_x_To_indev_trunk.test_negative_timestamp
FAILED:  dtest-upgrade.upgrade_tests.cql_tests.TestCQLNodes3RF3_Upgrade_indev_4_0_x_To_indev_trunk.test_negative_timestamp
FAILED:  dtest-upgrade.upgrade_tests.cql_tests.TestCQLNodes3RF3_Upgrade_current_4_0_x_To_indev_trunk.test_negative_timestamp
FAILED:  dtest-upgrade.upgrade_tests.cql_tests.TestCQLNodes3RF3_Upgrade_current_4_0_x_To_indev_trunk.test_negative_timestamp
FAILED:  dtest-upgrade.upgrade_tests.cql_tests.TestCQLNodes2RF1_Upgrade_indev_4_1_x_To_indev_trunk.test_negative_timestamp
FAILED:  dtest-upgrade.upgrade_tests.cql_tests.TestCQLNodes2RF1_Upgrade_indev_4_1_x_To_indev_trunk.test_negative_timestamp
FAILED:  dtest-upgrade.upgrade_tests.cql_tests.TestCQLNodes2RF1_Upgrade_current_4_0_x_To_indev_trunk.test_negative_timestamp
FAILED:  dtest-upgrade.upgrade_tests.cql_tests.TestCQLNodes2RF1_Upgrade_current_4_0_x_To_indev_trunk.test_negative_timestamp
FAILED:  dtest-upgrade.upgrade_tests.cql_tests.TestCQLNodes3RF3_Upgrade_current_4_1_x_To_indev_trunk.test_negative_timestamp
FAILED:  dtest-upgrade.upgrade_tests.cql_tests.TestCQLNodes3RF3_Upgrade_current_4_1_x_To_indev_trunk.test_negative_timestamp
FAILED:  dtest-upgrade.upgrade_tests.cql_tests.TestCQLNodes2RF1_Upgrade_current_4_1_x_To_indev_trunk.test_negative_timestamp
FAILED:  dtest-upgrade.upgrade_tests.cql_tests.TestCQLNodes2RF1_Upgrade_current_4_1_x_To_indev_trunk.test_negative_timestamp
FAILED:  dtest-upgrade.upgrade_tests.cql_tests.cls.test_negative_timestamp
FAILED:  dtest-upgrade.upgrade_tests.cql_tests.cls.test_negative_timestamp
FAILED:  dtest-upgrade.upgrade_tests.cql_tests.TestCQLNodes2RF1_Upgrade_indev_4_0_x_To_indev_trunk.test_negative_timestamp
FAILED:  dtest-upgrade.upgrade_tests.cql_tests.TestCQLNodes2RF1_Upgrade_indev_4_0_x_To_indev_trunk.test_negative_timestamp
FAILED:  dtest-upgrade.upgrade_tests.cql_tests.TestCQLNodes3RF3_Upgrade_indev_4_1_x_To_indev_trunk.test_negative_timestamp
FAILED:  dtest-upgrade.upgrade_tests.cql_tests.TestCQLNodes3RF3_Upgrade_indev_4_1_x_To_indev_trunk.test_negative_timestamp
FAILED:  org.apache.cassandra.security.SSLFactoryTest.testCacheKeyEqualityForCustomSslContextFactory-cdc.jdk17
FAILED:  org.apache.cassandra.security.SSLFactoryTest.testCacheKeyInequalityForCustomSslContextFactory-cdc.jdk17
FAILED:  org.apache.cassandra.security.SSLFactoryTest.testClientSocketShouldUseOutboundKeystore-cdc.jdk17
FAILED:  org.apache.cassandra.security.SSLFactoryTest.testSslFactoryHotReload_BadPassword_DoesNotClearExistingSslContext-cdc.jdk17
FAILED:  org.apache.cassandra.security.SSLFactoryTest.testSslFactoryHotReload_CorruptOrNonExistentFile_DoesNotClearExistingSslContext-cdc.jdk17
FAILED:  org.apache.cassandra.security.SSLFactoryTest.testPEMSslContextReload_HappyPath-cdc.jdk17
FAILED:  org.apache.cassandra.security.SSLFactoryTest.testSslFactorySslInit_BadPassword_ThrowsException-cdc.jdk17
FAILED:  org.apache.cassandra.security.SSLFactoryTest.testSslContextReload_HappyPath-cdc.jdk17
FAILED:  org.apache.cassandra.security.SSLFactoryTest.getSslContext_ParamChanges-cdc.jdk17
FAILED:  org.apache.cassandra.security.SSLFactoryTest.testServerSocketShouldUseKeystore-cdc.jdk17
FAILED:  org.apache.cassandra.security.SSLFactoryTest.testCacheKeyEqualityForCustomSslContextFactory-.jdk17
FAILED:  org.apache.cassandra.security.SSLFactoryTest.testCacheKeyInequalityForCustomSslContextFactory-.jdk17
FAILED:  org.apache.cassandra.security.SSLFactoryTest.testClientSocketShouldUseOutboundKeystore-.jdk17
FAILED:  org.apache.cassandra.security.SSLFactoryTest.testSslFactoryHotReload_BadPassword_DoesNotClearExistingSslContext-.jdk17
FAILED:  org.apache.cassandra.security.SSLFactoryTest.testSslFactoryHotReload_CorruptOrNonExistentFile_DoesNotClearExistingSslContext-.jdk17
FAILED:  org.apache.cassandra.security.SSLFactoryTest.testPEMSslContextReload_HappyPath-.jdk17
FAILED:  org.apache.cassandra.security.SSLFactoryTest.testSslFactorySslInit_BadPassword_ThrowsException-.jdk17
FAILED:  org.apache.cassandra.security.SSLFactoryTest.testSslContextReload_HappyPath-.jdk17
FAILED:  org.apache.cassandra.security.SSLFactoryTest.getSslContext_ParamChanges-.jdk17
FAILED:  org.apache.cassandra.security.SSLFactoryTest.testServerSocketShouldUseKeystore-.jdk17

-------------------------------------------------------------------------------
For complete test report and logs see https://nightlies.apache.org/cassandra/Cassandra-trunk/1647/