You are viewing a plain text version of this content. The canonical link for it is here.
Posted to builds@solr.apache.org by Apache Jenkins Server <je...@builds.apache.org> on 2025/12/05 19:44:55 UTC

[JENKINS] Solr » Solr-Test-9.10 - Build # 367 - Still Failing!

Build: https://ci-builds.apache.org/job/Solr/job/Solr-Test-9.10/367/

No tests ran.

Build Log:
[...truncated 184 lines...]
BUILD FAILED in 1m 27s
60 actionable tasks: 60 executed

Publishing build scan...
https://develocity.apache.org/s/qbgdpl22dgjqu

Build step 'Invoke Gradle script' changed build result to FAILURE
Build step 'Invoke Gradle script' marked build as failure
Archiving artifacts
Recording test results
ERROR: Step ‘Publish JUnit test result report’ failed: No test report files were found. Configuration error?
Email was triggered for: Failure - Any
Sending email for trigger: Failure - Any

[JENKINS] Solr » Solr-Test-9.10 - Build # 368 - Still Failing!

Posted by Apache Jenkins Server <je...@builds.apache.org>.
Build: https://ci-builds.apache.org/job/Solr/job/Solr-Test-9.10/368/

No tests ran.

Build Log:
[...truncated 184 lines...]
BUILD FAILED in 1m 25s
60 actionable tasks: 60 executed

Publishing build scan...
https://develocity.apache.org/s/tajviouuonlh2

Build step 'Invoke Gradle script' changed build result to FAILURE
Build step 'Invoke Gradle script' marked build as failure
Archiving artifacts
Recording test results
ERROR: Step ‘Publish JUnit test result report’ failed: No test report files were found. Configuration error?
Email was triggered for: Failure - Any
Sending email for trigger: Failure - Any