You are viewing a plain text version of this content. The canonical link for it is here.
Posted to commits@carbondata.apache.org by Apache Jenkins Server <je...@builds.apache.org> on 2016/10/15 06:48:12 UTC

Build failed in Jenkins: CarbonData-master #125

See <https://builds.apache.org/job/CarbonData-master/125/changes>

Changes:

[jackylk] support append in dataframe

------------------------------------------
Started by an SCM change
[EnvInject] - Loading node environment variables.
Building remotely on ubuntu-2 (Ubuntu yahoo-not-h2 ubuntu docker) in workspace <https://builds.apache.org/job/CarbonData-master/ws/>
Cloning the remote Git repository
Cloning repository https://git-wip-us.apache.org/repos/asf/incubator-carbondata.git
 > git init <https://builds.apache.org/job/CarbonData-master/ws/> # timeout=10
Fetching upstream changes from https://git-wip-us.apache.org/repos/asf/incubator-carbondata.git
 > git --version # timeout=10
 > git -c core.askpass=true fetch --tags --progress https://git-wip-us.apache.org/repos/asf/incubator-carbondata.git +refs/heads/*:refs/remotes/origin/*
 > git config remote.origin.url https://git-wip-us.apache.org/repos/asf/incubator-carbondata.git # timeout=10
 > git config --add remote.origin.fetch +refs/heads/*:refs/remotes/origin/* # timeout=10
 > git config remote.origin.url https://git-wip-us.apache.org/repos/asf/incubator-carbondata.git # timeout=10
Fetching upstream changes from https://git-wip-us.apache.org/repos/asf/incubator-carbondata.git
 > git -c core.askpass=true fetch --tags --progress https://git-wip-us.apache.org/repos/asf/incubator-carbondata.git +refs/heads/*:refs/remotes/origin/*
 > git rev-parse refs/remotes/origin/master^{commit} # timeout=10
 > git rev-parse refs/remotes/origin/origin/master^{commit} # timeout=10
Checking out Revision 14595bf6995a62c679834bc5137323bc619b2190 (refs/remotes/origin/master)
 > git config core.sparsecheckout # timeout=10
 > git checkout -f 14595bf6995a62c679834bc5137323bc619b2190
 > git rev-list 70c1015e44d3e6dfbbf5618bcbf8a80959dac705 # timeout=10
Parsing POMs
Modules changed, recalculating dependency graph
Established TCP socket on 38260
maven32-agent.jar already up to date
maven32-interceptor.jar already up to date
maven3-interceptor-commons.jar already up to date
[CarbonData-master] $ /home/jenkins/tools/java/latest1.8/bin/java -Xmx2g -Xms256m -XX:MaxPermSize=512m -cp /home/jenkins/jenkins-slave/maven32-agent.jar:/home/jenkins/tools/maven/apache-maven-3.3.3/boot/plexus-classworlds-2.5.2.jar:/home/jenkins/tools/maven/apache-maven-3.3.3/conf/logging jenkins.maven3.agent.Maven32Main /home/jenkins/tools/maven/apache-maven-3.3.3 /home/jenkins/jenkins-slave/slave.jar /home/jenkins/jenkins-slave/maven32-interceptor.jar /home/jenkins/jenkins-slave/maven3-interceptor-commons.jar 38260
Java HotSpot(TM) 64-Bit Server VM warning: ignoring option MaxPermSize=512m; support was removed in 8.0
<===[JENKINS REMOTING CAPACITY]===>   channel started
Executing Maven:  -B -f <https://builds.apache.org/job/CarbonData-master/ws/pom.xml> -Dmaven.repo.local=/home/jenkins/jenkins-slave/maven-repositories/0 -B -e clean package
[INFO] Error stacktraces are turned on.
[INFO] Scanning for projects...
[INFO] ------------------------------------------------------------------------
[INFO] Reactor Build Order:
[INFO] 
[INFO] Apache CarbonData :: Parent
[INFO] Apache CarbonData :: Common
[INFO] Apache CarbonData :: Format
[INFO] Apache CarbonData :: Core
[INFO] Apache CarbonData :: Processing
[INFO] Apache CarbonData :: Hadoop
[INFO] Apache CarbonData :: Spark
[INFO] Apache CarbonData :: Assembly
[INFO] Apache CarbonData :: Examples
[INFO]                                                                         
[INFO] ------------------------------------------------------------------------
[INFO] Building Apache CarbonData :: Parent 0.2.0-incubating-SNAPSHOT
[INFO] ------------------------------------------------------------------------
[INFO] 
[INFO] --- maven-clean-plugin:2.5:clean (default-clean) @ carbondata-parent ---
[INFO] 
[INFO] --- maven-remote-resources-plugin:1.5:process (default) @ carbondata-parent ---
[INFO] 
[INFO] --- maven-site-plugin:3.4:attach-descriptor (attach-descriptor) @ carbondata-parent ---
[INFO]                                                                         
[INFO] ------------------------------------------------------------------------
[INFO] Building Apache CarbonData :: Common 0.2.0-incubating-SNAPSHOT
[INFO] ------------------------------------------------------------------------
[INFO] 
[INFO] --- maven-clean-plugin:2.5:clean (default-clean) @ carbondata-common ---
[INFO] 
[INFO] --- maven-remote-resources-plugin:1.5:process (default) @ carbondata-common ---
[INFO] 
[INFO] --- maven-resources-plugin:2.7:resources (default-resources) @ carbondata-common ---
[INFO] Using 'UTF-8' encoding to copy filtered resources.
[INFO] skip non existing resourceDirectory <https://builds.apache.org/job/CarbonData-master/ws/common/src/main/resources>
[INFO] Copying 3 resources
[INFO] 
[INFO] --- maven-compiler-plugin:3.2:compile (default-compile) @ carbondata-common ---
[INFO] Changes detected - recompiling the module!
[INFO] Compiling 9 source files to <https://builds.apache.org/job/CarbonData-master/ws/common/target/classes>
[INFO] 
[INFO] --- maven-resources-plugin:2.7:testResources (default-testResources) @ carbondata-common ---
[INFO] Using 'UTF-8' encoding to copy filtered resources.
[INFO] skip non existing resourceDirectory <https://builds.apache.org/job/CarbonData-master/ws/common/src/test/resources>
[INFO] Copying 3 resources
[INFO] 
[INFO] --- maven-compiler-plugin:3.2:testCompile (default-testCompile) @ carbondata-common ---
[INFO] Changes detected - recompiling the module!
[INFO] Compiling 7 source files to <https://builds.apache.org/job/CarbonData-master/ws/common/target/test-classes>
[INFO] <https://builds.apache.org/job/CarbonData-master/ws/common/src/test/java/org/apache/carbondata/common/logging/impl/AuditExtendedRollingFileAppenderTest_UT.java>: Some input files use or override a deprecated API.
[INFO] <https://builds.apache.org/job/CarbonData-master/ws/common/src/test/java/org/apache/carbondata/common/logging/impl/AuditExtendedRollingFileAppenderTest_UT.java>: Recompile with -Xlint:deprecation for details.
[INFO] 
[INFO] --- maven-surefire-plugin:2.18.1:test (default-test) @ carbondata-common ---
[JENKINS] Recording test results
[INFO] 
[INFO] --- maven-jar-plugin:2.5:jar (default-jar) @ carbondata-common ---
[INFO] Building jar: <https://builds.apache.org/job/CarbonData-master/ws/common/target/carbondata-common-0.2.0-incubating-SNAPSHOT.jar>
[INFO] 
[INFO] --- maven-site-plugin:3.4:attach-descriptor (attach-descriptor) @ carbondata-common ---
[INFO]                                                                         
[INFO] ------------------------------------------------------------------------
[INFO] Building Apache CarbonData :: Format 0.2.0-incubating-SNAPSHOT
[INFO] ------------------------------------------------------------------------
[INFO] 
[INFO] --- maven-clean-plugin:2.5:clean (default-clean) @ carbondata-format ---
[INFO] 
[INFO] --- maven-thrift-plugin:0.1.11:compile (generate-thrift-java) @ carbondata-format ---
[ERROR] thrift failed output: 
[ERROR] thrift failed error: /bin/sh: 1: thrift: not found

[INFO] ------------------------------------------------------------------------
[INFO] Reactor Summary:
[INFO] 
[INFO] Apache CarbonData :: Parent ........................ SUCCESS [ 25.636 s]
[INFO] Apache CarbonData :: Common ........................ SUCCESS [ 35.034 s]
[INFO] Apache CarbonData :: Format ........................ FAILURE [  7.075 s]
[INFO] Apache CarbonData :: Core .......................... SKIPPED
[INFO] Apache CarbonData :: Processing .................... SKIPPED
[INFO] Apache CarbonData :: Hadoop ........................ SKIPPED
[INFO] Apache CarbonData :: Spark ......................... SKIPPED
[INFO] Apache CarbonData :: Assembly ...................... SKIPPED
[INFO] Apache CarbonData :: Examples ...................... SKIPPED
[INFO] ------------------------------------------------------------------------
[INFO] BUILD FAILURE
[INFO] ------------------------------------------------------------------------
[INFO] Total time: 01:17 min
[INFO] Finished at: 2016-10-15T06:45:23+00:00
[INFO] Final Memory: 32M/297M
[INFO] ------------------------------------------------------------------------
Waiting for Jenkins to finish collecting data
[ERROR] Failed to execute goal org.apache.thrift.tools:maven-thrift-plugin:0.1.11:compile (generate-thrift-java) on project carbondata-format: thrift did not exit cleanly. Review output for more information. -> [Help 1]
org.apache.maven.lifecycle.LifecycleExecutionException: Failed to execute goal org.apache.thrift.tools:maven-thrift-plugin:0.1.11:compile (generate-thrift-java) on project carbondata-format: thrift did not exit cleanly. Review output for more information.
	at org.apache.maven.lifecycle.internal.MojoExecutor.execute(MojoExecutor.java:212)
	at org.apache.maven.lifecycle.internal.MojoExecutor.execute(MojoExecutor.java:153)
	at org.apache.maven.lifecycle.internal.MojoExecutor.execute(MojoExecutor.java:145)
	at org.apache.maven.lifecycle.internal.LifecycleModuleBuilder.buildProject(LifecycleModuleBuilder.java:116)
	at org.apache.maven.lifecycle.internal.LifecycleModuleBuilder.buildProject(LifecycleModuleBuilder.java:80)
	at org.apache.maven.lifecycle.internal.builder.singlethreaded.SingleThreadedBuilder.build(SingleThreadedBuilder.java:51)
	at org.apache.maven.lifecycle.internal.LifecycleStarter.execute(LifecycleStarter.java:128)
	at org.apache.maven.DefaultMaven.doExecute(DefaultMaven.java:307)
	at org.apache.maven.DefaultMaven.doExecute(DefaultMaven.java:193)
	at org.apache.maven.DefaultMaven.execute(DefaultMaven.java:106)
	at org.jvnet.hudson.maven3.launcher.Maven32Launcher.main(Maven32Launcher.java:132)
	at sun.reflect.NativeMethodAccessorImpl.invoke0(Native Method)
	at sun.reflect.NativeMethodAccessorImpl.invoke(NativeMethodAccessorImpl.java:62)
	at sun.reflect.DelegatingMethodAccessorImpl.invoke(DelegatingMethodAccessorImpl.java:43)
	at java.lang.reflect.Method.invoke(Method.java:498)
	at org.codehaus.plexus.classworlds.launcher.Launcher.launchStandard(Launcher.java:330)
	at org.codehaus.plexus.classworlds.launcher.Launcher.launch(Launcher.java:238)
	at jenkins.maven3.agent.Maven32Main.launch(Maven32Main.java:186)
	at sun.reflect.NativeMethodAccessorImpl.invoke0(Native Method)
	at sun.reflect.NativeMethodAccessorImpl.invoke(NativeMethodAccessorImpl.java:62)
	at sun.reflect.DelegatingMethodAccessorImpl.invoke(DelegatingMethodAccessorImpl.java:43)
	at java.lang.reflect.Method.invoke(Method.java:498)
	at hudson.maven.Maven3Builder.call(Maven3Builder.java:136)
	at hudson.maven.Maven3Builder.call(Maven3Builder.java:71)
	at hudson.remoting.UserRequest.perform(UserRequest.java:153)
	at hudson.remoting.UserRequest.perform(UserRequest.java:50)
	at hudson.remoting.Request$2.run(Request.java:332)
	at hudson.remoting.InterceptingExecutorService$1.call(InterceptingExecutorService.java:68)
	at java.util.concurrent.FutureTask.run(FutureTask.java:266)
	at java.util.concurrent.ThreadPoolExecutor.runWorker(ThreadPoolExecutor.java:1142)
	at java.util.concurrent.ThreadPoolExecutor$Worker.run(ThreadPoolExecutor.java:617)
	at java.lang.Thread.run(Thread.java:745)
Caused by: org.apache.maven.plugin.MojoFailureException: thrift did not exit cleanly. Review output for more information.
	at org.apache.thrift.maven.AbstractThriftMojo.execute(AbstractThriftMojo.java:177)
	at org.apache.thrift.maven.ThriftCompileMojo.execute(ThriftCompileMojo.java:21)
	at org.apache.maven.plugin.DefaultBuildPluginManager.executeMojo(DefaultBuildPluginManager.java:134)
	at org.apache.maven.lifecycle.internal.MojoExecutor.execute(MojoExecutor.java:208)
	... 31 more
[ERROR] 
[ERROR] Re-run Maven using the -X switch to enable full debug logging.
[ERROR] 
[ERROR] For more information about the errors and possible solutions, please read the following articles:
[ERROR] [Help 1] http://cwiki.apache.org/confluence/display/MAVEN/MojoFailureException
[ERROR] 
[ERROR] After correcting the problems, you can resume the build with the command
[ERROR]   mvn <goals> -rf :carbondata-format
[JENKINS] Archiving <https://builds.apache.org/job/CarbonData-master/ws/processing/pom.xml> to org.apache.carbondata/carbondata-processing/0.2.0-incubating-SNAPSHOT/carbondata-processing-0.2.0-incubating-SNAPSHOT.pom
[JENKINS] Archiving <https://builds.apache.org/job/CarbonData-master/ws/assembly/pom.xml> to org.apache.carbondata/carbondata-assembly/0.2.0-incubating-SNAPSHOT/carbondata-assembly-0.2.0-incubating-SNAPSHOT.pom
[JENKINS] Archiving <https://builds.apache.org/job/CarbonData-master/ws/pom.xml> to org.apache.carbondata/carbondata-parent/0.2.0-incubating-SNAPSHOT/carbondata-parent-0.2.0-incubating-SNAPSHOT.pom
[JENKINS] Archiving <https://builds.apache.org/job/CarbonData-master/ws/core/pom.xml> to org.apache.carbondata/carbondata-core/0.2.0-incubating-SNAPSHOT/carbondata-core-0.2.0-incubating-SNAPSHOT.pom
[JENKINS] Archiving <https://builds.apache.org/job/CarbonData-master/ws/format/pom.xml> to org.apache.carbondata/carbondata-format/0.2.0-incubating-SNAPSHOT/carbondata-format-0.2.0-incubating-SNAPSHOT.pom
[JENKINS] Archiving <https://builds.apache.org/job/CarbonData-master/ws/hadoop/pom.xml> to org.apache.carbondata/carbondata-hadoop/0.2.0-incubating-SNAPSHOT/carbondata-hadoop-0.2.0-incubating-SNAPSHOT.pom
[JENKINS] Archiving <https://builds.apache.org/job/CarbonData-master/ws/examples/pom.xml> to org.apache.carbondata/carbondata-examples/0.2.0-incubating-SNAPSHOT/carbondata-examples-0.2.0-incubating-SNAPSHOT.pom
[JENKINS] Archiving <https://builds.apache.org/job/CarbonData-master/ws/common/pom.xml> to org.apache.carbondata/carbondata-common/0.2.0-incubating-SNAPSHOT/carbondata-common-0.2.0-incubating-SNAPSHOT.pom
[JENKINS] Archiving <https://builds.apache.org/job/CarbonData-master/ws/common/target/carbondata-common-0.2.0-incubating-SNAPSHOT.jar> to org.apache.carbondata/carbondata-common/0.2.0-incubating-SNAPSHOT/carbondata-common-0.2.0-incubating-SNAPSHOT.jar
[JENKINS] Archiving <https://builds.apache.org/job/CarbonData-master/ws/integration/spark/pom.xml> to org.apache.carbondata/carbondata-spark/0.2.0-incubating-SNAPSHOT/carbondata-spark-0.2.0-incubating-SNAPSHOT.pom
Sending e-mails to: commits@carbondata.incubator.apache.org
channel stopped

Build failed in Jenkins: CarbonData-master #135

Posted by Apache Jenkins Server <je...@builds.apache.org>.
See <https://builds.apache.org/job/CarbonData-master/135/changes>

Changes:

[ravipesala] csvinputformat

------------------------------------------
Started by an SCM change
[EnvInject] - Loading node environment variables.
Building remotely on ubuntu-us1 (Ubuntu ubuntu docker) in workspace <https://builds.apache.org/job/CarbonData-master/ws/>
 > git rev-parse --is-inside-work-tree # timeout=10
Fetching changes from the remote Git repository
 > git config remote.origin.url https://git-wip-us.apache.org/repos/asf/incubator-carbondata.git # timeout=10
Fetching upstream changes from https://git-wip-us.apache.org/repos/asf/incubator-carbondata.git
 > git --version # timeout=10
 > git -c core.askpass=true fetch --tags --progress https://git-wip-us.apache.org/repos/asf/incubator-carbondata.git +refs/heads/*:refs/remotes/origin/*
 > git rev-parse refs/remotes/origin/master^{commit} # timeout=10
 > git rev-parse refs/remotes/origin/origin/master^{commit} # timeout=10
Checking out Revision f88ab66a90f968e9debb6e50f9e4baed04b3cf74 (refs/remotes/origin/master)
 > git config core.sparsecheckout # timeout=10
 > git checkout -f f88ab66a90f968e9debb6e50f9e4baed04b3cf74
 > git rev-list ccf110ea296d9340b4c871043854496f23166b9a # timeout=10
Parsing POMs
Modules changed, recalculating dependency graph
Established TCP socket on 53761
maven32-agent.jar already up to date
maven32-interceptor.jar already up to date
maven3-interceptor-commons.jar already up to date
[CarbonData-master] $ /home/jenkins/tools/java/latest1.8/bin/java -Xmx2g -Xms256m -XX:MaxPermSize=512m -cp /home/jenkins/jenkins-slave/maven32-agent.jar:/home/jenkins/tools/maven/apache-maven-3.3.3/boot/plexus-classworlds-2.5.2.jar:/home/jenkins/tools/maven/apache-maven-3.3.3/conf/logging jenkins.maven3.agent.Maven32Main /home/jenkins/tools/maven/apache-maven-3.3.3 /home/jenkins/jenkins-slave/slave.jar /home/jenkins/jenkins-slave/maven32-interceptor.jar /home/jenkins/jenkins-slave/maven3-interceptor-commons.jar 53761
Java HotSpot(TM) 64-Bit Server VM warning: ignoring option MaxPermSize=512m; support was removed in 8.0
<===[JENKINS REMOTING CAPACITY]===>   channel started
Executing Maven:  -B -f <https://builds.apache.org/job/CarbonData-master/ws/pom.xml> -Dmaven.repo.local=/home/jenkins/jenkins-slave/maven-repositories/0 -B -e clean package
[INFO] Error stacktraces are turned on.
[INFO] Scanning for projects...
[INFO] ------------------------------------------------------------------------
[INFO] Reactor Build Order:
[INFO] 
[INFO] Apache CarbonData :: Parent
[INFO] Apache CarbonData :: Common
[INFO] Apache CarbonData :: Format
[INFO] Apache CarbonData :: Core
[INFO] Apache CarbonData :: Processing
[INFO] Apache CarbonData :: Hadoop
[INFO] Apache CarbonData :: Spark
[INFO] Apache CarbonData :: Assembly
[INFO] Apache CarbonData :: Examples
[INFO]                                                                         
[INFO] ------------------------------------------------------------------------
[INFO] Building Apache CarbonData :: Parent 0.2.0-incubating-SNAPSHOT
[INFO] ------------------------------------------------------------------------
[INFO] 
[INFO] --- maven-clean-plugin:2.5:clean (default-clean) @ carbondata-parent ---
[INFO] Deleting <https://builds.apache.org/job/CarbonData-master/ws/target>
[INFO] 
[INFO] --- maven-remote-resources-plugin:1.5:process (default) @ carbondata-parent ---
[INFO] 
[INFO] --- maven-site-plugin:3.4:attach-descriptor (attach-descriptor) @ carbondata-parent ---
[INFO]                                                                         
[INFO] ------------------------------------------------------------------------
[INFO] Building Apache CarbonData :: Common 0.2.0-incubating-SNAPSHOT
[INFO] ------------------------------------------------------------------------
[INFO] 
[INFO] --- maven-clean-plugin:2.5:clean (default-clean) @ carbondata-common ---
[INFO] Deleting <https://builds.apache.org/job/CarbonData-master/ws/common/target>
[INFO] 
[INFO] --- maven-remote-resources-plugin:1.5:process (default) @ carbondata-common ---
[INFO] 
[INFO] --- maven-resources-plugin:2.7:resources (default-resources) @ carbondata-common ---
[INFO] Using 'UTF-8' encoding to copy filtered resources.
[INFO] skip non existing resourceDirectory <https://builds.apache.org/job/CarbonData-master/ws/common/src/main/resources>
[INFO] Copying 3 resources
[INFO] 
[INFO] --- maven-compiler-plugin:3.2:compile (default-compile) @ carbondata-common ---
[INFO] Changes detected - recompiling the module!
[INFO] Compiling 9 source files to <https://builds.apache.org/job/CarbonData-master/ws/common/target/classes>
[INFO] 
[INFO] --- maven-resources-plugin:2.7:testResources (default-testResources) @ carbondata-common ---
[INFO] Using 'UTF-8' encoding to copy filtered resources.
[INFO] skip non existing resourceDirectory <https://builds.apache.org/job/CarbonData-master/ws/common/src/test/resources>
[INFO] Copying 3 resources
[INFO] 
[INFO] --- maven-compiler-plugin:3.2:testCompile (default-testCompile) @ carbondata-common ---
[INFO] Changes detected - recompiling the module!
[INFO] Compiling 7 source files to <https://builds.apache.org/job/CarbonData-master/ws/common/target/test-classes>
[INFO] <https://builds.apache.org/job/CarbonData-master/ws/common/src/test/java/org/apache/carbondata/common/logging/impl/AuditExtendedRollingFileAppenderTest_UT.java>: Some input files use or override a deprecated API.
[INFO] <https://builds.apache.org/job/CarbonData-master/ws/common/src/test/java/org/apache/carbondata/common/logging/impl/AuditExtendedRollingFileAppenderTest_UT.java>: Recompile with -Xlint:deprecation for details.
[INFO] 
[INFO] --- maven-surefire-plugin:2.18.1:test (default-test) @ carbondata-common ---
[JENKINS] Recording test results
[INFO] 
[INFO] --- maven-jar-plugin:2.5:jar (default-jar) @ carbondata-common ---
[INFO] Building jar: <https://builds.apache.org/job/CarbonData-master/ws/common/target/carbondata-common-0.2.0-incubating-SNAPSHOT.jar>
[INFO] 
[INFO] --- maven-site-plugin:3.4:attach-descriptor (attach-descriptor) @ carbondata-common ---
[INFO]                                                                         
[INFO] ------------------------------------------------------------------------
[INFO] Building Apache CarbonData :: Format 0.2.0-incubating-SNAPSHOT
[INFO] ------------------------------------------------------------------------
[INFO] 
[INFO] --- maven-clean-plugin:2.5:clean (default-clean) @ carbondata-format ---
[INFO] Deleting <https://builds.apache.org/job/CarbonData-master/ws/format/target>
[INFO] 
[INFO] --- maven-thrift-plugin:0.1.11:compile (generate-thrift-java) @ carbondata-format ---
[ERROR] thrift failed output: 
[ERROR] thrift failed error: /bin/sh: 1: thrift: not found

[INFO] ------------------------------------------------------------------------
[INFO] Reactor Summary:
[INFO] 
[INFO] Apache CarbonData :: Parent ........................ SUCCESS [  4.948 s]
[INFO] Apache CarbonData :: Common ........................ SUCCESS [  9.118 s]
[INFO] Apache CarbonData :: Format ........................ FAILURE [  0.820 s]
[INFO] Apache CarbonData :: Core .......................... SKIPPED
[INFO] Apache CarbonData :: Processing .................... SKIPPED
[INFO] Apache CarbonData :: Hadoop ........................ SKIPPED
[INFO] Apache CarbonData :: Spark ......................... SKIPPED
[INFO] Apache CarbonData :: Assembly ...................... SKIPPED
[INFO] Apache CarbonData :: Examples ...................... SKIPPED
[INFO] ------------------------------------------------------------------------
[INFO] BUILD FAILURE
[INFO] ------------------------------------------------------------------------
[INFO] Total time: 23.888 s
[INFO] Finished at: 2016-10-24T04:13:21+00:00
[INFO] Final Memory: 30M/320M
[INFO] ------------------------------------------------------------------------
[ERROR] Failed to execute goal org.apache.thrift.tools:maven-thrift-plugin:0.1.11:compile (generate-thrift-java) on project carbondata-format: thrift did not exit cleanly. Review output for more information. -> [Help 1]
org.apache.maven.lifecycle.LifecycleExecutionException: Failed to execute goal org.apache.thrift.tools:maven-thrift-plugin:0.1.11:compile (generate-thrift-java) on project carbondata-format: thrift did not exit cleanly. Review output for more information.
	at org.apache.maven.lifecycle.internal.MojoExecutor.execute(MojoExecutor.java:212)
	at org.apache.maven.lifecycle.internal.MojoExecutor.execute(MojoExecutor.java:153)
	at org.apache.maven.lifecycle.internal.MojoExecutor.execute(MojoExecutor.java:145)
	at org.apache.maven.lifecycle.internal.LifecycleModuleBuilder.buildProject(LifecycleModuleBuilder.java:116)
	at org.apache.maven.lifecycle.internal.LifecycleModuleBuilder.buildProject(LifecycleModuleBuilder.java:80)
	at org.apache.maven.lifecycle.internal.builder.singlethreaded.SingleThreadedBuilder.build(SingleThreadedBuilder.java:51)
	at org.apache.maven.lifecycle.internal.LifecycleStarter.execute(LifecycleStarter.java:128)
	at org.apache.maven.DefaultMaven.doExecute(DefaultMaven.java:307)
	at org.apache.maven.DefaultMaven.doExecute(DefaultMaven.java:193)
	at org.apache.maven.DefaultMaven.execute(DefaultMaven.java:106)
	at org.jvnet.hudson.maven3.launcher.Maven32Launcher.main(Maven32Launcher.java:132)
	at sun.reflect.NativeMethodAccessorImpl.invoke0(Native Method)
	at sun.reflect.NativeMethodAccessorImpl.invoke(NativeMethodAccessorImpl.java:62)
	at sun.reflect.DelegatingMethodAccessorImpl.invoke(DelegatingMethodAccessorImpl.java:43)
	at java.lang.reflect.Method.invoke(Method.java:498)
	at org.codehaus.plexus.classworlds.launcher.Launcher.launchStandard(Launcher.java:330)
	at org.codehaus.plexus.classworlds.launcher.Launcher.launch(Launcher.java:238)
	at jenkins.maven3.agent.Maven32Main.launch(Maven32Main.java:186)
	at sun.reflect.NativeMethodAccessorImpl.invoke0(Native Method)
	at sun.reflect.NativeMethodAccessorImpl.invoke(NativeMethodAccessorImpl.java:62)
	at sun.reflect.DelegatingMethodAccessorImpl.invoke(DelegatingMethodAccessorImpl.java:43)
	at java.lang.reflect.Method.invoke(Method.java:498)
	at hudson.maven.Maven3Builder.call(Maven3Builder.java:136)
	at hudson.maven.Maven3Builder.call(Maven3Builder.java:71)
	at hudson.remoting.UserRequest.perform(UserRequest.java:153)
	at hudson.remoting.UserRequest.perform(UserRequest.java:50)
	at hudson.remoting.Request$2.run(Request.java:332)
	at hudson.remoting.InterceptingExecutorService$1.call(InterceptingExecutorService.java:68)
	at java.util.concurrent.FutureTask.run(FutureTask.java:266)
	at java.util.concurrent.ThreadPoolExecutor.runWorker(ThreadPoolExecutor.java:1142)
	at java.util.concurrent.ThreadPoolExecutor$Worker.run(ThreadPoolExecutor.java:617)
	at java.lang.Thread.run(Thread.java:745)
Caused by: org.apache.maven.plugin.MojoFailureException: thrift did not exit cleanly. Review output for more information.
	at org.apache.thrift.maven.AbstractThriftMojo.execute(AbstractThriftMojo.java:177)
	at org.apache.thrift.maven.ThriftCompileMojo.execute(ThriftCompileMojo.java:21)
	at org.apache.maven.plugin.DefaultBuildPluginManager.executeMojo(DefaultBuildPluginManager.java:134)
	at org.apache.maven.lifecycle.internal.MojoExecutor.execute(MojoExecutor.java:208)
	... 31 more
[ERROR] 
[ERROR] Re-run Maven using the -X switch to enable full debug logging.
[ERROR] 
[ERROR] For more information about the errors and possible solutions, please read the following articles:
[ERROR] [Help 1] http://cwiki.apache.org/confluence/display/MAVEN/MojoFailureException
[ERROR] 
[ERROR] After correcting the problems, you can resume the build with the command
[ERROR]   mvn <goals> -rf :carbondata-format
[JENKINS] Archiving <https://builds.apache.org/job/CarbonData-master/ws/processing/pom.xml> to org.apache.carbondata/carbondata-processing/0.2.0-incubating-SNAPSHOT/carbondata-processing-0.2.0-incubating-SNAPSHOT.pom
[JENKINS] Archiving <https://builds.apache.org/job/CarbonData-master/ws/assembly/pom.xml> to org.apache.carbondata/carbondata-assembly/0.2.0-incubating-SNAPSHOT/carbondata-assembly-0.2.0-incubating-SNAPSHOT.pom
[JENKINS] Archiving <https://builds.apache.org/job/CarbonData-master/ws/pom.xml> to org.apache.carbondata/carbondata-parent/0.2.0-incubating-SNAPSHOT/carbondata-parent-0.2.0-incubating-SNAPSHOT.pom
[JENKINS] Archiving <https://builds.apache.org/job/CarbonData-master/ws/core/pom.xml> to org.apache.carbondata/carbondata-core/0.2.0-incubating-SNAPSHOT/carbondata-core-0.2.0-incubating-SNAPSHOT.pom
[JENKINS] Archiving <https://builds.apache.org/job/CarbonData-master/ws/format/pom.xml> to org.apache.carbondata/carbondata-format/0.2.0-incubating-SNAPSHOT/carbondata-format-0.2.0-incubating-SNAPSHOT.pom
[JENKINS] Archiving <https://builds.apache.org/job/CarbonData-master/ws/hadoop/pom.xml> to org.apache.carbondata/carbondata-hadoop/0.2.0-incubating-SNAPSHOT/carbondata-hadoop-0.2.0-incubating-SNAPSHOT.pom
[JENKINS] Archiving <https://builds.apache.org/job/CarbonData-master/ws/examples/pom.xml> to org.apache.carbondata/carbondata-examples/0.2.0-incubating-SNAPSHOT/carbondata-examples-0.2.0-incubating-SNAPSHOT.pom
[JENKINS] Archiving <https://builds.apache.org/job/CarbonData-master/ws/common/pom.xml> to org.apache.carbondata/carbondata-common/0.2.0-incubating-SNAPSHOT/carbondata-common-0.2.0-incubating-SNAPSHOT.pom
[JENKINS] Archiving <https://builds.apache.org/job/CarbonData-master/ws/common/target/carbondata-common-0.2.0-incubating-SNAPSHOT.jar> to org.apache.carbondata/carbondata-common/0.2.0-incubating-SNAPSHOT/carbondata-common-0.2.0-incubating-SNAPSHOT.jar
[JENKINS] Archiving <https://builds.apache.org/job/CarbonData-master/ws/integration/spark/pom.xml> to org.apache.carbondata/carbondata-spark/0.2.0-incubating-SNAPSHOT/carbondata-spark-0.2.0-incubating-SNAPSHOT.pom
Sending e-mails to: commits@carbondata.incubator.apache.org
channel stopped

Build failed in Jenkins: CarbonData-master #134

Posted by Apache Jenkins Server <je...@builds.apache.org>.
See <https://builds.apache.org/job/CarbonData-master/134/changes>

Changes:

[sandy] trivial fix in documentation

------------------------------------------
Started by an SCM change
[EnvInject] - Loading node environment variables.
Building remotely on ubuntu-1 (Ubuntu ubuntu1 yahoo-not-h2 ubuntu docker) in workspace <https://builds.apache.org/job/CarbonData-master/ws/>
Cloning the remote Git repository
Cloning repository https://git-wip-us.apache.org/repos/asf/incubator-carbondata.git
 > git init <https://builds.apache.org/job/CarbonData-master/ws/> # timeout=10
Fetching upstream changes from https://git-wip-us.apache.org/repos/asf/incubator-carbondata.git
 > git --version # timeout=10
 > git -c core.askpass=true fetch --tags --progress https://git-wip-us.apache.org/repos/asf/incubator-carbondata.git +refs/heads/*:refs/remotes/origin/*
 > git config remote.origin.url https://git-wip-us.apache.org/repos/asf/incubator-carbondata.git # timeout=10
 > git config --add remote.origin.fetch +refs/heads/*:refs/remotes/origin/* # timeout=10
 > git config remote.origin.url https://git-wip-us.apache.org/repos/asf/incubator-carbondata.git # timeout=10
Fetching upstream changes from https://git-wip-us.apache.org/repos/asf/incubator-carbondata.git
 > git -c core.askpass=true fetch --tags --progress https://git-wip-us.apache.org/repos/asf/incubator-carbondata.git +refs/heads/*:refs/remotes/origin/*
 > git rev-parse refs/remotes/origin/master^{commit} # timeout=10
 > git rev-parse refs/remotes/origin/origin/master^{commit} # timeout=10
Checking out Revision ccf110ea296d9340b4c871043854496f23166b9a (refs/remotes/origin/master)
 > git config core.sparsecheckout # timeout=10
 > git checkout -f ccf110ea296d9340b4c871043854496f23166b9a
 > git rev-list 41c5ad49193d98a475133a1f193b3937d608f7a3 # timeout=10
Parsing POMs
Modules changed, recalculating dependency graph
Established TCP socket on 55724
maven32-agent.jar already up to date
maven32-interceptor.jar already up to date
maven3-interceptor-commons.jar already up to date
[CarbonData-master] $ /home/jenkins/tools/java/latest1.8/bin/java -Xmx2g -Xms256m -XX:MaxPermSize=512m -cp /home/jenkins/jenkins-slave/maven32-agent.jar:/home/jenkins/tools/maven/apache-maven-3.3.3/boot/plexus-classworlds-2.5.2.jar:/home/jenkins/tools/maven/apache-maven-3.3.3/conf/logging jenkins.maven3.agent.Maven32Main /home/jenkins/tools/maven/apache-maven-3.3.3 /home/jenkins/jenkins-slave/slave.jar /home/jenkins/jenkins-slave/maven32-interceptor.jar /home/jenkins/jenkins-slave/maven3-interceptor-commons.jar 55724
Java HotSpot(TM) 64-Bit Server VM warning: ignoring option MaxPermSize=512m; support was removed in 8.0
<===[JENKINS REMOTING CAPACITY]===>   channel started
Executing Maven:  -B -f <https://builds.apache.org/job/CarbonData-master/ws/pom.xml> -Dmaven.repo.local=/home/jenkins/jenkins-slave/maven-repositories/1 -B -e clean package
[INFO] Error stacktraces are turned on.
[INFO] Scanning for projects...
[INFO] ------------------------------------------------------------------------
[INFO] Reactor Build Order:
[INFO] 
[INFO] Apache CarbonData :: Parent
[INFO] Apache CarbonData :: Common
[INFO] Apache CarbonData :: Format
[INFO] Apache CarbonData :: Core
[INFO] Apache CarbonData :: Processing
[INFO] Apache CarbonData :: Hadoop
[INFO] Apache CarbonData :: Spark
[INFO] Apache CarbonData :: Assembly
[INFO] Apache CarbonData :: Examples
[INFO]                                                                         
[INFO] ------------------------------------------------------------------------
[INFO] Building Apache CarbonData :: Parent 0.2.0-incubating-SNAPSHOT
[INFO] ------------------------------------------------------------------------
[INFO] 
[INFO] --- maven-clean-plugin:2.5:clean (default-clean) @ carbondata-parent ---
[INFO] 
[INFO] --- maven-remote-resources-plugin:1.5:process (default) @ carbondata-parent ---
[INFO] 
[INFO] --- maven-site-plugin:3.4:attach-descriptor (attach-descriptor) @ carbondata-parent ---
[INFO]                                                                         
[INFO] ------------------------------------------------------------------------
[INFO] Building Apache CarbonData :: Common 0.2.0-incubating-SNAPSHOT
[INFO] ------------------------------------------------------------------------
[INFO] 
[INFO] --- maven-clean-plugin:2.5:clean (default-clean) @ carbondata-common ---
[INFO] 
[INFO] --- maven-remote-resources-plugin:1.5:process (default) @ carbondata-common ---
[INFO] 
[INFO] --- maven-resources-plugin:2.7:resources (default-resources) @ carbondata-common ---
[INFO] Using 'UTF-8' encoding to copy filtered resources.
[INFO] skip non existing resourceDirectory <https://builds.apache.org/job/CarbonData-master/ws/common/src/main/resources>
[INFO] Copying 3 resources
[INFO] 
[INFO] --- maven-compiler-plugin:3.2:compile (default-compile) @ carbondata-common ---
[INFO] Changes detected - recompiling the module!
[INFO] Compiling 9 source files to <https://builds.apache.org/job/CarbonData-master/ws/common/target/classes>
[INFO] 
[INFO] --- maven-resources-plugin:2.7:testResources (default-testResources) @ carbondata-common ---
[INFO] Using 'UTF-8' encoding to copy filtered resources.
[INFO] skip non existing resourceDirectory <https://builds.apache.org/job/CarbonData-master/ws/common/src/test/resources>
[INFO] Copying 3 resources
[INFO] 
[INFO] --- maven-compiler-plugin:3.2:testCompile (default-testCompile) @ carbondata-common ---
[INFO] Changes detected - recompiling the module!
[INFO] Compiling 7 source files to <https://builds.apache.org/job/CarbonData-master/ws/common/target/test-classes>
[INFO] <https://builds.apache.org/job/CarbonData-master/ws/common/src/test/java/org/apache/carbondata/common/logging/impl/AuditExtendedRollingFileAppenderTest_UT.java>: Some input files use or override a deprecated API.
[INFO] <https://builds.apache.org/job/CarbonData-master/ws/common/src/test/java/org/apache/carbondata/common/logging/impl/AuditExtendedRollingFileAppenderTest_UT.java>: Recompile with -Xlint:deprecation for details.
[INFO] 
[INFO] --- maven-surefire-plugin:2.18.1:test (default-test) @ carbondata-common ---
[JENKINS] Recording test results
[INFO] 
[INFO] --- maven-jar-plugin:2.5:jar (default-jar) @ carbondata-common ---
[INFO] Building jar: <https://builds.apache.org/job/CarbonData-master/ws/common/target/carbondata-common-0.2.0-incubating-SNAPSHOT.jar>
[INFO] 
[INFO] --- maven-site-plugin:3.4:attach-descriptor (attach-descriptor) @ carbondata-common ---
[INFO]                                                                         
[INFO] ------------------------------------------------------------------------
[INFO] Building Apache CarbonData :: Format 0.2.0-incubating-SNAPSHOT
[INFO] ------------------------------------------------------------------------
[INFO] 
[INFO] --- maven-clean-plugin:2.5:clean (default-clean) @ carbondata-format ---
[INFO] 
[INFO] --- maven-thrift-plugin:0.1.11:compile (generate-thrift-java) @ carbondata-format ---
[ERROR] thrift failed output: 
[ERROR] thrift failed error: /bin/sh: 1: thrift: not found

[INFO] ------------------------------------------------------------------------
[INFO] Reactor Summary:
[INFO] 
[INFO] Apache CarbonData :: Parent ........................ SUCCESS [  2.502 s]
[INFO] Apache CarbonData :: Common ........................ SUCCESS [  4.487 s]
[INFO] Apache CarbonData :: Format ........................ FAILURE [  0.863 s]
[INFO] Apache CarbonData :: Core .......................... SKIPPED
[INFO] Apache CarbonData :: Processing .................... SKIPPED
[INFO] Apache CarbonData :: Hadoop ........................ SKIPPED
[INFO] Apache CarbonData :: Spark ......................... SKIPPED
[INFO] Apache CarbonData :: Assembly ...................... SKIPPED
[INFO] Apache CarbonData :: Examples ...................... SKIPPED
[INFO] ------------------------------------------------------------------------
[INFO] BUILD FAILURE
[INFO] ------------------------------------------------------------------------
[INFO] Total time: 11.678 s
[INFO] Finished at: 2016-10-22T00:18:20+00:00
[INFO] Final Memory: 34M/357M
[INFO] ------------------------------------------------------------------------
[ERROR] Failed to execute goal org.apache.thrift.tools:maven-thrift-plugin:0.1.11:compile (generate-thrift-java) on project carbondata-format: thrift did not exit cleanly. Review output for more information. -> [Help 1]
org.apache.maven.lifecycle.LifecycleExecutionException: Failed to execute goal org.apache.thrift.tools:maven-thrift-plugin:0.1.11:compile (generate-thrift-java) on project carbondata-format: thrift did not exit cleanly. Review output for more information.
	at org.apache.maven.lifecycle.internal.MojoExecutor.execute(MojoExecutor.java:212)
	at org.apache.maven.lifecycle.internal.MojoExecutor.execute(MojoExecutor.java:153)
	at org.apache.maven.lifecycle.internal.MojoExecutor.execute(MojoExecutor.java:145)
	at org.apache.maven.lifecycle.internal.LifecycleModuleBuilder.buildProject(LifecycleModuleBuilder.java:116)
	at org.apache.maven.lifecycle.internal.LifecycleModuleBuilder.buildProject(LifecycleModuleBuilder.java:80)
	at org.apache.maven.lifecycle.internal.builder.singlethreaded.SingleThreadedBuilder.build(SingleThreadedBuilder.java:51)
	at org.apache.maven.lifecycle.internal.LifecycleStarter.execute(LifecycleStarter.java:128)
	at org.apache.maven.DefaultMaven.doExecute(DefaultMaven.java:307)
	at org.apache.maven.DefaultMaven.doExecute(DefaultMaven.java:193)
	at org.apache.maven.DefaultMaven.execute(DefaultMaven.java:106)
	at org.jvnet.hudson.maven3.launcher.Maven32Launcher.main(Maven32Launcher.java:132)
	at sun.reflect.NativeMethodAccessorImpl.invoke0(Native Method)
	at sun.reflect.NativeMethodAccessorImpl.invoke(NativeMethodAccessorImpl.java:62)
	at sun.reflect.DelegatingMethodAccessorImpl.invoke(DelegatingMethodAccessorImpl.java:43)
	at java.lang.reflect.Method.invoke(Method.java:498)
	at org.codehaus.plexus.classworlds.launcher.Launcher.launchStandard(Launcher.java:330)
	at org.codehaus.plexus.classworlds.launcher.Launcher.launch(Launcher.java:238)
	at jenkins.maven3.agent.Maven32Main.launch(Maven32Main.java:186)
	at sun.reflect.NativeMethodAccessorImpl.invoke0(Native Method)
	at sun.reflect.NativeMethodAccessorImpl.invoke(NativeMethodAccessorImpl.java:62)
	at sun.reflect.DelegatingMethodAccessorImpl.invoke(DelegatingMethodAccessorImpl.java:43)
	at java.lang.reflect.Method.invoke(Method.java:498)
	at hudson.maven.Maven3Builder.call(Maven3Builder.java:136)
	at hudson.maven.Maven3Builder.call(Maven3Builder.java:71)
	at hudson.remoting.UserRequest.perform(UserRequest.java:153)
	at hudson.remoting.UserRequest.perform(UserRequest.java:50)
	at hudson.remoting.Request$2.run(Request.java:332)
	at hudson.remoting.InterceptingExecutorService$1.call(InterceptingExecutorService.java:68)
	at java.util.concurrent.FutureTask.run(FutureTask.java:266)
	at java.util.concurrent.ThreadPoolExecutor.runWorker(ThreadPoolExecutor.java:1142)
	at java.util.concurrent.ThreadPoolExecutor$Worker.run(ThreadPoolExecutor.java:617)
	at java.lang.Thread.run(Thread.java:745)
Caused by: org.apache.maven.plugin.MojoFailureException: thrift did not exit cleanly. Review output for more information.
	at org.apache.thrift.maven.AbstractThriftMojo.execute(AbstractThriftMojo.java:177)
	at org.apache.thrift.maven.ThriftCompileMojo.execute(ThriftCompileMojo.java:21)
	at org.apache.maven.plugin.DefaultBuildPluginManager.executeMojo(DefaultBuildPluginManager.java:134)
	at org.apache.maven.lifecycle.internal.MojoExecutor.execute(MojoExecutor.java:208)
	... 31 more
[ERROR] 
[ERROR] Re-run Maven using the -X switch to enable full debug logging.
[ERROR] 
[ERROR] For more information about the errors and possible solutions, please read the following articles:
[ERROR] [Help 1] http://cwiki.apache.org/confluence/display/MAVEN/MojoFailureException
[ERROR] 
[ERROR] After correcting the problems, you can resume the build with the command
[ERROR]   mvn <goals> -rf :carbondata-format
[JENKINS] Archiving <https://builds.apache.org/job/CarbonData-master/ws/processing/pom.xml> to org.apache.carbondata/carbondata-processing/0.2.0-incubating-SNAPSHOT/carbondata-processing-0.2.0-incubating-SNAPSHOT.pom
[JENKINS] Archiving <https://builds.apache.org/job/CarbonData-master/ws/assembly/pom.xml> to org.apache.carbondata/carbondata-assembly/0.2.0-incubating-SNAPSHOT/carbondata-assembly-0.2.0-incubating-SNAPSHOT.pom
[JENKINS] Archiving <https://builds.apache.org/job/CarbonData-master/ws/pom.xml> to org.apache.carbondata/carbondata-parent/0.2.0-incubating-SNAPSHOT/carbondata-parent-0.2.0-incubating-SNAPSHOT.pom
[JENKINS] Archiving <https://builds.apache.org/job/CarbonData-master/ws/core/pom.xml> to org.apache.carbondata/carbondata-core/0.2.0-incubating-SNAPSHOT/carbondata-core-0.2.0-incubating-SNAPSHOT.pom
[JENKINS] Archiving <https://builds.apache.org/job/CarbonData-master/ws/format/pom.xml> to org.apache.carbondata/carbondata-format/0.2.0-incubating-SNAPSHOT/carbondata-format-0.2.0-incubating-SNAPSHOT.pom
[JENKINS] Archiving <https://builds.apache.org/job/CarbonData-master/ws/hadoop/pom.xml> to org.apache.carbondata/carbondata-hadoop/0.2.0-incubating-SNAPSHOT/carbondata-hadoop-0.2.0-incubating-SNAPSHOT.pom
[JENKINS] Archiving <https://builds.apache.org/job/CarbonData-master/ws/examples/pom.xml> to org.apache.carbondata/carbondata-examples/0.2.0-incubating-SNAPSHOT/carbondata-examples-0.2.0-incubating-SNAPSHOT.pom
[JENKINS] Archiving <https://builds.apache.org/job/CarbonData-master/ws/common/pom.xml> to org.apache.carbondata/carbondata-common/0.2.0-incubating-SNAPSHOT/carbondata-common-0.2.0-incubating-SNAPSHOT.pom
[JENKINS] Archiving <https://builds.apache.org/job/CarbonData-master/ws/common/target/carbondata-common-0.2.0-incubating-SNAPSHOT.jar> to org.apache.carbondata/carbondata-common/0.2.0-incubating-SNAPSHOT/carbondata-common-0.2.0-incubating-SNAPSHOT.jar
[JENKINS] Archiving <https://builds.apache.org/job/CarbonData-master/ws/integration/spark/pom.xml> to org.apache.carbondata/carbondata-spark/0.2.0-incubating-SNAPSHOT/carbondata-spark-0.2.0-incubating-SNAPSHOT.pom
Sending e-mails to: commits@carbondata.incubator.apache.org
channel stopped

Build failed in Jenkins: CarbonData-master #133

Posted by Apache Jenkins Server <je...@builds.apache.org>.
See <https://builds.apache.org/job/CarbonData-master/133/changes>

Changes:

[jackylk] add block size info in descFormatted and executor log

------------------------------------------
Started by an SCM change
[EnvInject] - Loading node environment variables.
Building remotely on ubuntu-6 (Ubuntu yahoo-not-h2 ubuntu docker) in workspace <https://builds.apache.org/job/CarbonData-master/ws/>
 > git rev-parse --is-inside-work-tree # timeout=10
Fetching changes from the remote Git repository
 > git config remote.origin.url https://git-wip-us.apache.org/repos/asf/incubator-carbondata.git # timeout=10
Fetching upstream changes from https://git-wip-us.apache.org/repos/asf/incubator-carbondata.git
 > git --version # timeout=10
 > git -c core.askpass=true fetch --tags --progress https://git-wip-us.apache.org/repos/asf/incubator-carbondata.git +refs/heads/*:refs/remotes/origin/*
 > git rev-parse refs/remotes/origin/master^{commit} # timeout=10
 > git rev-parse refs/remotes/origin/origin/master^{commit} # timeout=10
Checking out Revision 41c5ad49193d98a475133a1f193b3937d608f7a3 (refs/remotes/origin/master)
 > git config core.sparsecheckout # timeout=10
 > git checkout -f 41c5ad49193d98a475133a1f193b3937d608f7a3
 > git rev-list 826485c9d9a09ca8d05c9d7a5b4de57ec874006c # timeout=10
Parsing POMs
Modules changed, recalculating dependency graph
Established TCP socket on 35872
maven32-agent.jar already up to date
maven32-interceptor.jar already up to date
maven3-interceptor-commons.jar already up to date
[CarbonData-master] $ /home/jenkins/tools/java/latest1.8/bin/java -Xmx2g -Xms256m -XX:MaxPermSize=512m -cp /home/jenkins/jenkins-slave/maven32-agent.jar:/home/jenkins/tools/maven/apache-maven-3.3.3/boot/plexus-classworlds-2.5.2.jar:/home/jenkins/tools/maven/apache-maven-3.3.3/conf/logging jenkins.maven3.agent.Maven32Main /home/jenkins/tools/maven/apache-maven-3.3.3 /home/jenkins/jenkins-slave/slave.jar /home/jenkins/jenkins-slave/maven32-interceptor.jar /home/jenkins/jenkins-slave/maven3-interceptor-commons.jar 35872
Java HotSpot(TM) 64-Bit Server VM warning: ignoring option MaxPermSize=512m; support was removed in 8.0
<===[JENKINS REMOTING CAPACITY]===>   channel started
Executing Maven:  -B -f <https://builds.apache.org/job/CarbonData-master/ws/pom.xml> -Dmaven.repo.local=/home/jenkins/jenkins-slave/maven-repositories/1 -B -e clean package
[INFO] Error stacktraces are turned on.
[INFO] Scanning for projects...
[INFO] ------------------------------------------------------------------------
[INFO] Reactor Build Order:
[INFO] 
[INFO] Apache CarbonData :: Parent
[INFO] Apache CarbonData :: Common
[INFO] Apache CarbonData :: Format
[INFO] Apache CarbonData :: Core
[INFO] Apache CarbonData :: Processing
[INFO] Apache CarbonData :: Hadoop
[INFO] Apache CarbonData :: Spark
[INFO] Apache CarbonData :: Assembly
[INFO] Apache CarbonData :: Examples
[INFO]                                                                         
[INFO] ------------------------------------------------------------------------
[INFO] Building Apache CarbonData :: Parent 0.2.0-incubating-SNAPSHOT
[INFO] ------------------------------------------------------------------------
[INFO] 
[INFO] --- maven-clean-plugin:2.5:clean (default-clean) @ carbondata-parent ---
[INFO] Deleting <https://builds.apache.org/job/CarbonData-master/ws/target>
[INFO] 
[INFO] --- maven-remote-resources-plugin:1.5:process (default) @ carbondata-parent ---
[INFO] 
[INFO] --- maven-site-plugin:3.4:attach-descriptor (attach-descriptor) @ carbondata-parent ---
[INFO]                                                                         
[INFO] ------------------------------------------------------------------------
[INFO] Building Apache CarbonData :: Common 0.2.0-incubating-SNAPSHOT
[INFO] ------------------------------------------------------------------------
[INFO] 
[INFO] --- maven-clean-plugin:2.5:clean (default-clean) @ carbondata-common ---
[INFO] Deleting <https://builds.apache.org/job/CarbonData-master/ws/common/target>
[INFO] 
[INFO] --- maven-remote-resources-plugin:1.5:process (default) @ carbondata-common ---
[INFO] 
[INFO] --- maven-resources-plugin:2.7:resources (default-resources) @ carbondata-common ---
[INFO] Using 'UTF-8' encoding to copy filtered resources.
[INFO] skip non existing resourceDirectory <https://builds.apache.org/job/CarbonData-master/ws/common/src/main/resources>
[INFO] Copying 3 resources
[INFO] 
[INFO] --- maven-compiler-plugin:3.2:compile (default-compile) @ carbondata-common ---
[INFO] Changes detected - recompiling the module!
[INFO] Compiling 9 source files to <https://builds.apache.org/job/CarbonData-master/ws/common/target/classes>
[INFO] 
[INFO] --- maven-resources-plugin:2.7:testResources (default-testResources) @ carbondata-common ---
[INFO] Using 'UTF-8' encoding to copy filtered resources.
[INFO] skip non existing resourceDirectory <https://builds.apache.org/job/CarbonData-master/ws/common/src/test/resources>
[INFO] Copying 3 resources
[INFO] 
[INFO] --- maven-compiler-plugin:3.2:testCompile (default-testCompile) @ carbondata-common ---
[INFO] Changes detected - recompiling the module!
[INFO] Compiling 7 source files to <https://builds.apache.org/job/CarbonData-master/ws/common/target/test-classes>
[INFO] <https://builds.apache.org/job/CarbonData-master/ws/common/src/test/java/org/apache/carbondata/common/logging/impl/AuditExtendedRollingFileAppenderTest_UT.java>: Some input files use or override a deprecated API.
[INFO] <https://builds.apache.org/job/CarbonData-master/ws/common/src/test/java/org/apache/carbondata/common/logging/impl/AuditExtendedRollingFileAppenderTest_UT.java>: Recompile with -Xlint:deprecation for details.
[INFO] 
[INFO] --- maven-surefire-plugin:2.18.1:test (default-test) @ carbondata-common ---
[JENKINS] Recording test results
[INFO] 
[INFO] --- maven-jar-plugin:2.5:jar (default-jar) @ carbondata-common ---
[INFO] Building jar: <https://builds.apache.org/job/CarbonData-master/ws/common/target/carbondata-common-0.2.0-incubating-SNAPSHOT.jar>
[INFO] 
[INFO] --- maven-site-plugin:3.4:attach-descriptor (attach-descriptor) @ carbondata-common ---
[INFO]                                                                         
[INFO] ------------------------------------------------------------------------
[INFO] Building Apache CarbonData :: Format 0.2.0-incubating-SNAPSHOT
[INFO] ------------------------------------------------------------------------
[INFO] 
[INFO] --- maven-clean-plugin:2.5:clean (default-clean) @ carbondata-format ---
[INFO] Deleting <https://builds.apache.org/job/CarbonData-master/ws/format/target>
[INFO] 
[INFO] --- maven-thrift-plugin:0.1.11:compile (generate-thrift-java) @ carbondata-format ---
[ERROR] thrift failed output: 
[ERROR] thrift failed error: /bin/sh: 1: thrift: not found

[INFO] ------------------------------------------------------------------------
[INFO] Reactor Summary:
[INFO] 
[INFO] Apache CarbonData :: Parent ........................ SUCCESS [  4.237 s]
[INFO] Apache CarbonData :: Common ........................ SUCCESS [ 11.352 s]
[INFO] Apache CarbonData :: Format ........................ FAILURE [  2.647 s]
[INFO] Apache CarbonData :: Core .......................... SKIPPED
[INFO] Apache CarbonData :: Processing .................... SKIPPED
[INFO] Apache CarbonData :: Hadoop ........................ SKIPPED
[INFO] Apache CarbonData :: Spark ......................... SKIPPED
[INFO] Apache CarbonData :: Assembly ...................... SKIPPED
[INFO] Apache CarbonData :: Examples ...................... SKIPPED
[INFO] ------------------------------------------------------------------------
[INFO] BUILD FAILURE
[INFO] ------------------------------------------------------------------------
[INFO] Total time: 23.607 s
[INFO] Finished at: 2016-10-21T17:34:47+00:00
[INFO] Final Memory: 34M/333M
[INFO] ------------------------------------------------------------------------
Waiting for Jenkins to finish collecting data
[ERROR] Failed to execute goal org.apache.thrift.tools:maven-thrift-plugin:0.1.11:compile (generate-thrift-java) on project carbondata-format: thrift did not exit cleanly. Review output for more information. -> [Help 1]
org.apache.maven.lifecycle.LifecycleExecutionException: Failed to execute goal org.apache.thrift.tools:maven-thrift-plugin:0.1.11:compile (generate-thrift-java) on project carbondata-format: thrift did not exit cleanly. Review output for more information.
	at org.apache.maven.lifecycle.internal.MojoExecutor.execute(MojoExecutor.java:212)
	at org.apache.maven.lifecycle.internal.MojoExecutor.execute(MojoExecutor.java:153)
	at org.apache.maven.lifecycle.internal.MojoExecutor.execute(MojoExecutor.java:145)
	at org.apache.maven.lifecycle.internal.LifecycleModuleBuilder.buildProject(LifecycleModuleBuilder.java:116)
	at org.apache.maven.lifecycle.internal.LifecycleModuleBuilder.buildProject(LifecycleModuleBuilder.java:80)
	at org.apache.maven.lifecycle.internal.builder.singlethreaded.SingleThreadedBuilder.build(SingleThreadedBuilder.java:51)
	at org.apache.maven.lifecycle.internal.LifecycleStarter.execute(LifecycleStarter.java:128)
	at org.apache.maven.DefaultMaven.doExecute(DefaultMaven.java:307)
	at org.apache.maven.DefaultMaven.doExecute(DefaultMaven.java:193)
	at org.apache.maven.DefaultMaven.execute(DefaultMaven.java:106)
	at org.jvnet.hudson.maven3.launcher.Maven32Launcher.main(Maven32Launcher.java:132)
	at sun.reflect.NativeMethodAccessorImpl.invoke0(Native Method)
	at sun.reflect.NativeMethodAccessorImpl.invoke(NativeMethodAccessorImpl.java:62)
	at sun.reflect.DelegatingMethodAccessorImpl.invoke(DelegatingMethodAccessorImpl.java:43)
	at java.lang.reflect.Method.invoke(Method.java:498)
	at org.codehaus.plexus.classworlds.launcher.Launcher.launchStandard(Launcher.java:330)
	at org.codehaus.plexus.classworlds.launcher.Launcher.launch(Launcher.java:238)
	at jenkins.maven3.agent.Maven32Main.launch(Maven32Main.java:186)
	at sun.reflect.NativeMethodAccessorImpl.invoke0(Native Method)
	at sun.reflect.NativeMethodAccessorImpl.invoke(NativeMethodAccessorImpl.java:62)
	at sun.reflect.DelegatingMethodAccessorImpl.invoke(DelegatingMethodAccessorImpl.java:43)
	at java.lang.reflect.Method.invoke(Method.java:498)
	at hudson.maven.Maven3Builder.call(Maven3Builder.java:136)
	at hudson.maven.Maven3Builder.call(Maven3Builder.java:71)
	at hudson.remoting.UserRequest.perform(UserRequest.java:153)
	at hudson.remoting.UserRequest.perform(UserRequest.java:50)
	at hudson.remoting.Request$2.run(Request.java:332)
	at hudson.remoting.InterceptingExecutorService$1.call(InterceptingExecutorService.java:68)
	at java.util.concurrent.FutureTask.run(FutureTask.java:266)
	at java.util.concurrent.ThreadPoolExecutor.runWorker(ThreadPoolExecutor.java:1142)
	at java.util.concurrent.ThreadPoolExecutor$Worker.run(ThreadPoolExecutor.java:617)
	at java.lang.Thread.run(Thread.java:745)
Caused by: org.apache.maven.plugin.MojoFailureException: thrift did not exit cleanly. Review output for more information.
	at org.apache.thrift.maven.AbstractThriftMojo.execute(AbstractThriftMojo.java:177)
	at org.apache.thrift.maven.ThriftCompileMojo.execute(ThriftCompileMojo.java:21)
	at org.apache.maven.plugin.DefaultBuildPluginManager.executeMojo(DefaultBuildPluginManager.java:134)
	at org.apache.maven.lifecycle.internal.MojoExecutor.execute(MojoExecutor.java:208)
	... 31 more
[ERROR] 
[ERROR] Re-run Maven using the -X switch to enable full debug logging.
[ERROR] 
[JENKINS] Archiving <https://builds.apache.org/job/CarbonData-master/ws/processing/pom.xml> to org.apache.carbondata/carbondata-processing/0.2.0-incubating-SNAPSHOT/carbondata-processing-0.2.0-incubating-SNAPSHOT.pom
[ERROR] For more information about the errors and possible solutions, please read the following articles:
[ERROR] [Help 1] http://cwiki.apache.org/confluence/display/MAVEN/MojoFailureException
[ERROR] 
[ERROR] After correcting the problems, you can resume the build with the command
[ERROR]   mvn <goals> -rf :carbondata-format
[JENKINS] Archiving <https://builds.apache.org/job/CarbonData-master/ws/assembly/pom.xml> to org.apache.carbondata/carbondata-assembly/0.2.0-incubating-SNAPSHOT/carbondata-assembly-0.2.0-incubating-SNAPSHOT.pom
[JENKINS] Archiving <https://builds.apache.org/job/CarbonData-master/ws/pom.xml> to org.apache.carbondata/carbondata-parent/0.2.0-incubating-SNAPSHOT/carbondata-parent-0.2.0-incubating-SNAPSHOT.pom
[JENKINS] Archiving <https://builds.apache.org/job/CarbonData-master/ws/core/pom.xml> to org.apache.carbondata/carbondata-core/0.2.0-incubating-SNAPSHOT/carbondata-core-0.2.0-incubating-SNAPSHOT.pom
[JENKINS] Archiving <https://builds.apache.org/job/CarbonData-master/ws/format/pom.xml> to org.apache.carbondata/carbondata-format/0.2.0-incubating-SNAPSHOT/carbondata-format-0.2.0-incubating-SNAPSHOT.pom
[JENKINS] Archiving <https://builds.apache.org/job/CarbonData-master/ws/hadoop/pom.xml> to org.apache.carbondata/carbondata-hadoop/0.2.0-incubating-SNAPSHOT/carbondata-hadoop-0.2.0-incubating-SNAPSHOT.pom
[JENKINS] Archiving <https://builds.apache.org/job/CarbonData-master/ws/examples/pom.xml> to org.apache.carbondata/carbondata-examples/0.2.0-incubating-SNAPSHOT/carbondata-examples-0.2.0-incubating-SNAPSHOT.pom
[JENKINS] Archiving <https://builds.apache.org/job/CarbonData-master/ws/common/pom.xml> to org.apache.carbondata/carbondata-common/0.2.0-incubating-SNAPSHOT/carbondata-common-0.2.0-incubating-SNAPSHOT.pom
[JENKINS] Archiving <https://builds.apache.org/job/CarbonData-master/ws/common/target/carbondata-common-0.2.0-incubating-SNAPSHOT.jar> to org.apache.carbondata/carbondata-common/0.2.0-incubating-SNAPSHOT/carbondata-common-0.2.0-incubating-SNAPSHOT.jar
[JENKINS] Archiving <https://builds.apache.org/job/CarbonData-master/ws/integration/spark/pom.xml> to org.apache.carbondata/carbondata-spark/0.2.0-incubating-SNAPSHOT/carbondata-spark-0.2.0-incubating-SNAPSHOT.pom
Sending e-mails to: commits@carbondata.incubator.apache.org
channel stopped

Build failed in Jenkins: CarbonData-master #132

Posted by Apache Jenkins Server <je...@builds.apache.org>.
See <https://builds.apache.org/job/CarbonData-master/132/changes>

Changes:

[jackylk] Added InputProcessorStep to read data from csv reader iterator.

------------------------------------------
[...truncated 486 lines...]
[INFO] Downloaded: https://repo.maven.apache.org/maven2/org/codehaus/plexus/plexus-compiler/2.4/plexus-compiler-2.4.pom (6 KB at 862.0 KB/sec)
[INFO] Downloading: https://repo.maven.apache.org/maven2/org/codehaus/plexus/plexus-compiler-manager/2.4/plexus-compiler-manager-2.4.pom
[INFO] Downloaded: https://repo.maven.apache.org/maven2/org/codehaus/plexus/plexus-compiler-manager/2.4/plexus-compiler-manager-2.4.pom (690 B at 39.6 KB/sec)
[INFO] Downloading: https://repo.maven.apache.org/maven2/org/codehaus/plexus/plexus-compiler-javac/2.4/plexus-compiler-javac-2.4.pom
[INFO] Downloaded: https://repo.maven.apache.org/maven2/org/codehaus/plexus/plexus-compiler-javac/2.4/plexus-compiler-javac-2.4.pom (769 B at 83.4 KB/sec)
[INFO] Downloading: https://repo.maven.apache.org/maven2/org/codehaus/plexus/plexus-compilers/2.4/plexus-compilers-2.4.pom
[INFO] Downloaded: https://repo.maven.apache.org/maven2/org/codehaus/plexus/plexus-compilers/2.4/plexus-compilers-2.4.pom (2 KB at 210.8 KB/sec)
[INFO] Downloading: https://repo.maven.apache.org/maven2/org/apache/maven/maven-plugin-api/2.0.9/maven-plugin-api-2.0.9.jar
[INFO] Downloading: https://repo.maven.apache.org/maven2/org/apache/maven/maven-artifact/2.0.9/maven-artifact-2.0.9.jar
[INFO] Downloading: https://repo.maven.apache.org/maven2/org/apache/maven/maven-core/2.0.9/maven-core-2.0.9.jar
[INFO] Downloading: https://repo.maven.apache.org/maven2/org/codehaus/plexus/plexus-utils/1.5.1/plexus-utils-1.5.1.jar
[INFO] Downloaded: https://repo.maven.apache.org/maven2/org/apache/maven/maven-plugin-api/2.0.9/maven-plugin-api-2.0.9.jar (13 KB at 1259.0 KB/sec)
[INFO] Downloading: https://repo.maven.apache.org/maven2/org/apache/maven/maven-plugin-parameter-documenter/2.0.9/maven-plugin-parameter-documenter-2.0.9.jar
[INFO] Downloading: https://repo.maven.apache.org/maven2/org/apache/maven/maven-settings/2.0.9/maven-settings-2.0.9.jar
[INFO] Downloaded: https://repo.maven.apache.org/maven2/org/apache/maven/maven-plugin-parameter-documenter/2.0.9/maven-plugin-parameter-documenter-2.0.9.jar (21 KB at 1699.1 KB/sec)
[INFO] Downloading: https://repo.maven.apache.org/maven2/org/apache/maven/maven-profile/2.0.9/maven-profile-2.0.9.jar
[INFO] Downloaded: https://repo.maven.apache.org/maven2/org/apache/maven/maven-settings/2.0.9/maven-settings-2.0.9.jar (48 KB at 3425.8 KB/sec)
[INFO] Downloading: https://repo.maven.apache.org/maven2/org/apache/maven/maven-model/2.0.9/maven-model-2.0.9.jar
[INFO] Downloaded: https://repo.maven.apache.org/maven2/org/codehaus/plexus/plexus-utils/1.5.1/plexus-utils-1.5.1.jar (206 KB at 7094.6 KB/sec)
[INFO] Downloading: https://repo.maven.apache.org/maven2/org/apache/maven/maven-repository-metadata/2.0.9/maven-repository-metadata-2.0.9.jar
[INFO] Downloaded: https://repo.maven.apache.org/maven2/org/apache/maven/maven-profile/2.0.9/maven-profile-2.0.9.jar (35 KB at 1438.8 KB/sec)
[INFO] Downloading: https://repo.maven.apache.org/maven2/org/apache/maven/maven-error-diagnostics/2.0.9/maven-error-diagnostics-2.0.9.jar
[INFO] Downloaded: https://repo.maven.apache.org/maven2/org/apache/maven/maven-model/2.0.9/maven-model-2.0.9.jar (86 KB at 3411.0 KB/sec)
[INFO] Downloading: https://repo.maven.apache.org/maven2/org/apache/maven/maven-project/2.0.9/maven-project-2.0.9.jar
[INFO] Downloaded: https://repo.maven.apache.org/maven2/org/apache/maven/maven-artifact/2.0.9/maven-artifact-2.0.9.jar (87 KB at 2631.1 KB/sec)
[INFO] Downloading: https://repo.maven.apache.org/maven2/org/apache/maven/maven-plugin-registry/2.0.9/maven-plugin-registry-2.0.9.jar
[INFO] Downloaded: https://repo.maven.apache.org/maven2/org/apache/maven/maven-repository-metadata/2.0.9/maven-repository-metadata-2.0.9.jar (24 KB at 705.4 KB/sec)
[INFO] Downloading: https://repo.maven.apache.org/maven2/org/apache/maven/maven-plugin-descriptor/2.0.9/maven-plugin-descriptor-2.0.9.jar
[INFO] Downloaded: https://repo.maven.apache.org/maven2/org/apache/maven/maven-error-diagnostics/2.0.9/maven-error-diagnostics-2.0.9.jar (14 KB at 336.6 KB/sec)
[INFO] Downloading: https://repo.maven.apache.org/maven2/org/apache/maven/maven-artifact-manager/2.0.9/maven-artifact-manager-2.0.9.jar
[INFO] Downloaded: https://repo.maven.apache.org/maven2/org/apache/maven/maven-plugin-registry/2.0.9/maven-plugin-registry-2.0.9.jar (29 KB at 676.0 KB/sec)
[INFO] Downloading: https://repo.maven.apache.org/maven2/org/apache/maven/maven-monitor/2.0.9/maven-monitor-2.0.9.jar
[INFO] Downloaded: https://repo.maven.apache.org/maven2/org/apache/maven/maven-core/2.0.9/maven-core-2.0.9.jar (156 KB at 3247.7 KB/sec)
[INFO] Downloading: https://repo.maven.apache.org/maven2/org/apache/maven/maven-toolchain/1.0/maven-toolchain-1.0.jar
[INFO] Downloaded: https://repo.maven.apache.org/maven2/org/apache/maven/maven-plugin-descriptor/2.0.9/maven-plugin-descriptor-2.0.9.jar (37 KB at 695.7 KB/sec)
[INFO] Downloading: https://repo.maven.apache.org/maven2/org/apache/maven/shared/maven-shared-utils/0.1/maven-shared-utils-0.1.jar
[INFO] Downloaded: https://repo.maven.apache.org/maven2/org/apache/maven/maven-toolchain/1.0/maven-toolchain-1.0.jar (33 KB at 606.4 KB/sec)
[INFO] Downloaded: https://repo.maven.apache.org/maven2/org/apache/maven/maven-artifact-manager/2.0.9/maven-artifact-manager-2.0.9.jar (57 KB at 1065.7 KB/sec)
[INFO] Downloading: https://repo.maven.apache.org/maven2/org/apache/maven/shared/maven-shared-incremental/1.1/maven-shared-incremental-1.1.jar
[INFO] Downloading: https://repo.maven.apache.org/maven2/org/codehaus/plexus/plexus-compiler-api/2.4/plexus-compiler-api-2.4.jar
[INFO] Downloaded: https://repo.maven.apache.org/maven2/org/apache/maven/maven-project/2.0.9/maven-project-2.0.9.jar (119 KB at 2202.3 KB/sec)
[INFO] Downloading: https://repo.maven.apache.org/maven2/org/codehaus/plexus/plexus-compiler-manager/2.4/plexus-compiler-manager-2.4.jar
[INFO] Downloaded: https://repo.maven.apache.org/maven2/org/apache/maven/maven-monitor/2.0.9/maven-monitor-2.0.9.jar (11 KB at 176.1 KB/sec)
[INFO] Downloading: https://repo.maven.apache.org/maven2/org/codehaus/plexus/plexus-compiler-javac/2.4/plexus-compiler-javac-2.4.jar
[INFO] Downloaded: https://repo.maven.apache.org/maven2/org/codehaus/plexus/plexus-compiler-manager/2.4/plexus-compiler-manager-2.4.jar (5 KB at 67.5 KB/sec)
[INFO] Downloading: https://repo.maven.apache.org/maven2/org/codehaus/plexus/plexus-container-default/1.5.5/plexus-container-default-1.5.5.jar
[INFO] Downloaded: https://repo.maven.apache.org/maven2/org/codehaus/plexus/plexus-compiler-api/2.4/plexus-compiler-api-2.4.jar (25 KB at 375.2 KB/sec)
[INFO] Downloading: https://repo.maven.apache.org/maven2/org/codehaus/plexus/plexus-classworlds/2.2.2/plexus-classworlds-2.2.2.jar
[INFO] Downloaded: https://repo.maven.apache.org/maven2/org/codehaus/plexus/plexus-compiler-javac/2.4/plexus-compiler-javac-2.4.jar (19 KB at 277.4 KB/sec)
[INFO] Downloaded: https://repo.maven.apache.org/maven2/org/codehaus/plexus/plexus-classworlds/2.2.2/plexus-classworlds-2.2.2.jar (46 KB at 592.2 KB/sec)
[INFO] Downloaded: https://repo.maven.apache.org/maven2/org/apache/maven/shared/maven-shared-incremental/1.1/maven-shared-incremental-1.1.jar (14 KB at 165.3 KB/sec)
[INFO] Downloaded: https://repo.maven.apache.org/maven2/org/apache/maven/shared/maven-shared-utils/0.1/maven-shared-utils-0.1.jar (151 KB at 1796.4 KB/sec)
[INFO] Downloaded: https://repo.maven.apache.org/maven2/org/codehaus/plexus/plexus-container-default/1.5.5/plexus-container-default-1.5.5.jar (212 KB at 2431.8 KB/sec)
[INFO] Changes detected - recompiling the module!
[INFO] Compiling 9 source files to <https://builds.apache.org/job/CarbonData-master/ws/common/target/classes>
[INFO] 
[INFO] --- maven-resources-plugin:2.7:testResources (default-testResources) @ carbondata-common ---
[INFO] Using 'UTF-8' encoding to copy filtered resources.
[INFO] skip non existing resourceDirectory <https://builds.apache.org/job/CarbonData-master/ws/common/src/test/resources>
[INFO] Copying 3 resources
[INFO] 
[INFO] --- maven-compiler-plugin:3.2:testCompile (default-testCompile) @ carbondata-common ---
[INFO] Changes detected - recompiling the module!
[INFO] Compiling 7 source files to <https://builds.apache.org/job/CarbonData-master/ws/common/target/test-classes>
[INFO] <https://builds.apache.org/job/CarbonData-master/ws/common/src/test/java/org/apache/carbondata/common/logging/impl/AuditExtendedRollingFileAppenderTest_UT.java>: Some input files use or override a deprecated API.
[INFO] <https://builds.apache.org/job/CarbonData-master/ws/common/src/test/java/org/apache/carbondata/common/logging/impl/AuditExtendedRollingFileAppenderTest_UT.java>: Recompile with -Xlint:deprecation for details.
[INFO] 
[INFO] --- maven-surefire-plugin:2.18.1:test (default-test) @ carbondata-common ---
[INFO] Downloading: https://repo.maven.apache.org/maven2/org/apache/maven/surefire/maven-surefire-common/2.18.1/maven-surefire-common-2.18.1.pom
[INFO] Downloaded: https://repo.maven.apache.org/maven2/org/apache/maven/surefire/maven-surefire-common/2.18.1/maven-surefire-common-2.18.1.pom (7 KB at 510.3 KB/sec)
[INFO] Downloading: https://repo.maven.apache.org/maven2/org/apache/maven/surefire/surefire-api/2.18.1/surefire-api-2.18.1.pom
[INFO] Downloaded: https://repo.maven.apache.org/maven2/org/apache/maven/surefire/surefire-api/2.18.1/surefire-api-2.18.1.pom (3 KB at 278.7 KB/sec)
[INFO] Downloading: https://repo.maven.apache.org/maven2/org/apache/maven/surefire/surefire-booter/2.18.1/surefire-booter-2.18.1.pom
[INFO] Downloaded: https://repo.maven.apache.org/maven2/org/apache/maven/surefire/surefire-booter/2.18.1/surefire-booter-2.18.1.pom (3 KB at 355.8 KB/sec)
[INFO] Downloading: https://repo.maven.apache.org/maven2/org/apache/maven/surefire/maven-surefire-common/2.18.1/maven-surefire-common-2.18.1.jar
[INFO] Downloading: https://repo.maven.apache.org/maven2/org/apache/maven/surefire/surefire-booter/2.18.1/surefire-booter-2.18.1.jar
[INFO] Downloading: https://repo.maven.apache.org/maven2/org/apache/maven/maven-toolchain/2.2.1/maven-toolchain-2.2.1.jar
[INFO] Downloading: https://repo.maven.apache.org/maven2/org/apache/maven/surefire/surefire-api/2.18.1/surefire-api-2.18.1.jar
[INFO] Downloaded: https://repo.maven.apache.org/maven2/org/apache/maven/surefire/surefire-booter/2.18.1/surefire-booter-2.18.1.jar (39 KB at 2433.9 KB/sec)
[INFO] Downloaded: https://repo.maven.apache.org/maven2/org/apache/maven/maven-toolchain/2.2.1/maven-toolchain-2.2.1.jar (37 KB at 1413.1 KB/sec)
[INFO] Downloaded: https://repo.maven.apache.org/maven2/org/apache/maven/surefire/surefire-api/2.18.1/surefire-api-2.18.1.jar (145 KB at 4982.8 KB/sec)
[INFO] Downloaded: https://repo.maven.apache.org/maven2/org/apache/maven/surefire/maven-surefire-common/2.18.1/maven-surefire-common-2.18.1.jar (269 KB at 7657.2 KB/sec)
[JENKINS] Recording test results
[INFO] 
[INFO] --- maven-jar-plugin:2.5:jar (default-jar) @ carbondata-common ---
[INFO] Downloading: https://repo.maven.apache.org/maven2/org/apache/maven/maven-core/2.0.6/maven-core-2.0.6.jar
[INFO] Downloading: https://repo.maven.apache.org/maven2/org/apache/maven/maven-settings/2.0.6/maven-settings-2.0.6.jar
[INFO] Downloading: https://repo.maven.apache.org/maven2/org/apache/maven/maven-plugin-parameter-documenter/2.0.6/maven-plugin-parameter-documenter-2.0.6.jar
[INFO] Downloading: https://repo.maven.apache.org/maven2/org/apache/maven/maven-model/2.0.6/maven-model-2.0.6.jar
[INFO] Downloading: https://repo.maven.apache.org/maven2/org/apache/maven/maven-profile/2.0.6/maven-profile-2.0.6.jar
[INFO] Downloaded: https://repo.maven.apache.org/maven2/org/apache/maven/maven-settings/2.0.6/maven-settings-2.0.6.jar (48 KB at 3995.8 KB/sec)
[INFO] Downloading: https://repo.maven.apache.org/maven2/org/apache/maven/maven-repository-metadata/2.0.6/maven-repository-metadata-2.0.6.jar
[INFO] Downloaded: https://repo.maven.apache.org/maven2/org/apache/maven/maven-core/2.0.6/maven-core-2.0.6.jar (149 KB at 7050.6 KB/sec)
[INFO] Downloading: https://repo.maven.apache.org/maven2/org/apache/maven/maven-error-diagnostics/2.0.6/maven-error-diagnostics-2.0.6.jar
[INFO] Downloaded: https://repo.maven.apache.org/maven2/org/apache/maven/maven-repository-metadata/2.0.6/maven-repository-metadata-2.0.6.jar (24 KB at 1086.4 KB/sec)
[INFO] Downloading: https://repo.maven.apache.org/maven2/org/apache/maven/maven-plugin-descriptor/2.0.6/maven-plugin-descriptor-2.0.6.jar
[INFO] Downloaded: https://repo.maven.apache.org/maven2/org/apache/maven/maven-profile/2.0.6/maven-profile-2.0.6.jar (35 KB at 1323.7 KB/sec)
[INFO] Downloading: https://repo.maven.apache.org/maven2/org/apache/maven/maven-artifact-manager/2.0.6/maven-artifact-manager-2.0.6.jar
[INFO] Downloaded: https://repo.maven.apache.org/maven2/org/apache/maven/maven-model/2.0.6/maven-model-2.0.6.jar (85 KB at 3244.8 KB/sec)
[INFO] Downloading: https://repo.maven.apache.org/maven2/org/apache/maven/maven-monitor/2.0.6/maven-monitor-2.0.6.jar
[INFO] Downloaded: https://repo.maven.apache.org/maven2/org/apache/maven/maven-error-diagnostics/2.0.6/maven-error-diagnostics-2.0.6.jar (14 KB at 443.1 KB/sec)
[INFO] Downloaded: https://repo.maven.apache.org/maven2/org/apache/maven/maven-plugin-parameter-documenter/2.0.6/maven-plugin-parameter-documenter-2.0.6.jar (21 KB at 614.2 KB/sec)
[INFO] Downloading: https://repo.maven.apache.org/maven2/org/apache/maven/maven-project/2.0.6/maven-project-2.0.6.jar
[INFO] Downloading: https://repo.maven.apache.org/maven2/org/apache/maven/maven-plugin-registry/2.0.6/maven-plugin-registry-2.0.6.jar
[INFO] Downloaded: https://repo.maven.apache.org/maven2/org/apache/maven/maven-plugin-descriptor/2.0.6/maven-plugin-descriptor-2.0.6.jar (37 KB at 1000.2 KB/sec)
[INFO] Downloaded: https://repo.maven.apache.org/maven2/org/apache/maven/maven-monitor/2.0.6/maven-monitor-2.0.6.jar (11 KB at 263.2 KB/sec)
[INFO] Downloaded: https://repo.maven.apache.org/maven2/org/apache/maven/maven-plugin-registry/2.0.6/maven-plugin-registry-2.0.6.jar (29 KB at 688.9 KB/sec)
[INFO] Downloaded: https://repo.maven.apache.org/maven2/org/apache/maven/maven-project/2.0.6/maven-project-2.0.6.jar (114 KB at 2638.6 KB/sec)
[INFO] Downloaded: https://repo.maven.apache.org/maven2/org/apache/maven/maven-artifact-manager/2.0.6/maven-artifact-manager-2.0.6.jar (56 KB at 1254.2 KB/sec)
[INFO] Building jar: <https://builds.apache.org/job/CarbonData-master/ws/common/target/carbondata-common-0.2.0-incubating-SNAPSHOT.jar>
[INFO] 
[INFO] --- maven-site-plugin:3.4:attach-descriptor (attach-descriptor) @ carbondata-common ---
[INFO]                                                                         
[INFO] ------------------------------------------------------------------------
[INFO] Building Apache CarbonData :: Format 0.2.0-incubating-SNAPSHOT
[INFO] ------------------------------------------------------------------------
[INFO] Downloading: https://repo.maven.apache.org/maven2/org/apache/thrift/tools/maven-thrift-plugin/0.1.11/maven-thrift-plugin-0.1.11.pom
[INFO] Downloaded: https://repo.maven.apache.org/maven2/org/apache/thrift/tools/maven-thrift-plugin/0.1.11/maven-thrift-plugin-0.1.11.pom (4 KB at 353.7 KB/sec)
[INFO] Downloading: https://repo.maven.apache.org/maven2/org/apache/thrift/tools/maven-thrift-plugin/0.1.11/maven-thrift-plugin-0.1.11.jar
[INFO] Downloaded: https://repo.maven.apache.org/maven2/org/apache/thrift/tools/maven-thrift-plugin/0.1.11/maven-thrift-plugin-0.1.11.jar (18 KB at 1736.0 KB/sec)
[INFO] Downloading: https://repo.maven.apache.org/maven2/org/apache/thrift/libthrift/0.9.3/libthrift-0.9.3.pom
[INFO] Downloaded: https://repo.maven.apache.org/maven2/org/apache/thrift/libthrift/0.9.3/libthrift-0.9.3.pom (4 KB at 543.8 KB/sec)
[INFO] Downloading: https://repo.maven.apache.org/maven2/org/slf4j/slf4j-api/1.7.12/slf4j-api-1.7.12.pom
[INFO] Downloaded: https://repo.maven.apache.org/maven2/org/slf4j/slf4j-api/1.7.12/slf4j-api-1.7.12.pom (3 KB at 433.1 KB/sec)
[INFO] Downloading: https://repo.maven.apache.org/maven2/org/slf4j/slf4j-parent/1.7.12/slf4j-parent-1.7.12.pom
[INFO] Downloaded: https://repo.maven.apache.org/maven2/org/slf4j/slf4j-parent/1.7.12/slf4j-parent-1.7.12.pom (12 KB at 1652.9 KB/sec)
[INFO] Downloading: https://repo.maven.apache.org/maven2/org/apache/httpcomponents/httpclient/4.4.1/httpclient-4.4.1.pom
[INFO] Downloaded: https://repo.maven.apache.org/maven2/org/apache/httpcomponents/httpclient/4.4.1/httpclient-4.4.1.pom (7 KB at 1040.5 KB/sec)
[INFO] Downloading: https://repo.maven.apache.org/maven2/org/apache/httpcomponents/httpcomponents-client/4.4.1/httpcomponents-client-4.4.1.pom
[INFO] Downloaded: https://repo.maven.apache.org/maven2/org/apache/httpcomponents/httpcomponents-client/4.4.1/httpcomponents-client-4.4.1.pom (16 KB at 2185.7 KB/sec)
[INFO] Downloading: https://repo.maven.apache.org/maven2/org/apache/httpcomponents/httpcore/4.4.1/httpcore-4.4.1.pom
[INFO] Downloaded: https://repo.maven.apache.org/maven2/org/apache/httpcomponents/httpcore/4.4.1/httpcore-4.4.1.pom (5 KB at 748.0 KB/sec)
[INFO] Downloading: https://repo.maven.apache.org/maven2/org/apache/httpcomponents/httpcomponents-core/4.4.1/httpcomponents-core-4.4.1.pom
[INFO] Downloaded: https://repo.maven.apache.org/maven2/org/apache/httpcomponents/httpcomponents-core/4.4.1/httpcomponents-core-4.4.1.pom (13 KB at 1793.9 KB/sec)
[INFO] Downloading: https://repo.maven.apache.org/maven2/commons-codec/commons-codec/1.9/commons-codec-1.9.pom
[INFO] Downloaded: https://repo.maven.apache.org/maven2/commons-codec/commons-codec/1.9/commons-codec-1.9.pom (12 KB at 1409.1 KB/sec)
[INFO] Downloading: https://repo.maven.apache.org/maven2/org/apache/commons/commons-parent/32/commons-parent-32.pom
[INFO] Downloaded: https://repo.maven.apache.org/maven2/org/apache/commons/commons-parent/32/commons-parent-32.pom (52 KB at 5154.6 KB/sec)
[INFO] Downloading: https://repo.maven.apache.org/maven2/org/apache/thrift/libthrift/0.9.3/libthrift-0.9.3.jar
[INFO] Downloading: https://repo.maven.apache.org/maven2/org/slf4j/slf4j-api/1.7.12/slf4j-api-1.7.12.jar
[INFO] Downloading: https://repo.maven.apache.org/maven2/commons-codec/commons-codec/1.9/commons-codec-1.9.jar
[INFO] Downloading: https://repo.maven.apache.org/maven2/org/apache/httpcomponents/httpclient/4.4.1/httpclient-4.4.1.jar
[INFO] Downloading: https://repo.maven.apache.org/maven2/org/apache/httpcomponents/httpcore/4.4.1/httpcore-4.4.1.jar
[INFO] Downloaded: https://repo.maven.apache.org/maven2/org/apache/thrift/libthrift/0.9.3/libthrift-0.9.3.jar (229 KB at 10396.0 KB/sec)
[INFO] Downloaded: https://repo.maven.apache.org/maven2/org/slf4j/slf4j-api/1.7.12/slf4j-api-1.7.12.jar (32 KB at 1206.7 KB/sec)
[INFO] Downloaded: https://repo.maven.apache.org/maven2/commons-codec/commons-codec/1.9/commons-codec-1.9.jar (258 KB at 6783.6 KB/sec)
[INFO] Downloaded: https://repo.maven.apache.org/maven2/org/apache/httpcomponents/httpcore/4.4.1/httpcore-4.4.1.jar (315 KB at 6695.4 KB/sec)
[INFO] Downloaded: https://repo.maven.apache.org/maven2/org/apache/httpcomponents/httpclient/4.4.1/httpclient-4.4.1.jar (705 KB at 10353.4 KB/sec)
[INFO] 
[INFO] --- maven-clean-plugin:2.5:clean (default-clean) @ carbondata-format ---
[INFO] 
[INFO] --- maven-thrift-plugin:0.1.11:compile (generate-thrift-java) @ carbondata-format ---
[INFO] Downloading: https://repo.maven.apache.org/maven2/com/google/collections/google-collections/0.8/google-collections-0.8.pom
[INFO] Downloaded: https://repo.maven.apache.org/maven2/com/google/collections/google-collections/0.8/google-collections-0.8.pom (3 KB at 333.7 KB/sec)
[INFO] Downloading: https://repo.maven.apache.org/maven2/org/codehaus/plexus/plexus-utils/1.5.4/plexus-utils-1.5.4.pom
[INFO] Downloaded: https://repo.maven.apache.org/maven2/org/codehaus/plexus/plexus-utils/1.5.4/plexus-utils-1.5.4.pom (6 KB at 558.5 KB/sec)
[INFO] Downloading: https://repo.maven.apache.org/maven2/org/slf4j/slf4j-simple/1.5.8/slf4j-simple-1.5.8.pom
[INFO] Downloaded: https://repo.maven.apache.org/maven2/org/slf4j/slf4j-simple/1.5.8/slf4j-simple-1.5.8.pom (2 KB at 157.9 KB/sec)
[INFO] Downloading: https://repo.maven.apache.org/maven2/com/google/collections/google-collections/0.8/google-collections-0.8.jar
[INFO] Downloading: https://repo.maven.apache.org/maven2/org/slf4j/slf4j-api/1.5.8/slf4j-api-1.5.8.jar
[INFO] Downloading: https://repo.maven.apache.org/maven2/org/codehaus/plexus/plexus-utils/1.5.4/plexus-utils-1.5.4.jar
[INFO] Downloading: https://repo.maven.apache.org/maven2/org/slf4j/slf4j-simple/1.5.8/slf4j-simple-1.5.8.jar
[INFO] Downloaded: https://repo.maven.apache.org/maven2/org/slf4j/slf4j-api/1.5.8/slf4j-api-1.5.8.jar (23 KB at 2081.4 KB/sec)
[INFO] Downloaded: https://repo.maven.apache.org/maven2/org/slf4j/slf4j-simple/1.5.8/slf4j-simple-1.5.8.jar (8 KB at 389.9 KB/sec)
[INFO] Downloaded: https://repo.maven.apache.org/maven2/org/codehaus/plexus/plexus-utils/1.5.4/plexus-utils-1.5.4.jar (245 KB at 11104.4 KB/sec)
[INFO] Downloaded: https://repo.maven.apache.org/maven2/com/google/collections/google-collections/0.8/google-collections-0.8.jar (473 KB at 11255.0 KB/sec)
[ERROR] thrift failed output: 
[ERROR] thrift failed error: /bin/sh: 1: thrift: not found

[INFO] ------------------------------------------------------------------------
[INFO] Reactor Summary:
[INFO] 
[INFO] Apache CarbonData :: Parent ........................ SUCCESS [  4.718 s]
[INFO] Apache CarbonData :: Common ........................ SUCCESS [  6.530 s]
[INFO] Apache CarbonData :: Format ........................ FAILURE [  0.761 s]
[INFO] Apache CarbonData :: Core .......................... SKIPPED
[INFO] Apache CarbonData :: Processing .................... SKIPPED
[INFO] Apache CarbonData :: Hadoop ........................ SKIPPED
[INFO] Apache CarbonData :: Spark ......................... SKIPPED
[INFO] Apache CarbonData :: Assembly ...................... SKIPPED
[INFO] Apache CarbonData :: Examples ...................... SKIPPED
[INFO] ------------------------------------------------------------------------
[INFO] BUILD FAILURE
[INFO] ------------------------------------------------------------------------
[INFO] Total time: 18.817 s
[INFO] Finished at: 2016-10-21T15:12:48+00:00
[INFO] Final Memory: 37M/505M
[INFO] ------------------------------------------------------------------------
[ERROR] Failed to execute goal org.apache.thrift.tools:maven-thrift-plugin:0.1.11:compile (generate-thrift-java) on project carbondata-format: thrift did not exit cleanly. Review output for more information. -> [Help 1]
org.apache.maven.lifecycle.LifecycleExecutionException: Failed to execute goal org.apache.thrift.tools:maven-thrift-plugin:0.1.11:compile (generate-thrift-java) on project carbondata-format: thrift did not exit cleanly. Review output for more information.
	at org.apache.maven.lifecycle.internal.MojoExecutor.execute(MojoExecutor.java:212)
	at org.apache.maven.lifecycle.internal.MojoExecutor.execute(MojoExecutor.java:153)
	at org.apache.maven.lifecycle.internal.MojoExecutor.execute(MojoExecutor.java:145)
	at org.apache.maven.lifecycle.internal.LifecycleModuleBuilder.buildProject(LifecycleModuleBuilder.java:116)
	at org.apache.maven.lifecycle.internal.LifecycleModuleBuilder.buildProject(LifecycleModuleBuilder.java:80)
	at org.apache.maven.lifecycle.internal.builder.singlethreaded.SingleThreadedBuilder.build(SingleThreadedBuilder.java:51)
	at org.apache.maven.lifecycle.internal.LifecycleStarter.execute(LifecycleStarter.java:128)
	at org.apache.maven.DefaultMaven.doExecute(DefaultMaven.java:307)
	at org.apache.maven.DefaultMaven.doExecute(DefaultMaven.java:193)
	at org.apache.maven.DefaultMaven.execute(DefaultMaven.java:106)
	at org.jvnet.hudson.maven3.launcher.Maven32Launcher.main(Maven32Launcher.java:132)
	at sun.reflect.NativeMethodAccessorImpl.invoke0(Native Method)
	at sun.reflect.NativeMethodAccessorImpl.invoke(NativeMethodAccessorImpl.java:62)
	at sun.reflect.DelegatingMethodAccessorImpl.invoke(DelegatingMethodAccessorImpl.java:43)
	at java.lang.reflect.Method.invoke(Method.java:498)
	at org.codehaus.plexus.classworlds.launcher.Launcher.launchStandard(Launcher.java:330)
	at org.codehaus.plexus.classworlds.launcher.Launcher.launch(Launcher.java:238)
	at jenkins.maven3.agent.Maven32Main.launch(Maven32Main.java:186)
	at sun.reflect.NativeMethodAccessorImpl.invoke0(Native Method)
	at sun.reflect.NativeMethodAccessorImpl.invoke(NativeMethodAccessorImpl.java:62)
	at sun.reflect.DelegatingMethodAccessorImpl.invoke(DelegatingMethodAccessorImpl.java:43)
	at java.lang.reflect.Method.invoke(Method.java:498)
	at hudson.maven.Maven3Builder.call(Maven3Builder.java:136)
	at hudson.maven.Maven3Builder.call(Maven3Builder.java:71)
	at hudson.remoting.UserRequest.perform(UserRequest.java:153)
	at hudson.remoting.UserRequest.perform(UserRequest.java:50)
	at hudson.remoting.Request$2.run(Request.java:332)
	at hudson.remoting.InterceptingExecutorService$1.call(InterceptingExecutorService.java:68)
	at java.util.concurrent.FutureTask.run(FutureTask.java:266)
	at java.util.concurrent.ThreadPoolExecutor.runWorker(ThreadPoolExecutor.java:1142)
	at java.util.concurrent.ThreadPoolExecutor$Worker.run(ThreadPoolExecutor.java:617)
	at java.lang.Thread.run(Thread.java:745)
Caused by: org.apache.maven.plugin.MojoFailureException: thrift did not exit cleanly. Review output for more information.
	at org.apache.thrift.maven.AbstractThriftMojo.execute(AbstractThriftMojo.java:177)
	at org.apache.thrift.maven.ThriftCompileMojo.execute(ThriftCompileMojo.java:21)
	at org.apache.maven.plugin.DefaultBuildPluginManager.executeMojo(DefaultBuildPluginManager.java:134)
	at org.apache.maven.lifecycle.internal.MojoExecutor.execute(MojoExecutor.java:208)
	... 31 more
[ERROR] 
[ERROR] Re-run Maven using the -X switch to enable full debug logging.
[ERROR] 
[ERROR] For more information about the errors and possible solutions, please read the following articles:
[ERROR] [Help 1] http://cwiki.apache.org/confluence/display/MAVEN/MojoFailureException
[ERROR] 
[ERROR] After correcting the problems, you can resume the build with the command
[ERROR]   mvn <goals> -rf :carbondata-format
[JENKINS] Archiving <https://builds.apache.org/job/CarbonData-master/ws/processing/pom.xml> to org.apache.carbondata/carbondata-processing/0.2.0-incubating-SNAPSHOT/carbondata-processing-0.2.0-incubating-SNAPSHOT.pom
[JENKINS] Archiving <https://builds.apache.org/job/CarbonData-master/ws/assembly/pom.xml> to org.apache.carbondata/carbondata-assembly/0.2.0-incubating-SNAPSHOT/carbondata-assembly-0.2.0-incubating-SNAPSHOT.pom
[JENKINS] Archiving <https://builds.apache.org/job/CarbonData-master/ws/pom.xml> to org.apache.carbondata/carbondata-parent/0.2.0-incubating-SNAPSHOT/carbondata-parent-0.2.0-incubating-SNAPSHOT.pom
[JENKINS] Archiving <https://builds.apache.org/job/CarbonData-master/ws/core/pom.xml> to org.apache.carbondata/carbondata-core/0.2.0-incubating-SNAPSHOT/carbondata-core-0.2.0-incubating-SNAPSHOT.pom
[JENKINS] Archiving <https://builds.apache.org/job/CarbonData-master/ws/format/pom.xml> to org.apache.carbondata/carbondata-format/0.2.0-incubating-SNAPSHOT/carbondata-format-0.2.0-incubating-SNAPSHOT.pom
[JENKINS] Archiving <https://builds.apache.org/job/CarbonData-master/ws/hadoop/pom.xml> to org.apache.carbondata/carbondata-hadoop/0.2.0-incubating-SNAPSHOT/carbondata-hadoop-0.2.0-incubating-SNAPSHOT.pom
[JENKINS] Archiving <https://builds.apache.org/job/CarbonData-master/ws/examples/pom.xml> to org.apache.carbondata/carbondata-examples/0.2.0-incubating-SNAPSHOT/carbondata-examples-0.2.0-incubating-SNAPSHOT.pom
[JENKINS] Archiving <https://builds.apache.org/job/CarbonData-master/ws/common/pom.xml> to org.apache.carbondata/carbondata-common/0.2.0-incubating-SNAPSHOT/carbondata-common-0.2.0-incubating-SNAPSHOT.pom
[JENKINS] Archiving <https://builds.apache.org/job/CarbonData-master/ws/common/target/carbondata-common-0.2.0-incubating-SNAPSHOT.jar> to org.apache.carbondata/carbondata-common/0.2.0-incubating-SNAPSHOT/carbondata-common-0.2.0-incubating-SNAPSHOT.jar
[JENKINS] Archiving <https://builds.apache.org/job/CarbonData-master/ws/integration/spark/pom.xml> to org.apache.carbondata/carbondata-spark/0.2.0-incubating-SNAPSHOT/carbondata-spark-0.2.0-incubating-SNAPSHOT.pom
Sending e-mails to: commits@carbondata.incubator.apache.org
Sending e-mails to: commits@carbondata.incubator.apache.org
channel stopped

Build failed in Jenkins: CarbonData-master #131

Posted by Apache Jenkins Server <je...@builds.apache.org>.
See <https://builds.apache.org/job/CarbonData-master/131/changes>

Changes:

[jackylk] Log the data size of each blocklet

------------------------------------------
Started by an SCM change
[EnvInject] - Loading node environment variables.
Building remotely on jenkins-test-fb0 (Ubuntu ubuntu jenkins-cloud-8GB jenkins-cloud-4GB cloud-slave) in workspace <https://builds.apache.org/job/CarbonData-master/ws/>
Cloning the remote Git repository
Cloning repository https://git-wip-us.apache.org/repos/asf/incubator-carbondata.git
 > git init <https://builds.apache.org/job/CarbonData-master/ws/> # timeout=10
Fetching upstream changes from https://git-wip-us.apache.org/repos/asf/incubator-carbondata.git
 > git --version # timeout=10
 > git -c core.askpass=true fetch --tags --progress https://git-wip-us.apache.org/repos/asf/incubator-carbondata.git +refs/heads/*:refs/remotes/origin/*
 > git config remote.origin.url https://git-wip-us.apache.org/repos/asf/incubator-carbondata.git # timeout=10
 > git config --add remote.origin.fetch +refs/heads/*:refs/remotes/origin/* # timeout=10
 > git config remote.origin.url https://git-wip-us.apache.org/repos/asf/incubator-carbondata.git # timeout=10
Fetching upstream changes from https://git-wip-us.apache.org/repos/asf/incubator-carbondata.git
 > git -c core.askpass=true fetch --tags --progress https://git-wip-us.apache.org/repos/asf/incubator-carbondata.git +refs/heads/*:refs/remotes/origin/*
 > git rev-parse refs/remotes/origin/master^{commit} # timeout=10
 > git rev-parse refs/remotes/origin/origin/master^{commit} # timeout=10
Checking out Revision 510a4583c0d19336c81aeb5b4502024eba851de5 (refs/remotes/origin/master)
 > git config core.sparsecheckout # timeout=10
 > git checkout -f 510a4583c0d19336c81aeb5b4502024eba851de5
 > git rev-list 936c73d6b2a0e6e5df70547eb066a9effc0c5062 # timeout=10
Parsing POMs
Modules changed, recalculating dependency graph
Established TCP socket on 59070
maven32-agent.jar already up to date
maven32-interceptor.jar already up to date
maven3-interceptor-commons.jar already up to date
[CarbonData-master] $ /home/jenkins/tools/java/latest1.8/bin/java -Xmx2g -Xms256m -XX:MaxPermSize=512m -cp /home/jenkins/jenkins-slave/maven32-agent.jar:/home/jenkins/tools/maven/apache-maven-3.3.3/boot/plexus-classworlds-2.5.2.jar:/home/jenkins/tools/maven/apache-maven-3.3.3/conf/logging jenkins.maven3.agent.Maven32Main /home/jenkins/tools/maven/apache-maven-3.3.3 /home/jenkins/jenkins-slave/slave.jar /home/jenkins/jenkins-slave/maven32-interceptor.jar /home/jenkins/jenkins-slave/maven3-interceptor-commons.jar 59070
Java HotSpot(TM) 64-Bit Server VM warning: ignoring option MaxPermSize=512m; support was removed in 8.0
<===[JENKINS REMOTING CAPACITY]===>   channel started
Executing Maven:  -B -f <https://builds.apache.org/job/CarbonData-master/ws/pom.xml> -Dmaven.repo.local=/home/jenkins/jenkins-slave/maven-repositories/0 -B -e clean package
[INFO] Error stacktraces are turned on.
[INFO] Scanning for projects...
[INFO] ------------------------------------------------------------------------
[INFO] Reactor Build Order:
[INFO] 
[INFO] Apache CarbonData :: Parent
[INFO] Apache CarbonData :: Common
[INFO] Apache CarbonData :: Format
[INFO] Apache CarbonData :: Core
[INFO] Apache CarbonData :: Processing
[INFO] Apache CarbonData :: Hadoop
[INFO] Apache CarbonData :: Spark
[INFO] Apache CarbonData :: Assembly
[INFO] Apache CarbonData :: Examples
[INFO]                                                                         
[INFO] ------------------------------------------------------------------------
[INFO] Building Apache CarbonData :: Parent 0.2.0-incubating-SNAPSHOT
[INFO] ------------------------------------------------------------------------
[INFO] 
[INFO] --- maven-clean-plugin:2.5:clean (default-clean) @ carbondata-parent ---
[INFO] 
[INFO] --- maven-remote-resources-plugin:1.5:process (default) @ carbondata-parent ---
[INFO] 
[INFO] --- maven-site-plugin:3.4:attach-descriptor (attach-descriptor) @ carbondata-parent ---
[INFO]                                                                         
[INFO] ------------------------------------------------------------------------
[INFO] Building Apache CarbonData :: Common 0.2.0-incubating-SNAPSHOT
[INFO] ------------------------------------------------------------------------
[INFO] Downloading: https://repo.maven.apache.org/maven2/org/apache/maven/plugins/maven-jar-plugin/2.5/maven-jar-plugin-2.5.pom
[INFO] ------------------------------------------------------------------------
[INFO] Reactor Summary:
[INFO] 
[INFO] Apache CarbonData :: Parent ........................ SUCCESS [  3.287 s]
[INFO] Apache CarbonData :: Common ........................ FAILURE [ 30.551 s]
[INFO] Apache CarbonData :: Format ........................ SKIPPED
[INFO] Apache CarbonData :: Core .......................... SKIPPED
[INFO] Apache CarbonData :: Processing .................... SKIPPED
[INFO] Apache CarbonData :: Hadoop ........................ SKIPPED
[INFO] Apache CarbonData :: Spark ......................... SKIPPED
[INFO] Apache CarbonData :: Assembly ...................... SKIPPED
[INFO] Apache CarbonData :: Examples ...................... SKIPPED
[INFO] ------------------------------------------------------------------------
[INFO] BUILD FAILURE
[INFO] ------------------------------------------------------------------------
[INFO] Total time: 39.829 s
[INFO] Finished at: 2016-10-21T12:12:56+00:00
[INFO] Final Memory: 21M/292M
[INFO] ------------------------------------------------------------------------
Waiting for Jenkins to finish collecting data
[ERROR] Plugin org.apache.maven.plugins:maven-jar-plugin:2.5 or one of its dependencies could not be resolved: Failed to read artifact descriptor for org.apache.maven.plugins:maven-jar-plugin:jar:2.5: Could not transfer artifact org.apache.maven.plugins:maven-jar-plugin:pom:2.5 from/to central (https://repo.maven.apache.org/maven2): repo.maven.apache.org: Name or service not known: Unknown host repo.maven.apache.org: Name or service not known -> [Help 1]
org.apache.maven.plugin.PluginResolutionException: Plugin org.apache.maven.plugins:maven-jar-plugin:2.5 or one of its dependencies could not be resolved: Failed to read artifact descriptor for org.apache.maven.plugins:maven-jar-plugin:jar:2.5
	at org.apache.maven.plugin.internal.DefaultPluginDependenciesResolver.resolve(DefaultPluginDependenciesResolver.java:117)
	at org.apache.maven.plugin.internal.DefaultMavenPluginManager.getPluginDescriptor(DefaultMavenPluginManager.java:179)
	at org.apache.maven.plugin.internal.DefaultMavenPluginManager.getMojoDescriptor(DefaultMavenPluginManager.java:298)
	at org.apache.maven.plugin.DefaultBuildPluginManager.getMojoDescriptor(DefaultBuildPluginManager.java:241)
	at org.apache.maven.lifecycle.internal.DefaultLifecycleExecutionPlanCalculator.setupMojoExecution(DefaultLifecycleExecutionPlanCalculator.java:169)
	at org.apache.maven.lifecycle.internal.DefaultLifecycleExecutionPlanCalculator.setupMojoExecutions(DefaultLifecycleExecutionPlanCalculator.java:155)
	at org.apache.maven.lifecycle.internal.DefaultLifecycleExecutionPlanCalculator.calculateExecutionPlan(DefaultLifecycleExecutionPlanCalculator.java:131)
	at org.apache.maven.lifecycle.internal.DefaultLifecycleExecutionPlanCalculator.calculateExecutionPlan(DefaultLifecycleExecutionPlanCalculator.java:145)
	at org.apache.maven.lifecycle.internal.builder.BuilderCommon.resolveBuildPlan(BuilderCommon.java:96)
	at org.apache.maven.lifecycle.internal.LifecycleModuleBuilder.buildProject(LifecycleModuleBuilder.java:109)
	at org.apache.maven.lifecycle.internal.LifecycleModuleBuilder.buildProject(LifecycleModuleBuilder.java:80)
	at org.apache.maven.lifecycle.internal.builder.singlethreaded.SingleThreadedBuilder.build(SingleThreadedBuilder.java:51)
	at org.apache.maven.lifecycle.internal.LifecycleStarter.execute(LifecycleStarter.java:128)
	at org.apache.maven.DefaultMaven.doExecute(DefaultMaven.java:307)
	at org.apache.maven.DefaultMaven.doExecute(DefaultMaven.java:193)
	at org.apache.maven.DefaultMaven.execute(DefaultMaven.java:106)
	at org.jvnet.hudson.maven3.launcher.Maven32Launcher.main(Maven32Launcher.java:132)
	at sun.reflect.NativeMethodAccessorImpl.invoke0(Native Method)
	at sun.reflect.NativeMethodAccessorImpl.invoke(NativeMethodAccessorImpl.java:62)
	at sun.reflect.DelegatingMethodAccessorImpl.invoke(DelegatingMethodAccessorImpl.java:43)
	at java.lang.reflect.Method.invoke(Method.java:498)
	at org.codehaus.plexus.classworlds.launcher.Launcher.launchStandard(Launcher.java:330)
	at org.codehaus.plexus.classworlds.launcher.Launcher.launch(Launcher.java:238)
	at jenkins.maven3.agent.Maven32Main.launch(Maven32Main.java:186)
	at sun.reflect.NativeMethodAccessorImpl.invoke0(Native Method)
	at sun.reflect.NativeMethodAccessorImpl.invoke(NativeMethodAccessorImpl.java:62)
	at sun.reflect.DelegatingMethodAccessorImpl.invoke(DelegatingMethodAccessorImpl.java:43)
	at java.lang.reflect.Method.invoke(Method.java:498)
	at hudson.maven.Maven3Builder.call(Maven3Builder.java:136)
	at hudson.maven.Maven3Builder.call(Maven3Builder.java:71)
	at hudson.remoting.UserRequest.perform(UserRequest.java:153)
	at hudson.remoting.UserRequest.perform(UserRequest.java:50)
	at hudson.remoting.Request$2.run(Request.java:332)
	at hudson.remoting.InterceptingExecutorService$1.call(InterceptingExecutorService.java:68)
	at java.util.concurrent.FutureTask.run(FutureTask.java:266)
	at java.util.concurrent.ThreadPoolExecutor.runWorker(ThreadPoolExecutor.java:1142)
	at java.util.concurrent.ThreadPoolExecutor$Worker.run(ThreadPoolExecutor.java:617)
	at java.lang.Thread.run(Thread.java:745)
Caused by: org.eclipse.aether.resolution.ArtifactDescriptorException: Failed to read artifact descriptor for org.apache.maven.plugins:maven-jar-plugin:jar:2.5
	at org.apache.maven.repository.internal.DefaultArtifactDescriptorReader.loadPom(DefaultArtifactDescriptorReader.java:302)
	at org.apache.maven.repository.internal.DefaultArtifactDescriptorReader.readArtifactDescriptor(DefaultArtifactDescriptorReader.java:218)
	at org.eclipse.aether.internal.impl.DefaultRepositorySystem.readArtifactDescriptor(DefaultRepositorySystem.java:287)
	at org.apache.maven.plugin.internal.DefaultPluginDependenciesResolver.resolve(DefaultPluginDependenciesResolver.java:103)
	... 37 more
Caused by: org.eclipse.aether.resolution.ArtifactResolutionException: Could not transfer artifact org.apache.maven.plugins:maven-jar-plugin:pom:2.5 from/to central (https://repo.maven.apache.org/maven2): repo.maven.apache.org: Name or service not known
	at org.eclipse.aether.internal.impl.DefaultArtifactResolver.resolve(DefaultArtifactResolver.java:444)
	at org.eclipse.aether.internal.impl.DefaultArtifactResolver.resolveArtifacts(DefaultArtifactResolver.java:246)
	at org.eclipse.aether.internal.impl.DefaultArtifactResolver.resolveArtifact(DefaultArtifactResolver.java:223)
	at org.apache.maven.repository.internal.DefaultArtifactDescriptorReader.loadPom(DefaultArtifactDescriptorReader.java:287)
	... 40 more
Caused by: org.eclipse.aether.transfer.ArtifactTransferException: Could not transfer artifact org.apache.maven.plugins:maven-jar-plugin:pom:2.5 from/to central (https://repo.maven.apache.org/maven2): repo.maven.apache.org: Name or service not known
	at org.eclipse.aether.connector.basic.ArtifactTransportListener.transferFailed(ArtifactTransportListener.java:43)
	at org.eclipse.aether.connector.basic.BasicRepositoryConnector$TaskRunner.run(BasicRepositoryConnector.java:355)
	at org.eclipse.aether.util.concurrency.RunnableErrorForwarder$1.run(RunnableErrorForwarder.java:67)
	at org.eclipse.aether.connector.basic.BasicRepositoryConnector$DirectExecutor.execute(BasicRepositoryConnector.java:581)
	at org.eclipse.aether.connector.basic.BasicRepositoryConnector.get(BasicRepositoryConnector.java:249)
	at org.eclipse.aether.internal.impl.DefaultArtifactResolver.performDownloads(DefaultArtifactResolver.java:520)
	at org.eclipse.aether.internal.impl.DefaultArtifactResolver.resolve(DefaultArtifactResolver.java:421)
	... 43 more
Caused by: org.apache.maven.wagon.TransferFailedException: repo.maven.apache.org: Name or service not known
	at org.apache.maven.wagon.providers.http.AbstractHttpClientWagon.fillInputData(AbstractHttpClientWagon.java:1066)
	at org.apache.maven.wagon.providers.http.AbstractHttpClientWagon.fillInputData(AbstractHttpClientWagon.java:960)
	at org.apache.maven.wagon.StreamWagon.getInputStream(StreamWagon.java:116)
	at org.apache.maven.wagon.StreamWagon.getIfNewer(StreamWagon.java:88)
	at org.apache.maven.wagon.StreamWagon.get(StreamWagon.java:61)
	at org.eclipse.aether.transport.wagon.WagonTransporter$GetTaskRunner.run(WagonTransporter.java:560)
	at org.eclipse.aether.transport.wagon.WagonTransporter.execute(WagonTransporter.java:427)
	at org.eclipse.aether.transport.wagon.WagonTransporter.get(WagonTransporter.java:404)
	at org.eclipse.aether.connector.basic.BasicRepositoryConnector$GetTaskRunner.runTask(BasicRepositoryConnector.java:447)
	at org.eclipse.aether.connector.basic.BasicRepositoryConnector$TaskRunner.run(BasicRepositoryConnector.java:350)
	... 48 more
Caused by: java.net.UnknownHostException: repo.maven.apache.org: Name or service not known
	at java.net.Inet6AddressImpl.lookupAllHostAddr(Native Method)
	at java.net.InetAddress$2.lookupAllHostAddr(InetAddress.java:928)
	at java.net.InetAddress.getAddressesFromNameService(InetAddress.java:1323)
	at java.net.InetAddress.getAllByName0(InetAddress.java:1276)
	at java.net.InetAddress.getAllByName(InetAddress.java:1192)
	at java.net.InetAddress.getAllByName(InetAddress.java:1126)
	at org.apache.maven.wagon.providers.http.httpclient.impl.conn.SystemDefaultDnsResolver.resolve(SystemDefaultDnsResolver.java:44)
	at org.apache.maven.wagon.providers.http.httpclient.impl.conn.HttpClientConnectionOperator.connect(HttpClientConnectionOperator.java:101)
	at org.apache.maven.wagon.providers.http.httpclient.impl.conn.PoolingHttpClientConnectionManager.connect(PoolingHttpClientConnectionManager.java:318)
	at org.apache.maven.wagon.providers.http.httpclient.impl.execchain.MainClientExec.establishRoute(MainClientExec.java:363)
	at org.apache.maven.wagon.providers.http.httpclient.impl.execchain.MainClientExec.execute(MainClientExec.java:219)
	at org.apache.maven.wagon.providers.http.httpclient.impl.execchain.ProtocolExec.execute(ProtocolExec.java:195)
	at org.apache.maven.wagon.providers.http.httpclient.impl.execchain.RetryExec.execute(RetryExec.java:86)
	at org.apache.maven.wagon.providers.http.httpclient.impl.execchain.RedirectExec.execute(RedirectExec.java:108)
	at org.apache.maven.wagon.providers.http.httpclient.impl.client.InternalHttpClient.doExecute(InternalHttpClient.java:184)
	at org.apache.maven.wagon.providers.http.httpclient.impl.client.CloseableHttpClient.execute(CloseableHttpClient.java:82)
	at org.apache.maven.wagon.providers.http.AbstractHttpClientWagon.execute(AbstractHttpClientWagon.java:832)
	at org.apache.maven.wagon.providers.http.AbstractHttpClientWagon.fillInputData(AbstractHttpClientWagon.java:983)
	... 57 more
[ERROR] 
[ERROR] Re-run Maven using the -X switch to enable full debug logging.
[ERROR] 
[ERROR] For more information about the errors and possible solutions, please read the following articles:
[ERROR] [Help 1] http://cwiki.apache.org/confluence/display/MAVEN/PluginResolutionException
[JENKINS] Archiving <https://builds.apache.org/job/CarbonData-master/ws/processing/pom.xml> to org.apache.carbondata/carbondata-processing/0.2.0-incubating-SNAPSHOT/carbondata-processing-0.2.0-incubating-SNAPSHOT.pom
[JENKINS] Archiving <https://builds.apache.org/job/CarbonData-master/ws/assembly/pom.xml> to org.apache.carbondata/carbondata-assembly/0.2.0-incubating-SNAPSHOT/carbondata-assembly-0.2.0-incubating-SNAPSHOT.pom
[JENKINS] Archiving <https://builds.apache.org/job/CarbonData-master/ws/pom.xml> to org.apache.carbondata/carbondata-parent/0.2.0-incubating-SNAPSHOT/carbondata-parent-0.2.0-incubating-SNAPSHOT.pom
[JENKINS] Archiving <https://builds.apache.org/job/CarbonData-master/ws/core/pom.xml> to org.apache.carbondata/carbondata-core/0.2.0-incubating-SNAPSHOT/carbondata-core-0.2.0-incubating-SNAPSHOT.pom
[JENKINS] Archiving <https://builds.apache.org/job/CarbonData-master/ws/format/pom.xml> to org.apache.carbondata/carbondata-format/0.2.0-incubating-SNAPSHOT/carbondata-format-0.2.0-incubating-SNAPSHOT.pom
[JENKINS] Archiving <https://builds.apache.org/job/CarbonData-master/ws/hadoop/pom.xml> to org.apache.carbondata/carbondata-hadoop/0.2.0-incubating-SNAPSHOT/carbondata-hadoop-0.2.0-incubating-SNAPSHOT.pom
[JENKINS] Archiving <https://builds.apache.org/job/CarbonData-master/ws/examples/pom.xml> to org.apache.carbondata/carbondata-examples/0.2.0-incubating-SNAPSHOT/carbondata-examples-0.2.0-incubating-SNAPSHOT.pom
[JENKINS] Archiving <https://builds.apache.org/job/CarbonData-master/ws/common/pom.xml> to org.apache.carbondata/carbondata-common/0.2.0-incubating-SNAPSHOT/carbondata-common-0.2.0-incubating-SNAPSHOT.pom
[JENKINS] Archiving <https://builds.apache.org/job/CarbonData-master/ws/integration/spark/pom.xml> to org.apache.carbondata/carbondata-spark/0.2.0-incubating-SNAPSHOT/carbondata-spark-0.2.0-incubating-SNAPSHOT.pom
Sending e-mails to: commits@carbondata.incubator.apache.org
channel stopped

Build failed in Jenkins: CarbonData-master #130

Posted by Apache Jenkins Server <je...@builds.apache.org>.
See <https://builds.apache.org/job/CarbonData-master/130/changes>

Changes:

[jackylk] Add scan_blocklet_num for query statistics

------------------------------------------
Started by an SCM change
[EnvInject] - Loading node environment variables.
Building remotely on ubuntu-2 (Ubuntu yahoo-not-h2 ubuntu docker) in workspace <https://builds.apache.org/job/CarbonData-master/ws/>
 > git rev-parse --is-inside-work-tree # timeout=10
Fetching changes from the remote Git repository
 > git config remote.origin.url https://git-wip-us.apache.org/repos/asf/incubator-carbondata.git # timeout=10
Fetching upstream changes from https://git-wip-us.apache.org/repos/asf/incubator-carbondata.git
 > git --version # timeout=10
 > git -c core.askpass=true fetch --tags --progress https://git-wip-us.apache.org/repos/asf/incubator-carbondata.git +refs/heads/*:refs/remotes/origin/*
 > git rev-parse refs/remotes/origin/master^{commit} # timeout=10
 > git rev-parse refs/remotes/origin/origin/master^{commit} # timeout=10
Checking out Revision 936c73d6b2a0e6e5df70547eb066a9effc0c5062 (refs/remotes/origin/master)
 > git config core.sparsecheckout # timeout=10
 > git checkout -f 936c73d6b2a0e6e5df70547eb066a9effc0c5062
 > git rev-list 5279d5b15bf5d0250d9c26a5a936573778b41de6 # timeout=10
Parsing POMs
Modules changed, recalculating dependency graph
Established TCP socket on 40034
maven32-agent.jar already up to date
maven32-interceptor.jar already up to date
maven3-interceptor-commons.jar already up to date
[CarbonData-master] $ /home/jenkins/tools/java/latest1.8/bin/java -Xmx2g -Xms256m -XX:MaxPermSize=512m -cp /home/jenkins/jenkins-slave/maven32-agent.jar:/home/jenkins/tools/maven/apache-maven-3.3.3/boot/plexus-classworlds-2.5.2.jar:/home/jenkins/tools/maven/apache-maven-3.3.3/conf/logging jenkins.maven3.agent.Maven32Main /home/jenkins/tools/maven/apache-maven-3.3.3 /home/jenkins/jenkins-slave/slave.jar /home/jenkins/jenkins-slave/maven32-interceptor.jar /home/jenkins/jenkins-slave/maven3-interceptor-commons.jar 40034
Java HotSpot(TM) 64-Bit Server VM warning: ignoring option MaxPermSize=512m; support was removed in 8.0
<===[JENKINS REMOTING CAPACITY]===>   channel started
Executing Maven:  -B -f <https://builds.apache.org/job/CarbonData-master/ws/pom.xml> -Dmaven.repo.local=/home/jenkins/jenkins-slave/maven-repositories/0 -B -e clean package
[INFO] Error stacktraces are turned on.
[INFO] Scanning for projects...
[INFO] ------------------------------------------------------------------------
[INFO] Reactor Build Order:
[INFO] 
[INFO] Apache CarbonData :: Parent
[INFO] Apache CarbonData :: Common
[INFO] Apache CarbonData :: Format
[INFO] Apache CarbonData :: Core
[INFO] Apache CarbonData :: Processing
[INFO] Apache CarbonData :: Hadoop
[INFO] Apache CarbonData :: Spark
[INFO] Apache CarbonData :: Assembly
[INFO] Apache CarbonData :: Examples
[INFO]                                                                         
[INFO] ------------------------------------------------------------------------
[INFO] Building Apache CarbonData :: Parent 0.2.0-incubating-SNAPSHOT
[INFO] ------------------------------------------------------------------------
[INFO] 
[INFO] --- maven-clean-plugin:2.5:clean (default-clean) @ carbondata-parent ---
[INFO] Deleting <https://builds.apache.org/job/CarbonData-master/ws/target>
[INFO] 
[INFO] --- maven-remote-resources-plugin:1.5:process (default) @ carbondata-parent ---
[INFO] 
[INFO] --- maven-site-plugin:3.4:attach-descriptor (attach-descriptor) @ carbondata-parent ---
[INFO]                                                                         
[INFO] ------------------------------------------------------------------------
[INFO] Building Apache CarbonData :: Common 0.2.0-incubating-SNAPSHOT
[INFO] ------------------------------------------------------------------------
[INFO] 
[INFO] --- maven-clean-plugin:2.5:clean (default-clean) @ carbondata-common ---
[INFO] Deleting <https://builds.apache.org/job/CarbonData-master/ws/common/target>
[INFO] 
[INFO] --- maven-remote-resources-plugin:1.5:process (default) @ carbondata-common ---
[INFO] 
[INFO] --- maven-resources-plugin:2.7:resources (default-resources) @ carbondata-common ---
[INFO] Using 'UTF-8' encoding to copy filtered resources.
[INFO] skip non existing resourceDirectory <https://builds.apache.org/job/CarbonData-master/ws/common/src/main/resources>
[INFO] Copying 3 resources
[INFO] 
[INFO] --- maven-compiler-plugin:3.2:compile (default-compile) @ carbondata-common ---
[INFO] Changes detected - recompiling the module!
[INFO] Compiling 9 source files to <https://builds.apache.org/job/CarbonData-master/ws/common/target/classes>
[INFO] 
[INFO] --- maven-resources-plugin:2.7:testResources (default-testResources) @ carbondata-common ---
[INFO] Using 'UTF-8' encoding to copy filtered resources.
[INFO] skip non existing resourceDirectory <https://builds.apache.org/job/CarbonData-master/ws/common/src/test/resources>
[INFO] Copying 3 resources
[INFO] 
[INFO] --- maven-compiler-plugin:3.2:testCompile (default-testCompile) @ carbondata-common ---
[INFO] Changes detected - recompiling the module!
[INFO] Compiling 7 source files to <https://builds.apache.org/job/CarbonData-master/ws/common/target/test-classes>
[INFO] <https://builds.apache.org/job/CarbonData-master/ws/common/src/test/java/org/apache/carbondata/common/logging/impl/AuditExtendedRollingFileAppenderTest_UT.java>: Some input files use or override a deprecated API.
[INFO] <https://builds.apache.org/job/CarbonData-master/ws/common/src/test/java/org/apache/carbondata/common/logging/impl/AuditExtendedRollingFileAppenderTest_UT.java>: Recompile with -Xlint:deprecation for details.
[INFO] 
[INFO] --- maven-surefire-plugin:2.18.1:test (default-test) @ carbondata-common ---
[JENKINS] Recording test results
[INFO] 
[INFO] --- maven-jar-plugin:2.5:jar (default-jar) @ carbondata-common ---
[INFO] Building jar: <https://builds.apache.org/job/CarbonData-master/ws/common/target/carbondata-common-0.2.0-incubating-SNAPSHOT.jar>
[INFO] 
[INFO] --- maven-site-plugin:3.4:attach-descriptor (attach-descriptor) @ carbondata-common ---
[INFO]                                                                         
[INFO] ------------------------------------------------------------------------
[INFO] Building Apache CarbonData :: Format 0.2.0-incubating-SNAPSHOT
[INFO] ------------------------------------------------------------------------
[INFO] 
[INFO] --- maven-clean-plugin:2.5:clean (default-clean) @ carbondata-format ---
[INFO] Deleting <https://builds.apache.org/job/CarbonData-master/ws/format/target>
[INFO] 
[INFO] --- maven-thrift-plugin:0.1.11:compile (generate-thrift-java) @ carbondata-format ---
[ERROR] thrift failed output: 
[ERROR] thrift failed error: /bin/sh: 1: thrift: not found

[INFO] ------------------------------------------------------------------------
[INFO] Reactor Summary:
[INFO] 
[INFO] Apache CarbonData :: Parent ........................ SUCCESS [  2.238 s]
[INFO] Apache CarbonData :: Common ........................ SUCCESS [  4.866 s]
[INFO] Apache CarbonData :: Format ........................ FAILURE [  0.832 s]
[INFO] Apache CarbonData :: Core .......................... SKIPPED
[INFO] Apache CarbonData :: Processing .................... SKIPPED
[INFO] Apache CarbonData :: Hadoop ........................ SKIPPED
[INFO] Apache CarbonData :: Spark ......................... SKIPPED
[INFO] Apache CarbonData :: Assembly ...................... SKIPPED
[INFO] Apache CarbonData :: Examples ...................... SKIPPED
[INFO] ------------------------------------------------------------------------
[INFO] BUILD FAILURE
[INFO] ------------------------------------------------------------------------
[INFO] Total time: 11.238 s
[INFO] Finished at: 2016-10-21T10:23:04+00:00
[INFO] Final Memory: 34M/350M
[INFO] ------------------------------------------------------------------------
Waiting for Jenkins to finish collecting data
[ERROR] Failed to execute goal org.apache.thrift.tools:maven-thrift-plugin:0.1.11:compile (generate-thrift-java) on project carbondata-format: thrift did not exit cleanly. Review output for more information. -> [Help 1]
org.apache.maven.lifecycle.LifecycleExecutionException: Failed to execute goal org.apache.thrift.tools:maven-thrift-plugin:0.1.11:compile (generate-thrift-java) on project carbondata-format: thrift did not exit cleanly. Review output for more information.
	at org.apache.maven.lifecycle.internal.MojoExecutor.execute(MojoExecutor.java:212)
	at org.apache.maven.lifecycle.internal.MojoExecutor.execute(MojoExecutor.java:153)
	at org.apache.maven.lifecycle.internal.MojoExecutor.execute(MojoExecutor.java:145)
	at org.apache.maven.lifecycle.internal.LifecycleModuleBuilder.buildProject(LifecycleModuleBuilder.java:116)
	at org.apache.maven.lifecycle.internal.LifecycleModuleBuilder.buildProject(LifecycleModuleBuilder.java:80)
	at org.apache.maven.lifecycle.internal.builder.singlethreaded.SingleThreadedBuilder.build(SingleThreadedBuilder.java:51)
	at org.apache.maven.lifecycle.internal.LifecycleStarter.execute(LifecycleStarter.java:128)
	at org.apache.maven.DefaultMaven.doExecute(DefaultMaven.java:307)
	at org.apache.maven.DefaultMaven.doExecute(DefaultMaven.java:193)
	at org.apache.maven.DefaultMaven.execute(DefaultMaven.java:106)
	at org.jvnet.hudson.maven3.launcher.Maven32Launcher.main(Maven32Launcher.java:132)
	at sun.reflect.NativeMethodAccessorImpl.invoke0(Native Method)
	at sun.reflect.NativeMethodAccessorImpl.invoke(NativeMethodAccessorImpl.java:62)
	at sun.reflect.DelegatingMethodAccessorImpl.invoke(DelegatingMethodAccessorImpl.java:43)
	at java.lang.reflect.Method.invoke(Method.java:498)
	at org.codehaus.plexus.classworlds.launcher.Launcher.launchStandard(Launcher.java:330)
	at org.codehaus.plexus.classworlds.launcher.Launcher.launch(Launcher.java:238)
	at jenkins.maven3.agent.Maven32Main.launch(Maven32Main.java:186)
	at sun.reflect.NativeMethodAccessorImpl.invoke0(Native Method)
	at sun.reflect.NativeMethodAccessorImpl.invoke(NativeMethodAccessorImpl.java:62)
	at sun.reflect.DelegatingMethodAccessorImpl.invoke(DelegatingMethodAccessorImpl.java:43)
	at java.lang.reflect.Method.invoke(Method.java:498)
	at hudson.maven.Maven3Builder.call(Maven3Builder.java:136)
	at hudson.maven.Maven3Builder.call(Maven3Builder.java:71)
	at hudson.remoting.UserRequest.perform(UserRequest.java:153)
	at hudson.remoting.UserRequest.perform(UserRequest.java:50)
	at hudson.remoting.Request$2.run(Request.java:332)
	at hudson.remoting.InterceptingExecutorService$1.call(InterceptingExecutorService.java:68)
	at java.util.concurrent.FutureTask.run(FutureTask.java:266)
	at java.util.concurrent.ThreadPoolExecutor.runWorker(ThreadPoolExecutor.java:1142)
	at java.util.concurrent.ThreadPoolExecutor$Worker.run(ThreadPoolExecutor.java:617)
	at java.lang.Thread.run(Thread.java:745)
Caused by: org.apache.maven.plugin.MojoFailureException: thrift did not exit cleanly. Review output for more information.
	at org.apache.thrift.maven.AbstractThriftMojo.execute(AbstractThriftMojo.java:177)
	at org.apache.thrift.maven.ThriftCompileMojo.execute(ThriftCompileMojo.java:21)
	at org.apache.maven.plugin.DefaultBuildPluginManager.executeMojo(DefaultBuildPluginManager.java:134)
	at org.apache.maven.lifecycle.internal.MojoExecutor.execute(MojoExecutor.java:208)
	... 31 more
[ERROR] 
[ERROR] Re-run Maven using the -X switch to enable full debug logging.
[ERROR] 
[ERROR] For more information about the errors and possible solutions, please read the following articles:
[ERROR] [Help 1] http://cwiki.apache.org/confluence/display/MAVEN/MojoFailureException
[ERROR] 
[ERROR] After correcting the problems, you can resume the build with the command
[ERROR]   mvn <goals> -rf :carbondata-format
[JENKINS] Archiving <https://builds.apache.org/job/CarbonData-master/ws/processing/pom.xml> to org.apache.carbondata/carbondata-processing/0.2.0-incubating-SNAPSHOT/carbondata-processing-0.2.0-incubating-SNAPSHOT.pom
[JENKINS] Archiving <https://builds.apache.org/job/CarbonData-master/ws/assembly/pom.xml> to org.apache.carbondata/carbondata-assembly/0.2.0-incubating-SNAPSHOT/carbondata-assembly-0.2.0-incubating-SNAPSHOT.pom
[JENKINS] Archiving <https://builds.apache.org/job/CarbonData-master/ws/pom.xml> to org.apache.carbondata/carbondata-parent/0.2.0-incubating-SNAPSHOT/carbondata-parent-0.2.0-incubating-SNAPSHOT.pom
[JENKINS] Archiving <https://builds.apache.org/job/CarbonData-master/ws/core/pom.xml> to org.apache.carbondata/carbondata-core/0.2.0-incubating-SNAPSHOT/carbondata-core-0.2.0-incubating-SNAPSHOT.pom
[JENKINS] Archiving <https://builds.apache.org/job/CarbonData-master/ws/format/pom.xml> to org.apache.carbondata/carbondata-format/0.2.0-incubating-SNAPSHOT/carbondata-format-0.2.0-incubating-SNAPSHOT.pom
[JENKINS] Archiving <https://builds.apache.org/job/CarbonData-master/ws/hadoop/pom.xml> to org.apache.carbondata/carbondata-hadoop/0.2.0-incubating-SNAPSHOT/carbondata-hadoop-0.2.0-incubating-SNAPSHOT.pom
[JENKINS] Archiving <https://builds.apache.org/job/CarbonData-master/ws/examples/pom.xml> to org.apache.carbondata/carbondata-examples/0.2.0-incubating-SNAPSHOT/carbondata-examples-0.2.0-incubating-SNAPSHOT.pom
[JENKINS] Archiving <https://builds.apache.org/job/CarbonData-master/ws/common/pom.xml> to org.apache.carbondata/carbondata-common/0.2.0-incubating-SNAPSHOT/carbondata-common-0.2.0-incubating-SNAPSHOT.pom
[JENKINS] Archiving <https://builds.apache.org/job/CarbonData-master/ws/common/target/carbondata-common-0.2.0-incubating-SNAPSHOT.jar> to org.apache.carbondata/carbondata-common/0.2.0-incubating-SNAPSHOT/carbondata-common-0.2.0-incubating-SNAPSHOT.jar
[JENKINS] Archiving <https://builds.apache.org/job/CarbonData-master/ws/integration/spark/pom.xml> to org.apache.carbondata/carbondata-spark/0.2.0-incubating-SNAPSHOT/carbondata-spark-0.2.0-incubating-SNAPSHOT.pom
Sending e-mails to: commits@carbondata.incubator.apache.org
channel stopped

Build failed in Jenkins: CarbonData-master #129

Posted by Apache Jenkins Server <je...@builds.apache.org>.
See <https://builds.apache.org/job/CarbonData-master/129/changes>

Changes:

[vimaldas] add codec and testcase

------------------------------------------
Started by an SCM change
[EnvInject] - Loading node environment variables.
Building remotely on ubuntu-2 (Ubuntu yahoo-not-h2 ubuntu docker) in workspace <https://builds.apache.org/job/CarbonData-master/ws/>
 > git rev-parse --is-inside-work-tree # timeout=10
Fetching changes from the remote Git repository
 > git config remote.origin.url https://git-wip-us.apache.org/repos/asf/incubator-carbondata.git # timeout=10
Fetching upstream changes from https://git-wip-us.apache.org/repos/asf/incubator-carbondata.git
 > git --version # timeout=10
 > git -c core.askpass=true fetch --tags --progress https://git-wip-us.apache.org/repos/asf/incubator-carbondata.git +refs/heads/*:refs/remotes/origin/*
 > git rev-parse refs/remotes/origin/master^{commit} # timeout=10
 > git rev-parse refs/remotes/origin/origin/master^{commit} # timeout=10
Checking out Revision 5279d5b15bf5d0250d9c26a5a936573778b41de6 (refs/remotes/origin/master)
 > git config core.sparsecheckout # timeout=10
 > git checkout -f 5279d5b15bf5d0250d9c26a5a936573778b41de6
 > git rev-list a473f553e8050372d5fc0b0a808cba43abe348d2 # timeout=10
Parsing POMs
Modules changed, recalculating dependency graph
Established TCP socket on 32975
maven32-agent.jar already up to date
maven32-interceptor.jar already up to date
maven3-interceptor-commons.jar already up to date
[CarbonData-master] $ /home/jenkins/tools/java/latest1.8/bin/java -Xmx2g -Xms256m -XX:MaxPermSize=512m -cp /home/jenkins/jenkins-slave/maven32-agent.jar:/home/jenkins/tools/maven/apache-maven-3.3.3/boot/plexus-classworlds-2.5.2.jar:/home/jenkins/tools/maven/apache-maven-3.3.3/conf/logging jenkins.maven3.agent.Maven32Main /home/jenkins/tools/maven/apache-maven-3.3.3 /home/jenkins/jenkins-slave/slave.jar /home/jenkins/jenkins-slave/maven32-interceptor.jar /home/jenkins/jenkins-slave/maven3-interceptor-commons.jar 32975
Java HotSpot(TM) 64-Bit Server VM warning: ignoring option MaxPermSize=512m; support was removed in 8.0
<===[JENKINS REMOTING CAPACITY]===>   channel started
Executing Maven:  -B -f <https://builds.apache.org/job/CarbonData-master/ws/pom.xml> -Dmaven.repo.local=/home/jenkins/jenkins-slave/maven-repositories/0 -B -e clean package
[INFO] Error stacktraces are turned on.
[INFO] Scanning for projects...
[INFO] ------------------------------------------------------------------------
[INFO] Reactor Build Order:
[INFO] 
[INFO] Apache CarbonData :: Parent
[INFO] Apache CarbonData :: Common
[INFO] Apache CarbonData :: Format
[INFO] Apache CarbonData :: Core
[INFO] Apache CarbonData :: Processing
[INFO] Apache CarbonData :: Hadoop
[INFO] Apache CarbonData :: Spark
[INFO] Apache CarbonData :: Assembly
[INFO] Apache CarbonData :: Examples
[INFO]                                                                         
[INFO] ------------------------------------------------------------------------
[INFO] Building Apache CarbonData :: Parent 0.2.0-incubating-SNAPSHOT
[INFO] ------------------------------------------------------------------------
[INFO] 
[INFO] --- maven-clean-plugin:2.5:clean (default-clean) @ carbondata-parent ---
[INFO] Deleting <https://builds.apache.org/job/CarbonData-master/ws/target>
[INFO] 
[INFO] --- maven-remote-resources-plugin:1.5:process (default) @ carbondata-parent ---
[INFO] 
[INFO] --- maven-site-plugin:3.4:attach-descriptor (attach-descriptor) @ carbondata-parent ---
[INFO]                                                                         
[INFO] ------------------------------------------------------------------------
[INFO] Building Apache CarbonData :: Common 0.2.0-incubating-SNAPSHOT
[INFO] ------------------------------------------------------------------------
[INFO] 
[INFO] --- maven-clean-plugin:2.5:clean (default-clean) @ carbondata-common ---
[INFO] Deleting <https://builds.apache.org/job/CarbonData-master/ws/common/target>
[INFO] 
[INFO] --- maven-remote-resources-plugin:1.5:process (default) @ carbondata-common ---
[INFO] 
[INFO] --- maven-resources-plugin:2.7:resources (default-resources) @ carbondata-common ---
[INFO] Using 'UTF-8' encoding to copy filtered resources.
[INFO] skip non existing resourceDirectory <https://builds.apache.org/job/CarbonData-master/ws/common/src/main/resources>
[INFO] Copying 3 resources
[INFO] 
[INFO] --- maven-compiler-plugin:3.2:compile (default-compile) @ carbondata-common ---
[INFO] Changes detected - recompiling the module!
[INFO] Compiling 9 source files to <https://builds.apache.org/job/CarbonData-master/ws/common/target/classes>
[INFO] 
[INFO] --- maven-resources-plugin:2.7:testResources (default-testResources) @ carbondata-common ---
[INFO] Using 'UTF-8' encoding to copy filtered resources.
[INFO] skip non existing resourceDirectory <https://builds.apache.org/job/CarbonData-master/ws/common/src/test/resources>
[INFO] Copying 3 resources
[INFO] 
[INFO] --- maven-compiler-plugin:3.2:testCompile (default-testCompile) @ carbondata-common ---
[INFO] Changes detected - recompiling the module!
[INFO] Compiling 7 source files to <https://builds.apache.org/job/CarbonData-master/ws/common/target/test-classes>
[INFO] <https://builds.apache.org/job/CarbonData-master/ws/common/src/test/java/org/apache/carbondata/common/logging/impl/AuditExtendedRollingFileAppenderTest_UT.java>: Some input files use or override a deprecated API.
[INFO] <https://builds.apache.org/job/CarbonData-master/ws/common/src/test/java/org/apache/carbondata/common/logging/impl/AuditExtendedRollingFileAppenderTest_UT.java>: Recompile with -Xlint:deprecation for details.
[INFO] 
[INFO] --- maven-surefire-plugin:2.18.1:test (default-test) @ carbondata-common ---
[JENKINS] Recording test results
[INFO] 
[INFO] --- maven-jar-plugin:2.5:jar (default-jar) @ carbondata-common ---
[INFO] Building jar: <https://builds.apache.org/job/CarbonData-master/ws/common/target/carbondata-common-0.2.0-incubating-SNAPSHOT.jar>
[INFO] 
[INFO] --- maven-site-plugin:3.4:attach-descriptor (attach-descriptor) @ carbondata-common ---
[INFO]                                                                         
[INFO] ------------------------------------------------------------------------
[INFO] Building Apache CarbonData :: Format 0.2.0-incubating-SNAPSHOT
[INFO] ------------------------------------------------------------------------
[INFO] 
[INFO] --- maven-clean-plugin:2.5:clean (default-clean) @ carbondata-format ---
[INFO] Deleting <https://builds.apache.org/job/CarbonData-master/ws/format/target>
[INFO] 
[INFO] --- maven-thrift-plugin:0.1.11:compile (generate-thrift-java) @ carbondata-format ---
[ERROR] thrift failed output: 
[ERROR] thrift failed error: /bin/sh: 1: thrift: not found

[INFO] ------------------------------------------------------------------------
[INFO] Reactor Summary:
[INFO] 
[INFO] Apache CarbonData :: Parent ........................ SUCCESS [ 12.168 s]
[INFO] Apache CarbonData :: Common ........................ SUCCESS [ 23.297 s]
[INFO] Apache CarbonData :: Format ........................ FAILURE [  6.761 s]
[INFO] Apache CarbonData :: Core .......................... SKIPPED
[INFO] Apache CarbonData :: Processing .................... SKIPPED
[INFO] Apache CarbonData :: Hadoop ........................ SKIPPED
[INFO] Apache CarbonData :: Spark ......................... SKIPPED
[INFO] Apache CarbonData :: Assembly ...................... SKIPPED
[INFO] Apache CarbonData :: Examples ...................... SKIPPED
[INFO] ------------------------------------------------------------------------
[INFO] BUILD FAILURE
[INFO] ------------------------------------------------------------------------
[INFO] Total time: 49.218 s
[INFO] Finished at: 2016-10-19T06:10:45+00:00
[INFO] Final Memory: 32M/299M
[INFO] ------------------------------------------------------------------------
Waiting for Jenkins to finish collecting data
[ERROR] Failed to execute goal org.apache.thrift.tools:maven-thrift-plugin:0.1.11:compile (generate-thrift-java) on project carbondata-format: thrift did not exit cleanly. Review output for more information. -> [Help 1]
org.apache.maven.lifecycle.LifecycleExecutionException: Failed to execute goal org.apache.thrift.tools:maven-thrift-plugin:0.1.11:compile (generate-thrift-java) on project carbondata-format: thrift did not exit cleanly. Review output for more information.
	at org.apache.maven.lifecycle.internal.MojoExecutor.execute(MojoExecutor.java:212)
	at org.apache.maven.lifecycle.internal.MojoExecutor.execute(MojoExecutor.java:153)
	at org.apache.maven.lifecycle.internal.MojoExecutor.execute(MojoExecutor.java:145)
	at org.apache.maven.lifecycle.internal.LifecycleModuleBuilder.buildProject(LifecycleModuleBuilder.java:116)
	at org.apache.maven.lifecycle.internal.LifecycleModuleBuilder.buildProject(LifecycleModuleBuilder.java:80)
	at org.apache.maven.lifecycle.internal.builder.singlethreaded.SingleThreadedBuilder.build(SingleThreadedBuilder.java:51)
	at org.apache.maven.lifecycle.internal.LifecycleStarter.execute(LifecycleStarter.java:128)
	at org.apache.maven.DefaultMaven.doExecute(DefaultMaven.java:307)
	at org.apache.maven.DefaultMaven.doExecute(DefaultMaven.java:193)
	at org.apache.maven.DefaultMaven.execute(DefaultMaven.java:106)
	at org.jvnet.hudson.maven3.launcher.Maven32Launcher.main(Maven32Launcher.java:132)
	at sun.reflect.NativeMethodAccessorImpl.invoke0(Native Method)
	at sun.reflect.NativeMethodAccessorImpl.invoke(NativeMethodAccessorImpl.java:62)
	at sun.reflect.DelegatingMethodAccessorImpl.invoke(DelegatingMethodAccessorImpl.java:43)
	at java.lang.reflect.Method.invoke(Method.java:498)
	at org.codehaus.plexus.classworlds.launcher.Launcher.launchStandard(Launcher.java:330)
	at org.codehaus.plexus.classworlds.launcher.Launcher.launch(Launcher.java:238)
	at jenkins.maven3.agent.Maven32Main.launch(Maven32Main.java:186)
	at sun.reflect.NativeMethodAccessorImpl.invoke0(Native Method)
	at sun.reflect.NativeMethodAccessorImpl.invoke(NativeMethodAccessorImpl.java:62)
	at sun.reflect.DelegatingMethodAccessorImpl.invoke(DelegatingMethodAccessorImpl.java:43)
	at java.lang.reflect.Method.invoke(Method.java:498)
	at hudson.maven.Maven3Builder.call(Maven3Builder.java:136)
	at hudson.maven.Maven3Builder.call(Maven3Builder.java:71)
	at hudson.remoting.UserRequest.perform(UserRequest.java:153)
	at hudson.remoting.UserRequest.perform(UserRequest.java:50)
	at hudson.remoting.Request$2.run(Request.java:332)
	at hudson.remoting.InterceptingExecutorService$1.call(InterceptingExecutorService.java:68)
	at java.util.concurrent.FutureTask.run(FutureTask.java:266)
	at java.util.concurrent.ThreadPoolExecutor.runWorker(ThreadPoolExecutor.java:1142)
	at java.util.concurrent.ThreadPoolExecutor$Worker.run(ThreadPoolExecutor.java:617)
	at java.lang.Thread.run(Thread.java:745)
Caused by: org.apache.maven.plugin.MojoFailureException: thrift did not exit cleanly. Review output for more information.
	at org.apache.thrift.maven.AbstractThriftMojo.execute(AbstractThriftMojo.java:177)
	at org.apache.thrift.maven.ThriftCompileMojo.execute(ThriftCompileMojo.java:21)
	at org.apache.maven.plugin.DefaultBuildPluginManager.executeMojo(DefaultBuildPluginManager.java:134)
	at org.apache.maven.lifecycle.internal.MojoExecutor.execute(MojoExecutor.java:208)
	... 31 more
[ERROR] 
[ERROR] Re-run Maven using the -X switch to enable full debug logging.
[ERROR] 
[ERROR] For more information about the errors and possible solutions, please read the following articles:
[ERROR] [Help 1] http://cwiki.apache.org/confluence/display/MAVEN/MojoFailureException
[ERROR] 
[ERROR] After correcting the problems, you can resume the build with the command
[ERROR]   mvn <goals> -rf :carbondata-format
[JENKINS] Archiving <https://builds.apache.org/job/CarbonData-master/ws/processing/pom.xml> to org.apache.carbondata/carbondata-processing/0.2.0-incubating-SNAPSHOT/carbondata-processing-0.2.0-incubating-SNAPSHOT.pom
[JENKINS] Archiving <https://builds.apache.org/job/CarbonData-master/ws/assembly/pom.xml> to org.apache.carbondata/carbondata-assembly/0.2.0-incubating-SNAPSHOT/carbondata-assembly-0.2.0-incubating-SNAPSHOT.pom
[JENKINS] Archiving <https://builds.apache.org/job/CarbonData-master/ws/pom.xml> to org.apache.carbondata/carbondata-parent/0.2.0-incubating-SNAPSHOT/carbondata-parent-0.2.0-incubating-SNAPSHOT.pom
[JENKINS] Archiving <https://builds.apache.org/job/CarbonData-master/ws/core/pom.xml> to org.apache.carbondata/carbondata-core/0.2.0-incubating-SNAPSHOT/carbondata-core-0.2.0-incubating-SNAPSHOT.pom
[JENKINS] Archiving <https://builds.apache.org/job/CarbonData-master/ws/format/pom.xml> to org.apache.carbondata/carbondata-format/0.2.0-incubating-SNAPSHOT/carbondata-format-0.2.0-incubating-SNAPSHOT.pom
[JENKINS] Archiving <https://builds.apache.org/job/CarbonData-master/ws/hadoop/pom.xml> to org.apache.carbondata/carbondata-hadoop/0.2.0-incubating-SNAPSHOT/carbondata-hadoop-0.2.0-incubating-SNAPSHOT.pom
[JENKINS] Archiving <https://builds.apache.org/job/CarbonData-master/ws/examples/pom.xml> to org.apache.carbondata/carbondata-examples/0.2.0-incubating-SNAPSHOT/carbondata-examples-0.2.0-incubating-SNAPSHOT.pom
[JENKINS] Archiving <https://builds.apache.org/job/CarbonData-master/ws/common/pom.xml> to org.apache.carbondata/carbondata-common/0.2.0-incubating-SNAPSHOT/carbondata-common-0.2.0-incubating-SNAPSHOT.pom
[JENKINS] Archiving <https://builds.apache.org/job/CarbonData-master/ws/common/target/carbondata-common-0.2.0-incubating-SNAPSHOT.jar> to org.apache.carbondata/carbondata-common/0.2.0-incubating-SNAPSHOT/carbondata-common-0.2.0-incubating-SNAPSHOT.jar
[JENKINS] Archiving <https://builds.apache.org/job/CarbonData-master/ws/integration/spark/pom.xml> to org.apache.carbondata/carbondata-spark/0.2.0-incubating-SNAPSHOT/carbondata-spark-0.2.0-incubating-SNAPSHOT.pom
Sending e-mails to: commits@carbondata.incubator.apache.org
channel stopped

Build failed in Jenkins: CarbonData-master #128

Posted by Apache Jenkins Server <je...@builds.apache.org>.
See <https://builds.apache.org/job/CarbonData-master/128/changes>

Changes:

[ramana.gollamudi] [CARBONDATA-320] if drop table when the datanodes are down, hive

[ramana.gollamudi] [CARBONDATA-319] Bad Records logging for column data type is not proper

[ramana.gollamudi] [CARBONDATA-317] - CSV having only space char is throwing

------------------------------------------
Started by an SCM change
[EnvInject] - Loading node environment variables.
Building remotely on ubuntu-eu2 (Ubuntu ubuntu ubuntu-eu docker) in workspace <https://builds.apache.org/job/CarbonData-master/ws/>
 > git rev-parse --is-inside-work-tree # timeout=10
Fetching changes from the remote Git repository
 > git config remote.origin.url https://git-wip-us.apache.org/repos/asf/incubator-carbondata.git # timeout=10
Fetching upstream changes from https://git-wip-us.apache.org/repos/asf/incubator-carbondata.git
 > git --version # timeout=10
 > git -c core.askpass=true fetch --tags --progress https://git-wip-us.apache.org/repos/asf/incubator-carbondata.git +refs/heads/*:refs/remotes/origin/*
 > git rev-parse refs/remotes/origin/master^{commit} # timeout=10
 > git rev-parse refs/remotes/origin/origin/master^{commit} # timeout=10
Checking out Revision a473f553e8050372d5fc0b0a808cba43abe348d2 (refs/remotes/origin/master)
 > git config core.sparsecheckout # timeout=10
 > git checkout -f a473f553e8050372d5fc0b0a808cba43abe348d2
 > git rev-list c693001eff95564af721e25c583b99bcec7a2439 # timeout=10
Parsing POMs
Modules changed, recalculating dependency graph
Established TCP socket on 53195
maven32-agent.jar already up to date
maven32-interceptor.jar already up to date
maven3-interceptor-commons.jar already up to date
[CarbonData-master] $ /home/jenkins/tools/java/latest1.8/bin/java -Xmx2g -Xms256m -XX:MaxPermSize=512m -cp /home/jenkins/jenkins-slave/maven32-agent.jar:/home/jenkins/tools/maven/apache-maven-3.3.3/boot/plexus-classworlds-2.5.2.jar:/home/jenkins/tools/maven/apache-maven-3.3.3/conf/logging jenkins.maven3.agent.Maven32Main /home/jenkins/tools/maven/apache-maven-3.3.3 /home/jenkins/jenkins-slave/slave.jar /home/jenkins/jenkins-slave/maven32-interceptor.jar /home/jenkins/jenkins-slave/maven3-interceptor-commons.jar 53195
Java HotSpot(TM) 64-Bit Server VM warning: ignoring option MaxPermSize=512m; support was removed in 8.0
<===[JENKINS REMOTING CAPACITY]===>   channel started
Executing Maven:  -B -f <https://builds.apache.org/job/CarbonData-master/ws/pom.xml> -Dmaven.repo.local=/home/jenkins/jenkins-slave/maven-repositories/0 -B -e clean package
[INFO] Error stacktraces are turned on.
[INFO] Scanning for projects...
[INFO] ------------------------------------------------------------------------
[INFO] Reactor Build Order:
[INFO] 
[INFO] Apache CarbonData :: Parent
[INFO] Apache CarbonData :: Common
[INFO] Apache CarbonData :: Format
[INFO] Apache CarbonData :: Core
[INFO] Apache CarbonData :: Processing
[INFO] Apache CarbonData :: Hadoop
[INFO] Apache CarbonData :: Spark
[INFO] Apache CarbonData :: Assembly
[INFO] Apache CarbonData :: Examples
[INFO]                                                                         
[INFO] ------------------------------------------------------------------------
[INFO] Building Apache CarbonData :: Parent 0.2.0-incubating-SNAPSHOT
[INFO] ------------------------------------------------------------------------
[INFO] 
[INFO] --- maven-clean-plugin:2.5:clean (default-clean) @ carbondata-parent ---
[INFO] Deleting <https://builds.apache.org/job/CarbonData-master/ws/target>
[INFO] 
[INFO] --- maven-remote-resources-plugin:1.5:process (default) @ carbondata-parent ---
[INFO] 
[INFO] --- maven-site-plugin:3.4:attach-descriptor (attach-descriptor) @ carbondata-parent ---
[INFO]                                                                         
[INFO] ------------------------------------------------------------------------
[INFO] Building Apache CarbonData :: Common 0.2.0-incubating-SNAPSHOT
[INFO] ------------------------------------------------------------------------
[INFO] 
[INFO] --- maven-clean-plugin:2.5:clean (default-clean) @ carbondata-common ---
[INFO] Deleting <https://builds.apache.org/job/CarbonData-master/ws/common/target>
[INFO] 
[INFO] --- maven-remote-resources-plugin:1.5:process (default) @ carbondata-common ---
[INFO] 
[INFO] --- maven-resources-plugin:2.7:resources (default-resources) @ carbondata-common ---
[INFO] Using 'UTF-8' encoding to copy filtered resources.
[INFO] skip non existing resourceDirectory <https://builds.apache.org/job/CarbonData-master/ws/common/src/main/resources>
[INFO] Copying 3 resources
[INFO] 
[INFO] --- maven-compiler-plugin:3.2:compile (default-compile) @ carbondata-common ---
[INFO] Changes detected - recompiling the module!
[INFO] Compiling 9 source files to <https://builds.apache.org/job/CarbonData-master/ws/common/target/classes>
[INFO] 
[INFO] --- maven-resources-plugin:2.7:testResources (default-testResources) @ carbondata-common ---
[INFO] Using 'UTF-8' encoding to copy filtered resources.
[INFO] skip non existing resourceDirectory <https://builds.apache.org/job/CarbonData-master/ws/common/src/test/resources>
[INFO] Copying 3 resources
[INFO] 
[INFO] --- maven-compiler-plugin:3.2:testCompile (default-testCompile) @ carbondata-common ---
[INFO] Changes detected - recompiling the module!
[INFO] Compiling 7 source files to <https://builds.apache.org/job/CarbonData-master/ws/common/target/test-classes>
[INFO] <https://builds.apache.org/job/CarbonData-master/ws/common/src/test/java/org/apache/carbondata/common/logging/impl/AuditExtendedRollingFileAppenderTest_UT.java>: Some input files use or override a deprecated API.
[INFO] <https://builds.apache.org/job/CarbonData-master/ws/common/src/test/java/org/apache/carbondata/common/logging/impl/AuditExtendedRollingFileAppenderTest_UT.java>: Recompile with -Xlint:deprecation for details.
[INFO] 
[INFO] --- maven-surefire-plugin:2.18.1:test (default-test) @ carbondata-common ---
[JENKINS] Recording test results
[INFO] 
[INFO] --- maven-jar-plugin:2.5:jar (default-jar) @ carbondata-common ---
[INFO] Building jar: <https://builds.apache.org/job/CarbonData-master/ws/common/target/carbondata-common-0.2.0-incubating-SNAPSHOT.jar>
[INFO] 
[INFO] --- maven-site-plugin:3.4:attach-descriptor (attach-descriptor) @ carbondata-common ---
[INFO]                                                                         
[INFO] ------------------------------------------------------------------------
[INFO] Building Apache CarbonData :: Format 0.2.0-incubating-SNAPSHOT
[INFO] ------------------------------------------------------------------------
[INFO] 
[INFO] --- maven-clean-plugin:2.5:clean (default-clean) @ carbondata-format ---
[INFO] Deleting <https://builds.apache.org/job/CarbonData-master/ws/format/target>
[INFO] 
[INFO] --- maven-thrift-plugin:0.1.11:compile (generate-thrift-java) @ carbondata-format ---
[ERROR] thrift failed output: 
[ERROR] thrift failed error: /bin/sh: 1: thrift: not found

[INFO] ------------------------------------------------------------------------
[INFO] Reactor Summary:
[INFO] 
[INFO] Apache CarbonData :: Parent ........................ SUCCESS [ 10.057 s]
[INFO] Apache CarbonData :: Common ........................ SUCCESS [ 13.345 s]
[INFO] Apache CarbonData :: Format ........................ FAILURE [  2.243 s]
[INFO] Apache CarbonData :: Core .......................... SKIPPED
[INFO] Apache CarbonData :: Processing .................... SKIPPED
[INFO] Apache CarbonData :: Hadoop ........................ SKIPPED
[INFO] Apache CarbonData :: Spark ......................... SKIPPED
[INFO] Apache CarbonData :: Assembly ...................... SKIPPED
[INFO] Apache CarbonData :: Examples ...................... SKIPPED
[INFO] ------------------------------------------------------------------------
[INFO] BUILD FAILURE
[INFO] ------------------------------------------------------------------------
[INFO] Total time: 59.660 s
[INFO] Finished at: 2016-10-17T19:32:32+00:00
[INFO] Final Memory: 32M/304M
[INFO] ------------------------------------------------------------------------
Waiting for Jenkins to finish collecting data
[ERROR] Failed to execute goal org.apache.thrift.tools:maven-thrift-plugin:0.1.11:compile (generate-thrift-java) on project carbondata-format: thrift did not exit cleanly. Review output for more information. -> [Help 1]
org.apache.maven.lifecycle.LifecycleExecutionException: Failed to execute goal org.apache.thrift.tools:maven-thrift-plugin:0.1.11:compile (generate-thrift-java) on project carbondata-format: thrift did not exit cleanly. Review output for more information.
	at org.apache.maven.lifecycle.internal.MojoExecutor.execute(MojoExecutor.java:212)
	at org.apache.maven.lifecycle.internal.MojoExecutor.execute(MojoExecutor.java:153)
	at org.apache.maven.lifecycle.internal.MojoExecutor.execute(MojoExecutor.java:145)
	at org.apache.maven.lifecycle.internal.LifecycleModuleBuilder.buildProject(LifecycleModuleBuilder.java:116)
	at org.apache.maven.lifecycle.internal.LifecycleModuleBuilder.buildProject(LifecycleModuleBuilder.java:80)
	at org.apache.maven.lifecycle.internal.builder.singlethreaded.SingleThreadedBuilder.build(SingleThreadedBuilder.java:51)
	at org.apache.maven.lifecycle.internal.LifecycleStarter.execute(LifecycleStarter.java:128)
	at org.apache.maven.DefaultMaven.doExecute(DefaultMaven.java:307)
	at org.apache.maven.DefaultMaven.doExecute(DefaultMaven.java:193)
	at org.apache.maven.DefaultMaven.execute(DefaultMaven.java:106)
	at org.jvnet.hudson.maven3.launcher.Maven32Launcher.main(Maven32Launcher.java:132)
	at sun.reflect.NativeMethodAccessorImpl.invoke0(Native Method)
	at sun.reflect.NativeMethodAccessorImpl.invoke(NativeMethodAccessorImpl.java:62)
	at sun.reflect.DelegatingMethodAccessorImpl.invoke(DelegatingMethodAccessorImpl.java:43)
	at java.lang.reflect.Method.invoke(Method.java:498)
	at org.codehaus.plexus.classworlds.launcher.Launcher.launchStandard(Launcher.java:330)
	at org.codehaus.plexus.classworlds.launcher.Launcher.launch(Launcher.java:238)
	at jenkins.maven3.agent.Maven32Main.launch(Maven32Main.java:186)
	at sun.reflect.NativeMethodAccessorImpl.invoke0(Native Method)
	at sun.reflect.NativeMethodAccessorImpl.invoke(NativeMethodAccessorImpl.java:62)
	at sun.reflect.DelegatingMethodAccessorImpl.invoke(DelegatingMethodAccessorImpl.java:43)
	at java.lang.reflect.Method.invoke(Method.java:498)
	at hudson.maven.Maven3Builder.call(Maven3Builder.java:136)
	at hudson.maven.Maven3Builder.call(Maven3Builder.java:71)
	at hudson.remoting.UserRequest.perform(UserRequest.java:153)
	at hudson.remoting.UserRequest.perform(UserRequest.java:50)
	at hudson.remoting.Request$2.run(Request.java:332)
	at hudson.remoting.InterceptingExecutorService$1.call(InterceptingExecutorService.java:68)
	at java.util.concurrent.FutureTask.run(FutureTask.java:266)
	at java.util.concurrent.ThreadPoolExecutor.runWorker(ThreadPoolExecutor.java:1142)
	at java.util.concurrent.ThreadPoolExecutor$Worker.run(ThreadPoolExecutor.java:617)
	at java.lang.Thread.run(Thread.java:745)
Caused by: org.apache.maven.plugin.MojoFailureException: thrift did not exit cleanly. Review output for more information.
	at org.apache.thrift.maven.AbstractThriftMojo.execute(AbstractThriftMojo.java:177)
	at org.apache.thrift.maven.ThriftCompileMojo.execute(ThriftCompileMojo.java:21)
	at org.apache.maven.plugin.DefaultBuildPluginManager.executeMojo(DefaultBuildPluginManager.java:134)
	at org.apache.maven.lifecycle.internal.MojoExecutor.execute(MojoExecutor.java:208)
	... 31 more
[ERROR] 
[ERROR] Re-run Maven using the -X switch to enable full debug logging.
[ERROR] 
[ERROR] For more information about the errors and possible solutions, please read the following articles:
[ERROR] [Help 1] http://cwiki.apache.org/confluence/display/MAVEN/MojoFailureException
[ERROR] 
[ERROR] After correcting the problems, you can resume the build with the command
[ERROR]   mvn <goals> -rf :carbondata-format
[JENKINS] Archiving <https://builds.apache.org/job/CarbonData-master/ws/processing/pom.xml> to org.apache.carbondata/carbondata-processing/0.2.0-incubating-SNAPSHOT/carbondata-processing-0.2.0-incubating-SNAPSHOT.pom
[JENKINS] Archiving <https://builds.apache.org/job/CarbonData-master/ws/assembly/pom.xml> to org.apache.carbondata/carbondata-assembly/0.2.0-incubating-SNAPSHOT/carbondata-assembly-0.2.0-incubating-SNAPSHOT.pom
[JENKINS] Archiving <https://builds.apache.org/job/CarbonData-master/ws/pom.xml> to org.apache.carbondata/carbondata-parent/0.2.0-incubating-SNAPSHOT/carbondata-parent-0.2.0-incubating-SNAPSHOT.pom
[JENKINS] Archiving <https://builds.apache.org/job/CarbonData-master/ws/core/pom.xml> to org.apache.carbondata/carbondata-core/0.2.0-incubating-SNAPSHOT/carbondata-core-0.2.0-incubating-SNAPSHOT.pom
[JENKINS] Archiving <https://builds.apache.org/job/CarbonData-master/ws/format/pom.xml> to org.apache.carbondata/carbondata-format/0.2.0-incubating-SNAPSHOT/carbondata-format-0.2.0-incubating-SNAPSHOT.pom
[JENKINS] Archiving <https://builds.apache.org/job/CarbonData-master/ws/hadoop/pom.xml> to org.apache.carbondata/carbondata-hadoop/0.2.0-incubating-SNAPSHOT/carbondata-hadoop-0.2.0-incubating-SNAPSHOT.pom
[JENKINS] Archiving <https://builds.apache.org/job/CarbonData-master/ws/examples/pom.xml> to org.apache.carbondata/carbondata-examples/0.2.0-incubating-SNAPSHOT/carbondata-examples-0.2.0-incubating-SNAPSHOT.pom
[JENKINS] Archiving <https://builds.apache.org/job/CarbonData-master/ws/common/pom.xml> to org.apache.carbondata/carbondata-common/0.2.0-incubating-SNAPSHOT/carbondata-common-0.2.0-incubating-SNAPSHOT.pom
[JENKINS] Archiving <https://builds.apache.org/job/CarbonData-master/ws/common/target/carbondata-common-0.2.0-incubating-SNAPSHOT.jar> to org.apache.carbondata/carbondata-common/0.2.0-incubating-SNAPSHOT/carbondata-common-0.2.0-incubating-SNAPSHOT.jar
[JENKINS] Archiving <https://builds.apache.org/job/CarbonData-master/ws/integration/spark/pom.xml> to org.apache.carbondata/carbondata-spark/0.2.0-incubating-SNAPSHOT/carbondata-spark-0.2.0-incubating-SNAPSHOT.pom
Sending e-mails to: commits@carbondata.incubator.apache.org
channel stopped

Build failed in Jenkins: CarbonData-master #127

Posted by Apache Jenkins Server <je...@builds.apache.org>.
See <https://builds.apache.org/job/CarbonData-master/127/changes>

Changes:

[ramana.gollamudi] fix blocksize out of Int range

------------------------------------------
Started by an SCM change
[EnvInject] - Loading node environment variables.
Building remotely on ubuntu-6 (Ubuntu yahoo-not-h2 ubuntu docker) in workspace <https://builds.apache.org/job/CarbonData-master/ws/>
 > git rev-parse --is-inside-work-tree # timeout=10
Fetching changes from the remote Git repository
 > git config remote.origin.url https://git-wip-us.apache.org/repos/asf/incubator-carbondata.git # timeout=10
Fetching upstream changes from https://git-wip-us.apache.org/repos/asf/incubator-carbondata.git
 > git --version # timeout=10
 > git -c core.askpass=true fetch --tags --progress https://git-wip-us.apache.org/repos/asf/incubator-carbondata.git +refs/heads/*:refs/remotes/origin/*
 > git rev-parse refs/remotes/origin/master^{commit} # timeout=10
 > git rev-parse refs/remotes/origin/origin/master^{commit} # timeout=10
Checking out Revision c693001eff95564af721e25c583b99bcec7a2439 (refs/remotes/origin/master)
 > git config core.sparsecheckout # timeout=10
 > git checkout -f c693001eff95564af721e25c583b99bcec7a2439
 > git rev-list 4d564ad4eed08d2a999ab16331693a5f1ec15ed3 # timeout=10
Parsing POMs
Modules changed, recalculating dependency graph
Established TCP socket on 51838
maven32-agent.jar already up to date
maven32-interceptor.jar already up to date
maven3-interceptor-commons.jar already up to date
[CarbonData-master] $ /home/jenkins/tools/java/latest1.8/bin/java -Xmx2g -Xms256m -XX:MaxPermSize=512m -cp /home/jenkins/jenkins-slave/maven32-agent.jar:/home/jenkins/tools/maven/apache-maven-3.3.3/boot/plexus-classworlds-2.5.2.jar:/home/jenkins/tools/maven/apache-maven-3.3.3/conf/logging jenkins.maven3.agent.Maven32Main /home/jenkins/tools/maven/apache-maven-3.3.3 /home/jenkins/jenkins-slave/slave.jar /home/jenkins/jenkins-slave/maven32-interceptor.jar /home/jenkins/jenkins-slave/maven3-interceptor-commons.jar 51838
Java HotSpot(TM) 64-Bit Server VM warning: ignoring option MaxPermSize=512m; support was removed in 8.0
<===[JENKINS REMOTING CAPACITY]===>   channel started
Executing Maven:  -B -f <https://builds.apache.org/job/CarbonData-master/ws/pom.xml> -Dmaven.repo.local=/home/jenkins/jenkins-slave/maven-repositories/1 -B -e clean package
[INFO] Error stacktraces are turned on.
[INFO] Scanning for projects...
[INFO] ------------------------------------------------------------------------
[INFO] Reactor Build Order:
[INFO] 
[INFO] Apache CarbonData :: Parent
[INFO] Apache CarbonData :: Common
[INFO] Apache CarbonData :: Format
[INFO] Apache CarbonData :: Core
[INFO] Apache CarbonData :: Processing
[INFO] Apache CarbonData :: Hadoop
[INFO] Apache CarbonData :: Spark
[INFO] Apache CarbonData :: Assembly
[INFO] Apache CarbonData :: Examples
[INFO]                                                                         
[INFO] ------------------------------------------------------------------------
[INFO] Building Apache CarbonData :: Parent 0.2.0-incubating-SNAPSHOT
[INFO] ------------------------------------------------------------------------
[INFO] 
[INFO] --- maven-clean-plugin:2.5:clean (default-clean) @ carbondata-parent ---
[INFO] Deleting <https://builds.apache.org/job/CarbonData-master/ws/target>
[INFO] 
[INFO] --- maven-remote-resources-plugin:1.5:process (default) @ carbondata-parent ---
[INFO] 
[INFO] --- maven-site-plugin:3.4:attach-descriptor (attach-descriptor) @ carbondata-parent ---
[INFO]                                                                         
[INFO] ------------------------------------------------------------------------
[INFO] Building Apache CarbonData :: Common 0.2.0-incubating-SNAPSHOT
[INFO] ------------------------------------------------------------------------
[INFO] 
[INFO] --- maven-clean-plugin:2.5:clean (default-clean) @ carbondata-common ---
[INFO] Deleting <https://builds.apache.org/job/CarbonData-master/ws/common/target>
[INFO] 
[INFO] --- maven-remote-resources-plugin:1.5:process (default) @ carbondata-common ---
[INFO] 
[INFO] --- maven-resources-plugin:2.7:resources (default-resources) @ carbondata-common ---
[INFO] Using 'UTF-8' encoding to copy filtered resources.
[INFO] skip non existing resourceDirectory <https://builds.apache.org/job/CarbonData-master/ws/common/src/main/resources>
[INFO] Copying 3 resources
[INFO] 
[INFO] --- maven-compiler-plugin:3.2:compile (default-compile) @ carbondata-common ---
[INFO] Changes detected - recompiling the module!
[INFO] Compiling 9 source files to <https://builds.apache.org/job/CarbonData-master/ws/common/target/classes>
[INFO] 
[INFO] --- maven-resources-plugin:2.7:testResources (default-testResources) @ carbondata-common ---
[INFO] Using 'UTF-8' encoding to copy filtered resources.
[INFO] skip non existing resourceDirectory <https://builds.apache.org/job/CarbonData-master/ws/common/src/test/resources>
[INFO] Copying 3 resources
[INFO] 
[INFO] --- maven-compiler-plugin:3.2:testCompile (default-testCompile) @ carbondata-common ---
[INFO] Changes detected - recompiling the module!
[INFO] Compiling 7 source files to <https://builds.apache.org/job/CarbonData-master/ws/common/target/test-classes>
[INFO] <https://builds.apache.org/job/CarbonData-master/ws/common/src/test/java/org/apache/carbondata/common/logging/impl/AuditExtendedRollingFileAppenderTest_UT.java>: Some input files use or override a deprecated API.
[INFO] <https://builds.apache.org/job/CarbonData-master/ws/common/src/test/java/org/apache/carbondata/common/logging/impl/AuditExtendedRollingFileAppenderTest_UT.java>: Recompile with -Xlint:deprecation for details.
[INFO] 
[INFO] --- maven-surefire-plugin:2.18.1:test (default-test) @ carbondata-common ---
[JENKINS] Recording test results
[INFO] 
[INFO] --- maven-jar-plugin:2.5:jar (default-jar) @ carbondata-common ---
[INFO] Building jar: <https://builds.apache.org/job/CarbonData-master/ws/common/target/carbondata-common-0.2.0-incubating-SNAPSHOT.jar>
[INFO] 
[INFO] --- maven-site-plugin:3.4:attach-descriptor (attach-descriptor) @ carbondata-common ---
[INFO]                                                                         
[INFO] ------------------------------------------------------------------------
[INFO] Building Apache CarbonData :: Format 0.2.0-incubating-SNAPSHOT
[INFO] ------------------------------------------------------------------------
[INFO] 
[INFO] --- maven-clean-plugin:2.5:clean (default-clean) @ carbondata-format ---
[INFO] Deleting <https://builds.apache.org/job/CarbonData-master/ws/format/target>
[INFO] 
[INFO] --- maven-thrift-plugin:0.1.11:compile (generate-thrift-java) @ carbondata-format ---
[ERROR] thrift failed output: 
[ERROR] thrift failed error: /bin/sh: 1: thrift: not found

[INFO] ------------------------------------------------------------------------
[INFO] Reactor Summary:
[INFO] 
[INFO] Apache CarbonData :: Parent ........................ SUCCESS [  8.570 s]
[INFO] Apache CarbonData :: Common ........................ SUCCESS [ 17.704 s]
[INFO] Apache CarbonData :: Format ........................ FAILURE [  2.052 s]
[INFO] Apache CarbonData :: Core .......................... SKIPPED
[INFO] Apache CarbonData :: Processing .................... SKIPPED
[INFO] Apache CarbonData :: Hadoop ........................ SKIPPED
[INFO] Apache CarbonData :: Spark ......................... SKIPPED
[INFO] Apache CarbonData :: Assembly ...................... SKIPPED
[INFO] Apache CarbonData :: Examples ...................... SKIPPED
[INFO] ------------------------------------------------------------------------
[INFO] BUILD FAILURE
[INFO] ------------------------------------------------------------------------
[INFO] Total time: 49.550 s
[INFO] Finished at: 2016-10-17T18:26:40+00:00
[INFO] Final Memory: 30M/334M
[INFO] ------------------------------------------------------------------------
Waiting for Jenkins to finish collecting data
[ERROR] Failed to execute goal org.apache.thrift.tools:maven-thrift-plugin:0.1.11:compile (generate-thrift-java) on project carbondata-format: thrift did not exit cleanly. Review output for more information. -> [Help 1]
org.apache.maven.lifecycle.LifecycleExecutionException: Failed to execute goal org.apache.thrift.tools:maven-thrift-plugin:0.1.11:compile (generate-thrift-java) on project carbondata-format: thrift did not exit cleanly. Review output for more information.
	at org.apache.maven.lifecycle.internal.MojoExecutor.execute(MojoExecutor.java:212)
	at org.apache.maven.lifecycle.internal.MojoExecutor.execute(MojoExecutor.java:153)
	at org.apache.maven.lifecycle.internal.MojoExecutor.execute(MojoExecutor.java:145)
	at org.apache.maven.lifecycle.internal.LifecycleModuleBuilder.buildProject(LifecycleModuleBuilder.java:116)
	at org.apache.maven.lifecycle.internal.LifecycleModuleBuilder.buildProject(LifecycleModuleBuilder.java:80)
	at org.apache.maven.lifecycle.internal.builder.singlethreaded.SingleThreadedBuilder.build(SingleThreadedBuilder.java:51)
	at org.apache.maven.lifecycle.internal.LifecycleStarter.execute(LifecycleStarter.java:128)
	at org.apache.maven.DefaultMaven.doExecute(DefaultMaven.java:307)
	at org.apache.maven.DefaultMaven.doExecute(DefaultMaven.java:193)
	at org.apache.maven.DefaultMaven.execute(DefaultMaven.java:106)
	at org.jvnet.hudson.maven3.launcher.Maven32Launcher.main(Maven32Launcher.java:132)
	at sun.reflect.NativeMethodAccessorImpl.invoke0(Native Method)
	at sun.reflect.NativeMethodAccessorImpl.invoke(NativeMethodAccessorImpl.java:62)
	at sun.reflect.DelegatingMethodAccessorImpl.invoke(DelegatingMethodAccessorImpl.java:43)
	at java.lang.reflect.Method.invoke(Method.java:498)
	at org.codehaus.plexus.classworlds.launcher.Launcher.launchStandard(Launcher.java:330)
	at org.codehaus.plexus.classworlds.launcher.Launcher.launch(Launcher.java:238)
	at jenkins.maven3.agent.Maven32Main.launch(Maven32Main.java:186)
	at sun.reflect.NativeMethodAccessorImpl.invoke0(Native Method)
	at sun.reflect.NativeMethodAccessorImpl.invoke(NativeMethodAccessorImpl.java:62)
	at sun.reflect.DelegatingMethodAccessorImpl.invoke(DelegatingMethodAccessorImpl.java:43)
	at java.lang.reflect.Method.invoke(Method.java:498)
	at hudson.maven.Maven3Builder.call(Maven3Builder.java:136)
	at hudson.maven.Maven3Builder.call(Maven3Builder.java:71)
	at hudson.remoting.UserRequest.perform(UserRequest.java:153)
	at hudson.remoting.UserRequest.perform(UserRequest.java:50)
	at hudson.remoting.Request$2.run(Request.java:332)
	at hudson.remoting.InterceptingExecutorService$1.call(InterceptingExecutorService.java:68)
	at java.util.concurrent.FutureTask.run(FutureTask.java:266)
	at java.util.concurrent.ThreadPoolExecutor.runWorker(ThreadPoolExecutor.java:1142)
	at java.util.concurrent.ThreadPoolExecutor$Worker.run(ThreadPoolExecutor.java:617)
	at java.lang.Thread.run(Thread.java:745)
Caused by: org.apache.maven.plugin.MojoFailureException: thrift did not exit cleanly. Review output for more information.
	at org.apache.thrift.maven.AbstractThriftMojo.execute(AbstractThriftMojo.java:177)
	at org.apache.thrift.maven.ThriftCompileMojo.execute(ThriftCompileMojo.java:21)
	at org.apache.maven.plugin.DefaultBuildPluginManager.executeMojo(DefaultBuildPluginManager.java:134)
	at org.apache.maven.lifecycle.internal.MojoExecutor.execute(MojoExecutor.java:208)
	... 31 more
[ERROR] 
[ERROR] Re-run Maven using the -X switch to enable full debug logging.
[ERROR] 
[ERROR] For more information about the errors and possible solutions, please read the following articles:
[ERROR] [Help 1] http://cwiki.apache.org/confluence/display/MAVEN/MojoFailureException
[ERROR] 
[ERROR] After correcting the problems, you can resume the build with the command
[ERROR]   mvn <goals> -rf :carbondata-format
[JENKINS] Archiving <https://builds.apache.org/job/CarbonData-master/ws/processing/pom.xml> to org.apache.carbondata/carbondata-processing/0.2.0-incubating-SNAPSHOT/carbondata-processing-0.2.0-incubating-SNAPSHOT.pom
[JENKINS] Archiving <https://builds.apache.org/job/CarbonData-master/ws/assembly/pom.xml> to org.apache.carbondata/carbondata-assembly/0.2.0-incubating-SNAPSHOT/carbondata-assembly-0.2.0-incubating-SNAPSHOT.pom
[JENKINS] Archiving <https://builds.apache.org/job/CarbonData-master/ws/pom.xml> to org.apache.carbondata/carbondata-parent/0.2.0-incubating-SNAPSHOT/carbondata-parent-0.2.0-incubating-SNAPSHOT.pom
[JENKINS] Archiving <https://builds.apache.org/job/CarbonData-master/ws/core/pom.xml> to org.apache.carbondata/carbondata-core/0.2.0-incubating-SNAPSHOT/carbondata-core-0.2.0-incubating-SNAPSHOT.pom
[JENKINS] Archiving <https://builds.apache.org/job/CarbonData-master/ws/format/pom.xml> to org.apache.carbondata/carbondata-format/0.2.0-incubating-SNAPSHOT/carbondata-format-0.2.0-incubating-SNAPSHOT.pom
[JENKINS] Archiving <https://builds.apache.org/job/CarbonData-master/ws/hadoop/pom.xml> to org.apache.carbondata/carbondata-hadoop/0.2.0-incubating-SNAPSHOT/carbondata-hadoop-0.2.0-incubating-SNAPSHOT.pom
[JENKINS] Archiving <https://builds.apache.org/job/CarbonData-master/ws/examples/pom.xml> to org.apache.carbondata/carbondata-examples/0.2.0-incubating-SNAPSHOT/carbondata-examples-0.2.0-incubating-SNAPSHOT.pom
[JENKINS] Archiving <https://builds.apache.org/job/CarbonData-master/ws/common/pom.xml> to org.apache.carbondata/carbondata-common/0.2.0-incubating-SNAPSHOT/carbondata-common-0.2.0-incubating-SNAPSHOT.pom
[JENKINS] Archiving <https://builds.apache.org/job/CarbonData-master/ws/common/target/carbondata-common-0.2.0-incubating-SNAPSHOT.jar> to org.apache.carbondata/carbondata-common/0.2.0-incubating-SNAPSHOT/carbondata-common-0.2.0-incubating-SNAPSHOT.jar
[JENKINS] Archiving <https://builds.apache.org/job/CarbonData-master/ws/integration/spark/pom.xml> to org.apache.carbondata/carbondata-spark/0.2.0-incubating-SNAPSHOT/carbondata-spark-0.2.0-incubating-SNAPSHOT.pom
Sending e-mails to: commits@carbondata.incubator.apache.org
channel stopped

Build failed in Jenkins: CarbonData-master #126

Posted by Apache Jenkins Server <je...@builds.apache.org>.
See <https://builds.apache.org/job/CarbonData-master/126/changes>

Changes:

[jackylk] add COLUMNDICT info

------------------------------------------
Started by an SCM change
[EnvInject] - Loading node environment variables.
Building remotely on ubuntu-us1 (Ubuntu ubuntu docker) in workspace <https://builds.apache.org/job/CarbonData-master/ws/>
 > git rev-parse --is-inside-work-tree # timeout=10
Fetching changes from the remote Git repository
 > git config remote.origin.url https://git-wip-us.apache.org/repos/asf/incubator-carbondata.git # timeout=10
Fetching upstream changes from https://git-wip-us.apache.org/repos/asf/incubator-carbondata.git
 > git --version # timeout=10
 > git -c core.askpass=true fetch --tags --progress https://git-wip-us.apache.org/repos/asf/incubator-carbondata.git +refs/heads/*:refs/remotes/origin/*
 > git rev-parse refs/remotes/origin/master^{commit} # timeout=10
 > git rev-parse refs/remotes/origin/origin/master^{commit} # timeout=10
Checking out Revision 4d564ad4eed08d2a999ab16331693a5f1ec15ed3 (refs/remotes/origin/master)
 > git config core.sparsecheckout # timeout=10
 > git checkout -f 4d564ad4eed08d2a999ab16331693a5f1ec15ed3
 > git rev-list 14595bf6995a62c679834bc5137323bc619b2190 # timeout=10
Parsing POMs
Modules changed, recalculating dependency graph
Established TCP socket on 59461
maven32-agent.jar already up to date
maven32-interceptor.jar already up to date
maven3-interceptor-commons.jar already up to date
[CarbonData-master] $ /home/jenkins/tools/java/latest1.8/bin/java -Xmx2g -Xms256m -XX:MaxPermSize=512m -cp /home/jenkins/jenkins-slave/maven32-agent.jar:/home/jenkins/tools/maven/apache-maven-3.3.3/boot/plexus-classworlds-2.5.2.jar:/home/jenkins/tools/maven/apache-maven-3.3.3/conf/logging jenkins.maven3.agent.Maven32Main /home/jenkins/tools/maven/apache-maven-3.3.3 /home/jenkins/jenkins-slave/slave.jar /home/jenkins/jenkins-slave/maven32-interceptor.jar /home/jenkins/jenkins-slave/maven3-interceptor-commons.jar 59461
Java HotSpot(TM) 64-Bit Server VM warning: ignoring option MaxPermSize=512m; support was removed in 8.0
<===[JENKINS REMOTING CAPACITY]===>   channel started
Executing Maven:  -B -f <https://builds.apache.org/job/CarbonData-master/ws/pom.xml> -Dmaven.repo.local=/home/jenkins/jenkins-slave/maven-repositories/1 -B -e clean package
[INFO] Error stacktraces are turned on.
[INFO] Scanning for projects...
[INFO] ------------------------------------------------------------------------
[INFO] Reactor Build Order:
[INFO] 
[INFO] Apache CarbonData :: Parent
[INFO] Apache CarbonData :: Common
[INFO] Apache CarbonData :: Format
[INFO] Apache CarbonData :: Core
[INFO] Apache CarbonData :: Processing
[INFO] Apache CarbonData :: Hadoop
[INFO] Apache CarbonData :: Spark
[INFO] Apache CarbonData :: Assembly
[INFO] Apache CarbonData :: Examples
[INFO]                                                                         
[INFO] ------------------------------------------------------------------------
[INFO] Building Apache CarbonData :: Parent 0.2.0-incubating-SNAPSHOT
[INFO] ------------------------------------------------------------------------
[INFO] 
[INFO] --- maven-clean-plugin:2.5:clean (default-clean) @ carbondata-parent ---
[INFO] Deleting <https://builds.apache.org/job/CarbonData-master/ws/target>
[INFO] 
[INFO] --- maven-remote-resources-plugin:1.5:process (default) @ carbondata-parent ---
[INFO] 
[INFO] --- maven-site-plugin:3.4:attach-descriptor (attach-descriptor) @ carbondata-parent ---
[INFO]                                                                         
[INFO] ------------------------------------------------------------------------
[INFO] Building Apache CarbonData :: Common 0.2.0-incubating-SNAPSHOT
[INFO] ------------------------------------------------------------------------
[INFO] Downloading: https://repo.maven.apache.org/maven2/org/jmockit/jmockit/1.10/jmockit-1.10.pom
[INFO] Downloaded: https://repo.maven.apache.org/maven2/org/jmockit/jmockit/1.10/jmockit-1.10.pom (9 KB at 10.1 KB/sec)
[INFO] Downloading: https://repo.maven.apache.org/maven2/org/jmockit/jmockit/1.10/jmockit-1.10.jar
[INFO] Downloaded: https://repo.maven.apache.org/maven2/org/jmockit/jmockit/1.10/jmockit-1.10.jar (550 KB at 1760.0 KB/sec)
[INFO] 
[INFO] --- maven-clean-plugin:2.5:clean (default-clean) @ carbondata-common ---
[INFO] Deleting <https://builds.apache.org/job/CarbonData-master/ws/common/target>
[INFO] 
[INFO] --- maven-remote-resources-plugin:1.5:process (default) @ carbondata-common ---
[INFO] 
[INFO] --- maven-resources-plugin:2.7:resources (default-resources) @ carbondata-common ---
[INFO] Using 'UTF-8' encoding to copy filtered resources.
[INFO] skip non existing resourceDirectory <https://builds.apache.org/job/CarbonData-master/ws/common/src/main/resources>
[INFO] Copying 3 resources
[INFO] 
[INFO] --- maven-compiler-plugin:3.2:compile (default-compile) @ carbondata-common ---
[INFO] Changes detected - recompiling the module!
[INFO] Compiling 9 source files to <https://builds.apache.org/job/CarbonData-master/ws/common/target/classes>
[INFO] 
[INFO] --- maven-resources-plugin:2.7:testResources (default-testResources) @ carbondata-common ---
[INFO] Using 'UTF-8' encoding to copy filtered resources.
[INFO] skip non existing resourceDirectory <https://builds.apache.org/job/CarbonData-master/ws/common/src/test/resources>
[INFO] Copying 3 resources
[INFO] 
[INFO] --- maven-compiler-plugin:3.2:testCompile (default-testCompile) @ carbondata-common ---
[INFO] Changes detected - recompiling the module!
[INFO] Compiling 7 source files to <https://builds.apache.org/job/CarbonData-master/ws/common/target/test-classes>
[INFO] <https://builds.apache.org/job/CarbonData-master/ws/common/src/test/java/org/apache/carbondata/common/logging/impl/AuditExtendedRollingFileAppenderTest_UT.java>: Some input files use or override a deprecated API.
[INFO] <https://builds.apache.org/job/CarbonData-master/ws/common/src/test/java/org/apache/carbondata/common/logging/impl/AuditExtendedRollingFileAppenderTest_UT.java>: Recompile with -Xlint:deprecation for details.
[INFO] 
[INFO] --- maven-surefire-plugin:2.18.1:test (default-test) @ carbondata-common ---
[JENKINS] Recording test results
[INFO] 
[INFO] --- maven-jar-plugin:2.5:jar (default-jar) @ carbondata-common ---
[INFO] Building jar: <https://builds.apache.org/job/CarbonData-master/ws/common/target/carbondata-common-0.2.0-incubating-SNAPSHOT.jar>
[INFO] 
[INFO] --- maven-site-plugin:3.4:attach-descriptor (attach-descriptor) @ carbondata-common ---
[INFO]                                                                         
[INFO] ------------------------------------------------------------------------
[INFO] Building Apache CarbonData :: Format 0.2.0-incubating-SNAPSHOT
[INFO] ------------------------------------------------------------------------
[INFO] Downloading: https://repo.maven.apache.org/maven2/org/apache/thrift/tools/maven-thrift-plugin/0.1.11/maven-thrift-plugin-0.1.11.pom
[INFO] Downloaded: https://repo.maven.apache.org/maven2/org/apache/thrift/tools/maven-thrift-plugin/0.1.11/maven-thrift-plugin-0.1.11.pom (4 KB at 144.7 KB/sec)
[INFO] Downloading: https://repo.maven.apache.org/maven2/org/apache/thrift/tools/maven-thrift-plugin/0.1.11/maven-thrift-plugin-0.1.11.jar
[INFO] Downloaded: https://repo.maven.apache.org/maven2/org/apache/thrift/tools/maven-thrift-plugin/0.1.11/maven-thrift-plugin-0.1.11.jar (18 KB at 913.7 KB/sec)
[INFO] 
[INFO] --- maven-clean-plugin:2.5:clean (default-clean) @ carbondata-format ---
[INFO] Deleting <https://builds.apache.org/job/CarbonData-master/ws/format/target>
[INFO] 
[INFO] --- maven-thrift-plugin:0.1.11:compile (generate-thrift-java) @ carbondata-format ---
[INFO] Downloading: https://repo.maven.apache.org/maven2/com/google/collections/google-collections/0.8/google-collections-0.8.pom
[INFO] Downloaded: https://repo.maven.apache.org/maven2/com/google/collections/google-collections/0.8/google-collections-0.8.pom (3 KB at 101.6 KB/sec)
[INFO] Downloading: https://repo.maven.apache.org/maven2/org/slf4j/slf4j-simple/1.5.8/slf4j-simple-1.5.8.pom
[INFO] Downloaded: https://repo.maven.apache.org/maven2/org/slf4j/slf4j-simple/1.5.8/slf4j-simple-1.5.8.pom (2 KB at 71.0 KB/sec)
[INFO] Downloading: https://repo.maven.apache.org/maven2/com/google/collections/google-collections/0.8/google-collections-0.8.jar
[INFO] Downloading: https://repo.maven.apache.org/maven2/org/slf4j/slf4j-api/1.5.8/slf4j-api-1.5.8.jar
[INFO] Downloading: https://repo.maven.apache.org/maven2/org/slf4j/slf4j-simple/1.5.8/slf4j-simple-1.5.8.jar
[INFO] Downloaded: https://repo.maven.apache.org/maven2/org/slf4j/slf4j-simple/1.5.8/slf4j-simple-1.5.8.jar (8 KB at 77.2 KB/sec)
[INFO] Downloaded: https://repo.maven.apache.org/maven2/org/slf4j/slf4j-api/1.5.8/slf4j-api-1.5.8.jar (23 KB at 194.0 KB/sec)
[INFO] Downloaded: https://repo.maven.apache.org/maven2/com/google/collections/google-collections/0.8/google-collections-0.8.jar (473 KB at 3151.4 KB/sec)
[ERROR] thrift failed output: 
[ERROR] thrift failed error: /bin/sh: 1: thrift: not found

[INFO] ------------------------------------------------------------------------
[INFO] Reactor Summary:
[INFO] 
[INFO] Apache CarbonData :: Parent ........................ SUCCESS [  5.203 s]
[INFO] Apache CarbonData :: Common ........................ SUCCESS [ 10.060 s]
[INFO] Apache CarbonData :: Format ........................ FAILURE [  1.172 s]
[INFO] Apache CarbonData :: Core .......................... SKIPPED
[INFO] Apache CarbonData :: Processing .................... SKIPPED
[INFO] Apache CarbonData :: Hadoop ........................ SKIPPED
[INFO] Apache CarbonData :: Spark ......................... SKIPPED
[INFO] Apache CarbonData :: Assembly ...................... SKIPPED
[INFO] Apache CarbonData :: Examples ...................... SKIPPED
[INFO] ------------------------------------------------------------------------
[INFO] BUILD FAILURE
[INFO] ------------------------------------------------------------------------
[INFO] Total time: 27.120 s
[INFO] Finished at: 2016-10-16T02:15:05+00:00
[INFO] Final Memory: 34M/358M
[INFO] ------------------------------------------------------------------------
Waiting for Jenkins to finish collecting data
[ERROR] Failed to execute goal org.apache.thrift.tools:maven-thrift-plugin:0.1.11:compile (generate-thrift-java) on project carbondata-format: thrift did not exit cleanly. Review output for more information. -> [Help 1]
org.apache.maven.lifecycle.LifecycleExecutionException: Failed to execute goal org.apache.thrift.tools:maven-thrift-plugin:0.1.11:compile (generate-thrift-java) on project carbondata-format: thrift did not exit cleanly. Review output for more information.
	at org.apache.maven.lifecycle.internal.MojoExecutor.execute(MojoExecutor.java:212)
	at org.apache.maven.lifecycle.internal.MojoExecutor.execute(MojoExecutor.java:153)
	at org.apache.maven.lifecycle.internal.MojoExecutor.execute(MojoExecutor.java:145)
	at org.apache.maven.lifecycle.internal.LifecycleModuleBuilder.buildProject(LifecycleModuleBuilder.java:116)
	at org.apache.maven.lifecycle.internal.LifecycleModuleBuilder.buildProject(LifecycleModuleBuilder.java:80)
	at org.apache.maven.lifecycle.internal.builder.singlethreaded.SingleThreadedBuilder.build(SingleThreadedBuilder.java:51)
	at org.apache.maven.lifecycle.internal.LifecycleStarter.execute(LifecycleStarter.java:128)
	at org.apache.maven.DefaultMaven.doExecute(DefaultMaven.java:307)
	at org.apache.maven.DefaultMaven.doExecute(DefaultMaven.java:193)
	at org.apache.maven.DefaultMaven.execute(DefaultMaven.java:106)
	at org.jvnet.hudson.maven3.launcher.Maven32Launcher.main(Maven32Launcher.java:132)
	at sun.reflect.NativeMethodAccessorImpl.invoke0(Native Method)
	at sun.reflect.NativeMethodAccessorImpl.invoke(NativeMethodAccessorImpl.java:62)
	at sun.reflect.DelegatingMethodAccessorImpl.invoke(DelegatingMethodAccessorImpl.java:43)
	at java.lang.reflect.Method.invoke(Method.java:498)
	at org.codehaus.plexus.classworlds.launcher.Launcher.launchStandard(Launcher.java:330)
	at org.codehaus.plexus.classworlds.launcher.Launcher.launch(Launcher.java:238)
	at jenkins.maven3.agent.Maven32Main.launch(Maven32Main.java:186)
	at sun.reflect.NativeMethodAccessorImpl.invoke0(Native Method)
	at sun.reflect.NativeMethodAccessorImpl.invoke(NativeMethodAccessorImpl.java:62)
	at sun.reflect.DelegatingMethodAccessorImpl.invoke(DelegatingMethodAccessorImpl.java:43)
	at java.lang.reflect.Method.invoke(Method.java:498)
	at hudson.maven.Maven3Builder.call(Maven3Builder.java:136)
	at hudson.maven.Maven3Builder.call(Maven3Builder.java:71)
	at hudson.remoting.UserRequest.perform(UserRequest.java:153)
	at hudson.remoting.UserRequest.perform(UserRequest.java:50)
	at hudson.remoting.Request$2.run(Request.java:332)
	at hudson.remoting.InterceptingExecutorService$1.call(InterceptingExecutorService.java:68)
	at java.util.concurrent.FutureTask.run(FutureTask.java:266)
	at java.util.concurrent.ThreadPoolExecutor.runWorker(ThreadPoolExecutor.java:1142)
	at java.util.concurrent.ThreadPoolExecutor$Worker.run(ThreadPoolExecutor.java:617)
	at java.lang.Thread.run(Thread.java:745)
Caused by: org.apache.maven.plugin.MojoFailureException: thrift did not exit cleanly. Review output for more information.
	at org.apache.thrift.maven.AbstractThriftMojo.execute(AbstractThriftMojo.java:177)
	at org.apache.thrift.maven.ThriftCompileMojo.execute(ThriftCompileMojo.java:21)
	at org.apache.maven.plugin.DefaultBuildPluginManager.executeMojo(DefaultBuildPluginManager.java:134)
	at org.apache.maven.lifecycle.internal.MojoExecutor.execute(MojoExecutor.java:208)
	... 31 more
[ERROR] 
[ERROR] Re-run Maven using the -X switch to enable full debug logging.
[ERROR] 
[ERROR] For more information about the errors and possible solutions, please read the following articles:
[ERROR] [Help 1] http://cwiki.apache.org/confluence/display/MAVEN/MojoFailureException
[ERROR] 
[ERROR] After correcting the problems, you can resume the build with the command
[ERROR]   mvn <goals> -rf :carbondata-format
[JENKINS] Archiving <https://builds.apache.org/job/CarbonData-master/ws/processing/pom.xml> to org.apache.carbondata/carbondata-processing/0.2.0-incubating-SNAPSHOT/carbondata-processing-0.2.0-incubating-SNAPSHOT.pom
[JENKINS] Archiving <https://builds.apache.org/job/CarbonData-master/ws/assembly/pom.xml> to org.apache.carbondata/carbondata-assembly/0.2.0-incubating-SNAPSHOT/carbondata-assembly-0.2.0-incubating-SNAPSHOT.pom
[JENKINS] Archiving <https://builds.apache.org/job/CarbonData-master/ws/pom.xml> to org.apache.carbondata/carbondata-parent/0.2.0-incubating-SNAPSHOT/carbondata-parent-0.2.0-incubating-SNAPSHOT.pom
[JENKINS] Archiving <https://builds.apache.org/job/CarbonData-master/ws/core/pom.xml> to org.apache.carbondata/carbondata-core/0.2.0-incubating-SNAPSHOT/carbondata-core-0.2.0-incubating-SNAPSHOT.pom
[JENKINS] Archiving <https://builds.apache.org/job/CarbonData-master/ws/format/pom.xml> to org.apache.carbondata/carbondata-format/0.2.0-incubating-SNAPSHOT/carbondata-format-0.2.0-incubating-SNAPSHOT.pom
[JENKINS] Archiving <https://builds.apache.org/job/CarbonData-master/ws/hadoop/pom.xml> to org.apache.carbondata/carbondata-hadoop/0.2.0-incubating-SNAPSHOT/carbondata-hadoop-0.2.0-incubating-SNAPSHOT.pom
[JENKINS] Archiving <https://builds.apache.org/job/CarbonData-master/ws/examples/pom.xml> to org.apache.carbondata/carbondata-examples/0.2.0-incubating-SNAPSHOT/carbondata-examples-0.2.0-incubating-SNAPSHOT.pom
[JENKINS] Archiving <https://builds.apache.org/job/CarbonData-master/ws/common/pom.xml> to org.apache.carbondata/carbondata-common/0.2.0-incubating-SNAPSHOT/carbondata-common-0.2.0-incubating-SNAPSHOT.pom
[JENKINS] Archiving <https://builds.apache.org/job/CarbonData-master/ws/common/target/carbondata-common-0.2.0-incubating-SNAPSHOT.jar> to org.apache.carbondata/carbondata-common/0.2.0-incubating-SNAPSHOT/carbondata-common-0.2.0-incubating-SNAPSHOT.jar
[JENKINS] Archiving <https://builds.apache.org/job/CarbonData-master/ws/integration/spark/pom.xml> to org.apache.carbondata/carbondata-spark/0.2.0-incubating-SNAPSHOT/carbondata-spark-0.2.0-incubating-SNAPSHOT.pom
Sending e-mails to: commits@carbondata.incubator.apache.org
channel stopped