You are viewing a plain text version of this content. The canonical link for it is here.
Posted to dev@hive.apache.org by Apache Jenkins Server <je...@builds.apache.org> on 2012/11/24 17:07:31 UTC

Build failed in Jenkins: Hive-0.9.1-SNAPSHOT-h0.21 #209

See <https://builds.apache.org/job/Hive-0.9.1-SNAPSHOT-h0.21/209/>

------------------------------------------
[...truncated 5774 lines...]
[ivy:resolve] 	[SUCCESSFUL ] com.google.inject#guice;3.0!guice.jar (71ms)
[ivy:resolve] downloading http://repo1.maven.org/maven2/com/sun/jersey/contribs/jersey-guice/1.8/jersey-guice-1.8.jar ...
[ivy:resolve] .. (14kB)
[ivy:resolve] .. (0kB)
[ivy:resolve] 	[SUCCESSFUL ] com.sun.jersey.contribs#jersey-guice;1.8!jersey-guice.jar (217ms)
[ivy:resolve] downloading http://repo1.maven.org/maven2/javax/inject/javax.inject/1/javax.inject-1.jar ...
[ivy:resolve] .. (2kB)
[ivy:resolve] .. (0kB)
[ivy:resolve] 	[SUCCESSFUL ] javax.inject#javax.inject;1!javax.inject.jar (43ms)
[ivy:resolve] downloading http://repo1.maven.org/maven2/aopalliance/aopalliance/1.0/aopalliance-1.0.jar ...
[ivy:resolve] .. (4kB)
[ivy:resolve] .. (0kB)
[ivy:resolve] 	[SUCCESSFUL ] aopalliance#aopalliance;1.0!aopalliance.jar (58ms)
[ivy:resolve] downloading http://repo1.maven.org/maven2/org/sonatype/sisu/inject/cglib/2.2.1-v20090111/cglib-2.2.1-v20090111.jar ...
[ivy:resolve] ...................... (272kB)
[ivy:resolve] .. (0kB)
[ivy:resolve] 	[SUCCESSFUL ] org.sonatype.sisu.inject#cglib;2.2.1-v20090111!cglib.jar (109ms)
[ivy:resolve] downloading http://repo1.maven.org/maven2/org/apache/hadoop/hadoop-mapreduce-client-shuffle/0.23.3/hadoop-mapreduce-client-shuffle-0.23.3.jar ...
[ivy:resolve] .. (15kB)
[ivy:resolve] .. (0kB)
[ivy:resolve] 	[SUCCESSFUL ] org.apache.hadoop#hadoop-mapreduce-client-shuffle;0.23.3!hadoop-mapreduce-client-shuffle.jar (279ms)
[ivy:resolve] downloading http://repo1.maven.org/maven2/org/apache/hadoop/hadoop-yarn-server-nodemanager/0.23.3/hadoop-yarn-server-nodemanager-0.23.3.jar ...
[ivy:resolve] ............................ (385kB)
[ivy:resolve] .. (0kB)
[ivy:resolve] 	[SUCCESSFUL ] org.apache.hadoop#hadoop-yarn-server-nodemanager;0.23.3!hadoop-yarn-server-nodemanager.jar (244ms)
[ivy:resolve] 
[ivy:resolve] :: problems summary ::
[ivy:resolve] :::: WARNINGS
[ivy:resolve] 	problem while downloading module descriptor: http://repo1.maven.org/maven2/org/codehaus/jackson/jackson-xc/1.8.8/jackson-xc-1.8.8.pom: /home/jenkins/.ivy2/cache/org.codehaus.jackson/jackson-xc/ivy-1.8.8.xml.original.part (No such file or directory) (30ms)
[ivy:resolve] 		module not found: org.codehaus.jackson#jackson-xc;1.8.8
[ivy:resolve] 	==== local: tried
[ivy:resolve] 	  /home/jenkins/.ivy2/local/org.codehaus.jackson/jackson-xc/1.8.8/ivys/ivy.xml
[ivy:resolve] 	  -- artifact org.codehaus.jackson#jackson-xc;1.8.8!jackson-xc.jar:
[ivy:resolve] 	  /home/jenkins/.ivy2/local/org.codehaus.jackson/jackson-xc/1.8.8/jars/jackson-xc.jar
[ivy:resolve] 	==== apache-snapshot: tried
[ivy:resolve] 	  https://repository.apache.org/content/repositories/snapshots/org/codehaus/jackson/jackson-xc/1.8.8/jackson-xc-1.8.8.pom
[ivy:resolve] 	  -- artifact org.codehaus.jackson#jackson-xc;1.8.8!jackson-xc.jar:
[ivy:resolve] 	  https://repository.apache.org/content/repositories/snapshots/org/codehaus/jackson/jackson-xc/1.8.8/jackson-xc-1.8.8.jar
[ivy:resolve] 	==== maven2: tried
[ivy:resolve] 	  http://repo1.maven.org/maven2/org/codehaus/jackson/jackson-xc/1.8.8/jackson-xc-1.8.8.pom
[ivy:resolve] 	==== datanucleus-repo: tried
[ivy:resolve] 	  -- artifact org.codehaus.jackson#jackson-xc;1.8.8!jackson-xc.jar:
[ivy:resolve] 	  http://www.datanucleus.org/downloads/maven2/org/codehaus/jackson/jackson-xc/1.8.8/jackson-xc-1.8.8.jar
[ivy:resolve] 	==== hadoop-source: tried
[ivy:resolve] 	  -- artifact org.codehaus.jackson#jackson-xc;1.8.8!jackson-xc.jar:
[ivy:resolve] 	  http://mirror.facebook.net/facebook/hive-deps/hadoop/core/jackson-xc-1.8.8/jackson-xc-1.8.8.jar
[ivy:resolve] 	==== hadoop-source2: tried
[ivy:resolve] 	  -- artifact org.codehaus.jackson#jackson-xc;1.8.8!jackson-xc.jar:
[ivy:resolve] 	  http://archive.cloudera.com/hive-deps/hadoop/core/jackson-xc-1.8.8/jackson-xc-1.8.8.jar
[ivy:resolve] 	problem while downloading module descriptor: http://repo1.maven.org/maven2/tomcat/jasper-compiler/5.5.23/jasper-compiler-5.5.23.pom: /home/jenkins/.ivy2/cache/tomcat/jasper-compiler/ivy-5.5.23.xml.original.part (No such file or directory) (124ms)
[ivy:resolve] 		module not found: tomcat#jasper-compiler;5.5.23
[ivy:resolve] 	==== local: tried
[ivy:resolve] 	  /home/jenkins/.ivy2/local/tomcat/jasper-compiler/5.5.23/ivys/ivy.xml
[ivy:resolve] 	  -- artifact tomcat#jasper-compiler;5.5.23!jasper-compiler.jar:
[ivy:resolve] 	  /home/jenkins/.ivy2/local/tomcat/jasper-compiler/5.5.23/jars/jasper-compiler.jar
[ivy:resolve] 	==== apache-snapshot: tried
[ivy:resolve] 	  https://repository.apache.org/content/repositories/snapshots/tomcat/jasper-compiler/5.5.23/jasper-compiler-5.5.23.pom
[ivy:resolve] 	  -- artifact tomcat#jasper-compiler;5.5.23!jasper-compiler.jar:
[ivy:resolve] 	  https://repository.apache.org/content/repositories/snapshots/tomcat/jasper-compiler/5.5.23/jasper-compiler-5.5.23.jar
[ivy:resolve] 	==== maven2: tried
[ivy:resolve] 	  http://repo1.maven.org/maven2/tomcat/jasper-compiler/5.5.23/jasper-compiler-5.5.23.pom
[ivy:resolve] 	==== datanucleus-repo: tried
[ivy:resolve] 	  -- artifact tomcat#jasper-compiler;5.5.23!jasper-compiler.jar:
[ivy:resolve] 	  http://www.datanucleus.org/downloads/maven2/tomcat/jasper-compiler/5.5.23/jasper-compiler-5.5.23.jar
[ivy:resolve] 	==== hadoop-source: tried
[ivy:resolve] 	  -- artifact tomcat#jasper-compiler;5.5.23!jasper-compiler.jar:
[ivy:resolve] 	  http://mirror.facebook.net/facebook/hive-deps/hadoop/core/jasper-compiler-5.5.23/jasper-compiler-5.5.23.jar
[ivy:resolve] 	==== hadoop-source2: tried
[ivy:resolve] 	  -- artifact tomcat#jasper-compiler;5.5.23!jasper-compiler.jar:
[ivy:resolve] 	  http://archive.cloudera.com/hive-deps/hadoop/core/jasper-compiler-5.5.23/jasper-compiler-5.5.23.jar
[ivy:resolve] 	problem while downloading module descriptor: http://repo1.maven.org/maven2/org/aspectj/aspectjrt/1.6.5/aspectjrt-1.6.5.pom: /home/jenkins/.ivy2/cache/org.aspectj/aspectjrt/ivy-1.6.5.xml.original.part (No such file or directory) (68ms)
[ivy:resolve] 		module not found: org.aspectj#aspectjrt;1.6.5
[ivy:resolve] 	==== local: tried
[ivy:resolve] 	  /home/jenkins/.ivy2/local/org.aspectj/aspectjrt/1.6.5/ivys/ivy.xml
[ivy:resolve] 	  -- artifact org.aspectj#aspectjrt;1.6.5!aspectjrt.jar:
[ivy:resolve] 	  /home/jenkins/.ivy2/local/org.aspectj/aspectjrt/1.6.5/jars/aspectjrt.jar
[ivy:resolve] 	==== apache-snapshot: tried
[ivy:resolve] 	  https://repository.apache.org/content/repositories/snapshots/org/aspectj/aspectjrt/1.6.5/aspectjrt-1.6.5.pom
[ivy:resolve] 	  -- artifact org.aspectj#aspectjrt;1.6.5!aspectjrt.jar:
[ivy:resolve] 	  https://repository.apache.org/content/repositories/snapshots/org/aspectj/aspectjrt/1.6.5/aspectjrt-1.6.5.jar
[ivy:resolve] 	==== maven2: tried
[ivy:resolve] 	  http://repo1.maven.org/maven2/org/aspectj/aspectjrt/1.6.5/aspectjrt-1.6.5.pom
[ivy:resolve] 	==== datanucleus-repo: tried
[ivy:resolve] 	  -- artifact org.aspectj#aspectjrt;1.6.5!aspectjrt.jar:
[ivy:resolve] 	  http://www.datanucleus.org/downloads/maven2/org/aspectj/aspectjrt/1.6.5/aspectjrt-1.6.5.jar
[ivy:resolve] 	==== hadoop-source: tried
[ivy:resolve] 	  -- artifact org.aspectj#aspectjrt;1.6.5!aspectjrt.jar:
[ivy:resolve] 	  http://mirror.facebook.net/facebook/hive-deps/hadoop/core/aspectjrt-1.6.5/aspectjrt-1.6.5.jar
[ivy:resolve] 	==== hadoop-source2: tried
[ivy:resolve] 	  -- artifact org.aspectj#aspectjrt;1.6.5!aspectjrt.jar:
[ivy:resolve] 	  http://archive.cloudera.com/hive-deps/hadoop/core/aspectjrt-1.6.5/aspectjrt-1.6.5.jar
[ivy:resolve] 	impossible to put metadata file in cache: http://repo1.maven.org/maven2/org/apache/avro/avro-parent/1.5.3/avro-parent-1.5.3.pom (1.5.3). java.io.FileNotFoundException: /home/jenkins/.ivy2/cache/org.apache.avro/avro-parent/ivy-1.5.3.xml.original (No such file or directory)
[ivy:resolve] 	problem while downloading module descriptor: http://repo1.maven.org/maven2/org/apache/hadoop/hadoop-auth/0.23.3/hadoop-auth-0.23.3.pom: /home/jenkins/.ivy2/cache/org.apache.hadoop/hadoop-auth/ivy-0.23.3.xml.original.part (No such file or directory) (204ms)
[ivy:resolve] 		module not found: org.apache.hadoop#hadoop-auth;0.23.3
[ivy:resolve] 	==== local: tried
[ivy:resolve] 	  /home/jenkins/.ivy2/local/org.apache.hadoop/hadoop-auth/0.23.3/ivys/ivy.xml
[ivy:resolve] 	  -- artifact org.apache.hadoop#hadoop-auth;0.23.3!hadoop-auth.jar:
[ivy:resolve] 	  /home/jenkins/.ivy2/local/org.apache.hadoop/hadoop-auth/0.23.3/jars/hadoop-auth.jar
[ivy:resolve] 	==== apache-snapshot: tried
[ivy:resolve] 	  https://repository.apache.org/content/repositories/snapshots/org/apache/hadoop/hadoop-auth/0.23.3/hadoop-auth-0.23.3.pom
[ivy:resolve] 	  -- artifact org.apache.hadoop#hadoop-auth;0.23.3!hadoop-auth.jar:
[ivy:resolve] 	  https://repository.apache.org/content/repositories/snapshots/org/apache/hadoop/hadoop-auth/0.23.3/hadoop-auth-0.23.3.jar
[ivy:resolve] 	==== maven2: tried
[ivy:resolve] 	  http://repo1.maven.org/maven2/org/apache/hadoop/hadoop-auth/0.23.3/hadoop-auth-0.23.3.pom
[ivy:resolve] 	==== datanucleus-repo: tried
[ivy:resolve] 	  -- artifact org.apache.hadoop#hadoop-auth;0.23.3!hadoop-auth.jar:
[ivy:resolve] 	  http://www.datanucleus.org/downloads/maven2/org/apache/hadoop/hadoop-auth/0.23.3/hadoop-auth-0.23.3.jar
[ivy:resolve] 	==== hadoop-source: tried
[ivy:resolve] 	  -- artifact org.apache.hadoop#hadoop-auth;0.23.3!hadoop-auth.jar:
[ivy:resolve] 	  http://mirror.facebook.net/facebook/hive-deps/hadoop/core/hadoop-auth-0.23.3/hadoop-auth-0.23.3.jar
[ivy:resolve] 	==== hadoop-source2: tried
[ivy:resolve] 	  -- artifact org.apache.hadoop#hadoop-auth;0.23.3!hadoop-auth.jar:
[ivy:resolve] 	  http://archive.cloudera.com/hive-deps/hadoop/core/hadoop-auth-0.23.3/hadoop-auth-0.23.3.jar
[ivy:resolve] 	problem while downloading module descriptor: http://repo1.maven.org/maven2/org/apache/hadoop/hadoop-yarn-api/0.23.3/hadoop-yarn-api-0.23.3.pom: /home/jenkins/.ivy2/cache/org.apache.hadoop/hadoop-yarn-api/ivy-0.23.3.xml.original.part (No such file or directory) (181ms)
[ivy:resolve] 		module not found: org.apache.hadoop#hadoop-yarn-api;0.23.3
[ivy:resolve] 	==== local: tried
[ivy:resolve] 	  /home/jenkins/.ivy2/local/org.apache.hadoop/hadoop-yarn-api/0.23.3/ivys/ivy.xml
[ivy:resolve] 	  -- artifact org.apache.hadoop#hadoop-yarn-api;0.23.3!hadoop-yarn-api.jar:
[ivy:resolve] 	  /home/jenkins/.ivy2/local/org.apache.hadoop/hadoop-yarn-api/0.23.3/jars/hadoop-yarn-api.jar
[ivy:resolve] 	==== apache-snapshot: tried
[ivy:resolve] 	  https://repository.apache.org/content/repositories/snapshots/org/apache/hadoop/hadoop-yarn-api/0.23.3/hadoop-yarn-api-0.23.3.pom
[ivy:resolve] 	  -- artifact org.apache.hadoop#hadoop-yarn-api;0.23.3!hadoop-yarn-api.jar:
[ivy:resolve] 	  https://repository.apache.org/content/repositories/snapshots/org/apache/hadoop/hadoop-yarn-api/0.23.3/hadoop-yarn-api-0.23.3.jar
[ivy:resolve] 	==== maven2: tried
[ivy:resolve] 	  http://repo1.maven.org/maven2/org/apache/hadoop/hadoop-yarn-api/0.23.3/hadoop-yarn-api-0.23.3.pom
[ivy:resolve] 	==== datanucleus-repo: tried
[ivy:resolve] 	  -- artifact org.apache.hadoop#hadoop-yarn-api;0.23.3!hadoop-yarn-api.jar:
[ivy:resolve] 	  http://www.datanucleus.org/downloads/maven2/org/apache/hadoop/hadoop-yarn-api/0.23.3/hadoop-yarn-api-0.23.3.jar
[ivy:resolve] 	==== hadoop-source: tried
[ivy:resolve] 	  -- artifact org.apache.hadoop#hadoop-yarn-api;0.23.3!hadoop-yarn-api.jar:
[ivy:resolve] 	  http://mirror.facebook.net/facebook/hive-deps/hadoop/core/hadoop-yarn-api-0.23.3/hadoop-yarn-api-0.23.3.jar
[ivy:resolve] 	==== hadoop-source2: tried
[ivy:resolve] 	  -- artifact org.apache.hadoop#hadoop-yarn-api;0.23.3!hadoop-yarn-api.jar:
[ivy:resolve] 	  http://archive.cloudera.com/hive-deps/hadoop/core/hadoop-yarn-api-0.23.3/hadoop-yarn-api-0.23.3.jar
[ivy:resolve] 	problem while downloading module descriptor: http://repo1.maven.org/maven2/com/sun/jersey/jersey-test-framework/1.8/jersey-test-framework-1.8.pom: /home/jenkins/.ivy2/cache/com.sun.jersey/jersey-test-framework/ivy-1.8.xml.original.part (No such file or directory) (158ms)
[ivy:resolve] 	io problem while parsing ivy file: http://repo1.maven.org/maven2/com/sun/jersey/jersey-test-framework/jersey-test-framework-grizzly2/1.8/jersey-test-framework-grizzly2-1.8.pom: Impossible to load parent for file:/home/jenkins/.ivy2/cache/com.sun.jersey.jersey-test-framework/jersey-test-framework-grizzly2/ivy-1.8.xml.original. Parent=com.sun.jersey#jersey-test-framework;1.8
[ivy:resolve] 		module not found: com.sun.jersey.jersey-test-framework#jersey-test-framework-grizzly2;1.8
[ivy:resolve] 	==== local: tried
[ivy:resolve] 	  /home/jenkins/.ivy2/local/com.sun.jersey/jersey-test-framework/1.8/ivys/ivy.xml
[ivy:resolve] 	  -- artifact com.sun.jersey#jersey-test-framework;1.8!jersey-test-framework.jar:
[ivy:resolve] 	  /home/jenkins/.ivy2/local/com.sun.jersey/jersey-test-framework/1.8/jars/jersey-test-framework.jar
[ivy:resolve] 	==== apache-snapshot: tried
[ivy:resolve] 	  https://repository.apache.org/content/repositories/snapshots/com/sun/jersey/jersey-test-framework/1.8/jersey-test-framework-1.8.pom
[ivy:resolve] 	  -- artifact com.sun.jersey#jersey-test-framework;1.8!jersey-test-framework.jar:
[ivy:resolve] 	  https://repository.apache.org/content/repositories/snapshots/com/sun/jersey/jersey-test-framework/1.8/jersey-test-framework-1.8.jar
[ivy:resolve] 	==== maven2: tried
[ivy:resolve] 	  http://repo1.maven.org/maven2/com/sun/jersey/jersey-test-framework/1.8/jersey-test-framework-1.8.pom
[ivy:resolve] 	==== datanucleus-repo: tried
[ivy:resolve] 	  -- artifact com.sun.jersey.jersey-test-framework#jersey-test-framework-grizzly2;1.8!jersey-test-framework-grizzly2.jar:
[ivy:resolve] 	  http://www.datanucleus.org/downloads/maven2/com/sun/jersey/jersey-test-framework/jersey-test-framework-grizzly2/1.8/jersey-test-framework-grizzly2-1.8.jar
[ivy:resolve] 	==== hadoop-source: tried
[ivy:resolve] 	  -- artifact com.sun.jersey.jersey-test-framework#jersey-test-framework-grizzly2;1.8!jersey-test-framework-grizzly2.jar:
[ivy:resolve] 	  http://mirror.facebook.net/facebook/hive-deps/hadoop/core/jersey-test-framework-grizzly2-1.8/jersey-test-framework-grizzly2-1.8.jar
[ivy:resolve] 	==== hadoop-source2: tried
[ivy:resolve] 	  -- artifact com.sun.jersey.jersey-test-framework#jersey-test-framework-grizzly2;1.8!jersey-test-framework-grizzly2.jar:
[ivy:resolve] 	  http://archive.cloudera.com/hive-deps/hadoop/core/jersey-test-framework-grizzly2-1.8/jersey-test-framework-grizzly2-1.8.jar
[ivy:resolve] 	problem while downloading module descriptor: http://repo1.maven.org/maven2/org/apache/zookeeper/zookeeper/3.4.2/zookeeper-3.4.2.pom: /home/jenkins/.ivy2/cache/org.apache.zookeeper/zookeeper/ivy-3.4.2.xml.original.part (No such file or directory) (30ms)
[ivy:resolve] 		module not found: org.apache.zookeeper#zookeeper;3.4.2
[ivy:resolve] 	==== local: tried
[ivy:resolve] 	  /home/jenkins/.ivy2/local/org.apache.zookeeper/zookeeper/3.4.2/ivys/ivy.xml
[ivy:resolve] 	  -- artifact org.apache.zookeeper#zookeeper;3.4.2!zookeeper.jar:
[ivy:resolve] 	  /home/jenkins/.ivy2/local/org.apache.zookeeper/zookeeper/3.4.2/jars/zookeeper.jar
[ivy:resolve] 	==== apache-snapshot: tried
[ivy:resolve] 	  https://repository.apache.org/content/repositories/snapshots/org/apache/zookeeper/zookeeper/3.4.2/zookeeper-3.4.2.pom
[ivy:resolve] 	  -- artifact org.apache.zookeeper#zookeeper;3.4.2!zookeeper.jar:
[ivy:resolve] 	  https://repository.apache.org/content/repositories/snapshots/org/apache/zookeeper/zookeeper/3.4.2/zookeeper-3.4.2.jar
[ivy:resolve] 	==== maven2: tried
[ivy:resolve] 	  http://repo1.maven.org/maven2/org/apache/zookeeper/zookeeper/3.4.2/zookeeper-3.4.2.pom
[ivy:resolve] 	==== datanucleus-repo: tried
[ivy:resolve] 	  -- artifact org.apache.zookeeper#zookeeper;3.4.2!zookeeper.jar:
[ivy:resolve] 	  http://www.datanucleus.org/downloads/maven2/org/apache/zookeeper/zookeeper/3.4.2/zookeeper-3.4.2.jar
[ivy:resolve] 	==== hadoop-source: tried
[ivy:resolve] 	  -- artifact org.apache.zookeeper#zookeeper;3.4.2!zookeeper.jar:
[ivy:resolve] 	  http://mirror.facebook.net/facebook/hive-deps/hadoop/core/zookeeper-3.4.2/zookeeper-3.4.2.jar
[ivy:resolve] 	==== hadoop-source2: tried
[ivy:resolve] 	  -- artifact org.apache.zookeeper#zookeeper;3.4.2!zookeeper.jar:
[ivy:resolve] 	  http://archive.cloudera.com/hive-deps/hadoop/core/zookeeper-3.4.2/zookeeper-3.4.2.jar
[ivy:resolve] 		[FAILED     ] org.apache.hadoop#hadoop-hdfs;0.23.3!hadoop-hdfs.jar(tests): impossible to move part file to definitive one: /home/jenkins/.ivy2/cache/org.apache.hadoop/hadoop-hdfs/testss/hadoop-hdfs-0.23.3-tests.jar.part -> /home/jenkins/.ivy2/cache/org.apache.hadoop/hadoop-hdfs/testss/hadoop-hdfs-0.23.3-tests.jar (313ms)
[ivy:resolve] 		[FAILED     ] org.apache.hadoop#hadoop-mapreduce-client-common;0.23.3!hadoop-mapreduce-client-common.jar: impossible to move part file to definitive one: /home/jenkins/.ivy2/cache/org.apache.hadoop/hadoop-mapreduce-client-common/jars/hadoop-mapreduce-client-common-0.23.3.jar.part -> /home/jenkins/.ivy2/cache/org.apache.hadoop/hadoop-mapreduce-client-common/jars/hadoop-mapreduce-client-common-0.23.3.jar (180ms)
[ivy:resolve] 		[FAILED     ] org.apache.hadoop#hadoop-annotations;0.23.3!hadoop-annotations.jar: /home/jenkins/.ivy2/cache/org.apache.hadoop/hadoop-annotations/jars/hadoop-annotations-0.23.3.jar.part (No such file or directory) (200ms)
[ivy:resolve] 		[FAILED     ] commons-httpclient#commons-httpclient;3.1!commons-httpclient.jar: impossible to move part file to definitive one: /home/jenkins/.ivy2/cache/commons-httpclient/commons-httpclient/jars/commons-httpclient-3.1.jar.part -> /home/jenkins/.ivy2/cache/commons-httpclient/commons-httpclient/jars/commons-httpclient-3.1.jar (53ms)
[ivy:resolve] 		[FAILED     ] commons-io#commons-io;2.1!commons-io.jar: impossible to move part file to definitive one: /home/jenkins/.ivy2/cache/commons-io/commons-io/jars/commons-io-2.1.jar.part -> /home/jenkins/.ivy2/cache/commons-io/commons-io/jars/commons-io-2.1.jar (60ms)
[ivy:resolve] 		[FAILED     ] javax.servlet#servlet-api;2.5!servlet-api.jar: /home/jenkins/.ivy2/cache/javax.servlet/servlet-api/jars/servlet-api-2.5.jar.part (No such file or directory) (39ms)
[ivy:resolve] 		[FAILED     ] com.sun.jersey#jersey-server;1.8!jersey-server.jar(bundle): impossible to move part file to definitive one: /home/jenkins/.ivy2/cache/com.sun.jersey/jersey-server/bundles/jersey-server-1.8.jar.part -> /home/jenkins/.ivy2/cache/com.sun.jersey/jersey-server/bundles/jersey-server-1.8.jar (114ms)
[ivy:resolve] 		[FAILED     ] org.apache.avro#avro-ipc;1.5.3!avro-ipc.jar: impossible to move part file to definitive one: /home/jenkins/.ivy2/cache/org.apache.avro/avro-ipc/jars/avro-ipc-1.5.3.jar.part -> /home/jenkins/.ivy2/cache/org.apache.avro/avro-ipc/jars/avro-ipc-1.5.3.jar (73ms)
[ivy:resolve] 		[FAILED     ] com.sun.xml.bind#jaxb-impl;2.2.3-1!jaxb-impl.jar: impossible to move part file to definitive one: /home/jenkins/.ivy2/cache/com.sun.xml.bind/jaxb-impl/jars/jaxb-impl-2.2.3-1.jar.part -> /home/jenkins/.ivy2/cache/com.sun.xml.bind/jaxb-impl/jars/jaxb-impl-2.2.3-1.jar (165ms)
[ivy:resolve] 		[FAILED     ] org.codehaus.jackson#jackson-jaxrs;1.8.8!jackson-jaxrs.jar: /home/jenkins/.ivy2/cache/org.codehaus.jackson/jackson-jaxrs/jars/jackson-jaxrs-1.8.8.jar.part (No such file or directory) (185ms)
[ivy:resolve] 		[FAILED     ] org.apache.velocity#velocity;1.7!velocity.jar: Downloaded file size doesn't match expected Content Length for http://repo1.maven.org/maven2/org/apache/velocity/velocity/1.7/velocity-1.7.jar. Please retry. (20ms)
[ivy:resolve] 		[FAILED     ] org.apache.velocity#velocity;1.7!velocity.jar:  (0ms)
[ivy:resolve] 	==== local: tried
[ivy:resolve] 	  /home/jenkins/.ivy2/local/org.apache.velocity/velocity/1.7/jars/velocity.jar
[ivy:resolve] 	==== apache-snapshot: tried
[ivy:resolve] 	  https://repository.apache.org/content/repositories/snapshots/org/apache/velocity/velocity/1.7/velocity-1.7.jar
[ivy:resolve] 	==== maven2: tried
[ivy:resolve] 	  http://repo1.maven.org/maven2/org/apache/velocity/velocity/1.7/velocity-1.7.jar
[ivy:resolve] 	==== datanucleus-repo: tried
[ivy:resolve] 	  http://www.datanucleus.org/downloads/maven2/org/apache/velocity/velocity/1.7/velocity-1.7.jar
[ivy:resolve] 	==== hadoop-source: tried
[ivy:resolve] 	  http://mirror.facebook.net/facebook/hive-deps/hadoop/core/velocity-1.7/velocity-1.7.jar
[ivy:resolve] 	==== hadoop-source2: tried
[ivy:resolve] 	  http://archive.cloudera.com/hive-deps/hadoop/core/velocity-1.7/velocity-1.7.jar
[ivy:resolve] 		[FAILED     ] com.cenqua.clover#clover;3.0.2!clover.jar: Downloaded file size doesn't match expected Content Length for http://repo1.maven.org/maven2/com/cenqua/clover/clover/3.0.2/clover-3.0.2.jar. Please retry. (226ms)
[ivy:resolve] 		[FAILED     ] com.cenqua.clover#clover;3.0.2!clover.jar:  (0ms)
[ivy:resolve] 	==== local: tried
[ivy:resolve] 	  /home/jenkins/.ivy2/local/com.cenqua.clover/clover/3.0.2/jars/clover.jar
[ivy:resolve] 	==== apache-snapshot: tried
[ivy:resolve] 	  https://repository.apache.org/content/repositories/snapshots/com/cenqua/clover/clover/3.0.2/clover-3.0.2.jar
[ivy:resolve] 	==== maven2: tried
[ivy:resolve] 	  http://repo1.maven.org/maven2/com/cenqua/clover/clover/3.0.2/clover-3.0.2.jar
[ivy:resolve] 	==== datanucleus-repo: tried
[ivy:resolve] 	  http://www.datanucleus.org/downloads/maven2/com/cenqua/clover/clover/3.0.2/clover-3.0.2.jar
[ivy:resolve] 	==== hadoop-source: tried
[ivy:resolve] 	  http://mirror.facebook.net/facebook/hive-deps/hadoop/core/clover-3.0.2/clover-3.0.2.jar
[ivy:resolve] 	==== hadoop-source2: tried
[ivy:resolve] 	  http://archive.cloudera.com/hive-deps/hadoop/core/clover-3.0.2/clover-3.0.2.jar
[ivy:resolve] 		::::::::::::::::::::::::::::::::::::::::::::::
[ivy:resolve] 		::          UNRESOLVED DEPENDENCIES         ::
[ivy:resolve] 		::::::::::::::::::::::::::::::::::::::::::::::
[ivy:resolve] 		:: org.codehaus.jackson#jackson-xc;1.8.8: not found
[ivy:resolve] 		:: tomcat#jasper-compiler;5.5.23: not found
[ivy:resolve] 		:: org.aspectj#aspectjrt;1.6.5: not found
[ivy:resolve] 		:: org.apache.hadoop#hadoop-auth;0.23.3: not found
[ivy:resolve] 		:: org.apache.hadoop#hadoop-yarn-api;0.23.3: not found
[ivy:resolve] 		:: com.sun.jersey.jersey-test-framework#jersey-test-framework-grizzly2;1.8: not found
[ivy:resolve] 		:: org.apache.zookeeper#zookeeper;3.4.2: not found
[ivy:resolve] 		::::::::::::::::::::::::::::::::::::::::::::::
[ivy:resolve] 		::::::::::::::::::::::::::::::::::::::::::::::
[ivy:resolve] 		::              FAILED DOWNLOADS            ::
[ivy:resolve] 		:: ^ see resolution messages for details  ^ ::
[ivy:resolve] 		::::::::::::::::::::::::::::::::::::::::::::::
[ivy:resolve] 		:: org.apache.velocity#velocity;1.7!velocity.jar
[ivy:resolve] 		:: com.cenqua.clover#clover;3.0.2!clover.jar
[ivy:resolve] 		::::::::::::::::::::::::::::::::::::::::::::::
[ivy:resolve] 
[ivy:resolve] :: USE VERBOSE OR DEBUG MESSAGE LEVEL FOR MORE DETAILS

BUILD FAILED
/x1/jenkins/jenkins-slave/workspace/Hive-0.9.1-SNAPSHOT-h0.21/hive/build.xml:302: The following error occurred while executing this line:
/x1/jenkins/jenkins-slave/workspace/Hive-0.9.1-SNAPSHOT-h0.21/hive/build.xml:152: The following error occurred while executing this line:
/x1/jenkins/jenkins-slave/workspace/Hive-0.9.1-SNAPSHOT-h0.21/hive/shims/build.xml:90: The following error occurred while executing this line:
/x1/jenkins/jenkins-slave/workspace/Hive-0.9.1-SNAPSHOT-h0.21/hive/shims/build.xml:93: The following error occurred while executing this line:
/x1/jenkins/jenkins-slave/workspace/Hive-0.9.1-SNAPSHOT-h0.21/hive/shims/build.xml:65: The following error occurred while executing this line:
/x1/jenkins/jenkins-slave/workspace/Hive-0.9.1-SNAPSHOT-h0.21/hive/build-common.xml:171: impossible to resolve dependencies:
	resolve failed - see output for details

Total time: 1 minute 13 seconds
Build step 'Invoke Ant' marked build as failure
Archiving artifacts
Recording test results

Jenkins build is back to normal : Hive-0.9.1-SNAPSHOT-h0.21 #211

Posted by Apache Jenkins Server <je...@builds.apache.org>.
See <https://builds.apache.org/job/Hive-0.9.1-SNAPSHOT-h0.21/211/>


Build failed in Jenkins: Hive-0.9.1-SNAPSHOT-h0.21 #210

Posted by Apache Jenkins Server <je...@builds.apache.org>.
See <https://builds.apache.org/job/Hive-0.9.1-SNAPSHOT-h0.21/210/>

------------------------------------------
[...truncated 5077 lines...]
A         ql/src/gen/thrift/gen-py/queryplan/ttypes.py
A         ql/src/gen/thrift/gen-py/queryplan/constants.py
A         ql/src/gen/thrift/gen-py/queryplan/__init__.py
A         ql/src/gen/thrift/gen-cpp
A         ql/src/gen/thrift/gen-cpp/queryplan_constants.h
A         ql/src/gen/thrift/gen-cpp/queryplan_types.cpp
A         ql/src/gen/thrift/gen-cpp/queryplan_types.h
A         ql/src/gen/thrift/gen-cpp/queryplan_constants.cpp
A         ql/src/gen/thrift/gen-rb
A         ql/src/gen/thrift/gen-rb/queryplan_types.rb
A         ql/src/gen/thrift/gen-rb/queryplan_constants.rb
A         ql/src/gen/thrift/gen-javabean
A         ql/src/gen/thrift/gen-javabean/org
A         ql/src/gen/thrift/gen-javabean/org/apache
A         ql/src/gen/thrift/gen-javabean/org/apache/hadoop
A         ql/src/gen/thrift/gen-javabean/org/apache/hadoop/hive
A         ql/src/gen/thrift/gen-javabean/org/apache/hadoop/hive/ql
A         ql/src/gen/thrift/gen-javabean/org/apache/hadoop/hive/ql/plan
A         ql/src/gen/thrift/gen-javabean/org/apache/hadoop/hive/ql/plan/api
A         ql/src/gen/thrift/gen-javabean/org/apache/hadoop/hive/ql/plan/api/QueryPlan.java
A         ql/src/gen/thrift/gen-javabean/org/apache/hadoop/hive/ql/plan/api/Adjacency.java
A         ql/src/gen/thrift/gen-javabean/org/apache/hadoop/hive/ql/plan/api/Graph.java
A         ql/src/gen/thrift/gen-javabean/org/apache/hadoop/hive/ql/plan/api/Task.java
A         ql/src/gen/thrift/gen-javabean/org/apache/hadoop/hive/ql/plan/api/AdjacencyType.java
A         ql/src/gen/thrift/gen-javabean/org/apache/hadoop/hive/ql/plan/api/Stage.java
A         ql/src/gen/thrift/gen-javabean/org/apache/hadoop/hive/ql/plan/api/TaskType.java
A         ql/src/gen/thrift/gen-javabean/org/apache/hadoop/hive/ql/plan/api/Query.java
A         ql/src/gen/thrift/gen-javabean/org/apache/hadoop/hive/ql/plan/api/StageType.java
A         ql/src/gen/thrift/gen-javabean/org/apache/hadoop/hive/ql/plan/api/NodeType.java
A         ql/src/gen/thrift/gen-javabean/org/apache/hadoop/hive/ql/plan/api/Operator.java
A         ql/src/gen/thrift/gen-javabean/org/apache/hadoop/hive/ql/plan/api/OperatorType.java
A         ql/src/gen/thrift/gen-php
A         ql/src/gen/thrift/gen-php/queryplan
A         ql/src/gen/thrift/gen-php/queryplan/queryplan_types.php
A         ql/src/gen-javabean
A         ql/src/gen-javabean/org
A         ql/src/gen-javabean/org/apache
A         ql/src/gen-javabean/org/apache/hadoop
A         ql/src/gen-javabean/org/apache/hadoop/hive
A         ql/src/gen-javabean/org/apache/hadoop/hive/ql
A         ql/src/gen-javabean/org/apache/hadoop/hive/ql/plan
A         ql/src/gen-javabean/org/apache/hadoop/hive/ql/plan/api
A         ql/src/gen-php
A         ql/build.xml
A         ql/if
A         ql/if/queryplan.thrift
A         pdk
A         pdk/ivy.xml
A         pdk/scripts
A         pdk/scripts/class-registration.xsl
A         pdk/scripts/build-plugin.xml
A         pdk/scripts/README
A         pdk/src
A         pdk/src/java
A         pdk/src/java/org
A         pdk/src/java/org/apache
A         pdk/src/java/org/apache/hive
A         pdk/src/java/org/apache/hive/pdk
A         pdk/src/java/org/apache/hive/pdk/FunctionExtractor.java
A         pdk/src/java/org/apache/hive/pdk/HivePdkUnitTest.java
A         pdk/src/java/org/apache/hive/pdk/HivePdkUnitTests.java
A         pdk/src/java/org/apache/hive/pdk/PluginTest.java
A         pdk/test-plugin
A         pdk/test-plugin/test
A         pdk/test-plugin/test/cleanup.sql
A         pdk/test-plugin/test/onerow.txt
A         pdk/test-plugin/test/setup.sql
A         pdk/test-plugin/src
A         pdk/test-plugin/src/org
A         pdk/test-plugin/src/org/apache
A         pdk/test-plugin/src/org/apache/hive
A         pdk/test-plugin/src/org/apache/hive/pdktest
A         pdk/test-plugin/src/org/apache/hive/pdktest/Rot13.java
A         pdk/test-plugin/build.xml
A         pdk/build.xml
A         build-offline.xml
 U        .
At revision 1413366
no change for http://svn.apache.org/repos/asf/hive/branches/branch-0.9 since the previous build
[hive] $ /home/hudson/tools/ant/apache-ant-1.8.1/bin/ant -Dversion=0.9.1-SNAPSHOT very-clean tar binary
Buildfile: <https://builds.apache.org/job/Hive-0.9.1-SNAPSHOT-h0.21/ws/hive/build.xml>

ivy-init-dirs:
     [echo] Project: hive
    [mkdir] Created dir: <https://builds.apache.org/job/Hive-0.9.1-SNAPSHOT-h0.21/210/artifact/hive/build/ivy>
    [mkdir] Created dir: <https://builds.apache.org/job/Hive-0.9.1-SNAPSHOT-h0.21/210/artifact/hive/build/ivy/lib>
    [mkdir] Created dir: <https://builds.apache.org/job/Hive-0.9.1-SNAPSHOT-h0.21/210/artifact/hive/build/ivy/report>
    [mkdir] Created dir: <https://builds.apache.org/job/Hive-0.9.1-SNAPSHOT-h0.21/210/artifact/hive/build/ivy/maven>

ivy-download:
     [echo] Project: hive
      [get] Getting: http://repo2.maven.org/maven2/org/apache/ivy/ivy/2.1.0/ivy-2.1.0.jar
      [get] To: <https://builds.apache.org/job/Hive-0.9.1-SNAPSHOT-h0.21/210/artifact/hive/build/ivy/lib/ivy-2.1.0.jar>

ivy-probe-antlib:
     [echo] Project: hive

ivy-init-antlib:
     [echo] Project: hive

ivy-clean-cache:
[ivy:cleancache] :: Ivy 2.1.0 - 20090925235825 :: http://ant.apache.org/ivy/ ::
[ivy:cleancache] :: loading settings :: url = jar:<https://builds.apache.org/job/Hive-0.9.1-SNAPSHOT-h0.21/210/artifact/hive/build/ivy/lib/ivy-2.1.0.jar!/org/apache/ivy/core/settings/ivysettings.xml>

clean:
     [echo] Project: hive

clean:
     [echo] Project: anttasks

clean:
     [echo] Project: shims

clean:
     [echo] Project: common

clean:
     [echo] Project: serde

clean:
     [echo] Project: metastore

clean:
     [echo] Project: ql

clean:
     [echo] Project: contrib

clean:
     [echo] Project: service

clean:
     [echo] Project: cli

clean:
     [echo] Project: jdbc

clean:
     [echo] Project: hwi

clean:
     [echo] Project: hbase-handler

clean:
     [echo] Project: pdk

clean:
     [echo] Project: builtins

clean:

clean:
     [echo] Project: odbc
     [exec] rm -rf <https://builds.apache.org/job/Hive-0.9.1-SNAPSHOT-h0.21/210/artifact/hive/build/odbc> <https://builds.apache.org/job/Hive-0.9.1-SNAPSHOT-h0.21/210/artifact/hive/build/service/objs> <https://builds.apache.org/job/Hive-0.9.1-SNAPSHOT-h0.21/210/artifact/hive/build/ql/objs> <https://builds.apache.org/job/Hive-0.9.1-SNAPSHOT-h0.21/210/artifact/hive/build/metastore/objs>

clean-online:
     [echo] Project: hive
   [delete] Deleting directory <https://builds.apache.org/job/Hive-0.9.1-SNAPSHOT-h0.21/210/artifact/hive/build>

clean-offline:

very-clean:

ivy-init-dirs:
     [echo] Project: hive
    [mkdir] Created dir: <https://builds.apache.org/job/Hive-0.9.1-SNAPSHOT-h0.21/210/artifact/hive/build/ivy>
    [mkdir] Created dir: <https://builds.apache.org/job/Hive-0.9.1-SNAPSHOT-h0.21/210/artifact/hive/build/ivy/lib>
    [mkdir] Created dir: <https://builds.apache.org/job/Hive-0.9.1-SNAPSHOT-h0.21/210/artifact/hive/build/ivy/report>
    [mkdir] Created dir: <https://builds.apache.org/job/Hive-0.9.1-SNAPSHOT-h0.21/210/artifact/hive/build/ivy/maven>

ivy-download:
     [echo] Project: hive
      [get] Getting: http://repo2.maven.org/maven2/org/apache/ivy/ivy/2.1.0/ivy-2.1.0.jar
      [get] To: <https://builds.apache.org/job/Hive-0.9.1-SNAPSHOT-h0.21/210/artifact/hive/build/ivy/lib/ivy-2.1.0.jar>

ivy-probe-antlib:
     [echo] Project: hive

ivy-init-antlib:

compile-ant-tasks:
     [echo] Project: hive

create-dirs:
     [echo] Project: anttasks
    [mkdir] Created dir: <https://builds.apache.org/job/Hive-0.9.1-SNAPSHOT-h0.21/210/artifact/hive/build/anttasks>
    [mkdir] Created dir: <https://builds.apache.org/job/Hive-0.9.1-SNAPSHOT-h0.21/210/artifact/hive/build/anttasks/classes>
    [mkdir] Created dir: <https://builds.apache.org/job/Hive-0.9.1-SNAPSHOT-h0.21/210/artifact/hive/build/jexl/classes>
    [mkdir] Created dir: <https://builds.apache.org/job/Hive-0.9.1-SNAPSHOT-h0.21/210/artifact/hive/build/hadoopcore>
    [mkdir] Created dir: <https://builds.apache.org/job/Hive-0.9.1-SNAPSHOT-h0.21/210/artifact/hive/build/anttasks/test>
    [mkdir] Created dir: <https://builds.apache.org/job/Hive-0.9.1-SNAPSHOT-h0.21/210/artifact/hive/build/anttasks/test/src>
    [mkdir] Created dir: <https://builds.apache.org/job/Hive-0.9.1-SNAPSHOT-h0.21/210/artifact/hive/build/anttasks/test/classes>
    [mkdir] Created dir: <https://builds.apache.org/job/Hive-0.9.1-SNAPSHOT-h0.21/210/artifact/hive/build/anttasks/test/resources>
     [copy] Warning: <https://builds.apache.org/job/Hive-0.9.1-SNAPSHOT-h0.21/ws/hive/ant/src/test/resources> does not exist.

init:
     [echo] Project: anttasks

ivy-init-settings:
     [echo] Project: anttasks

ivy-resolve:
     [echo] Project: anttasks
[ivy:resolve] :: loading settings :: file = <https://builds.apache.org/job/Hive-0.9.1-SNAPSHOT-h0.21/ws/hive/ivy/ivysettings.xml>
[ivy:resolve] downloading http://repo1.maven.org/maven2/velocity/velocity/1.5/velocity-1.5.jar ...
[ivy:resolve] ................................................................. (382kB)
[ivy:resolve] .. (0kB)
[ivy:resolve] 	[SUCCESSFUL ] velocity#velocity;1.5!velocity.jar (126ms)
[ivy:resolve] 
[ivy:resolve] :: problems summary ::
[ivy:resolve] :::: WARNINGS
[ivy:resolve] 	io problem while parsing ivy file: http://repo1.maven.org/maven2/commons-lang/commons-lang/2.4/commons-lang-2.4.pom: /home/hudson/.ivy2/cache/commons-lang/commons-lang/ivy-2.4.xml.original (No such file or directory)
[ivy:resolve] 		module not found: commons-lang#commons-lang;2.4
[ivy:resolve] 	==== local: tried
[ivy:resolve] 	  /home/hudson/.ivy2/local/commons-lang/commons-lang/2.4/ivys/ivy.xml
[ivy:resolve] 	  -- artifact commons-lang#commons-lang;2.4!commons-lang.jar:
[ivy:resolve] 	  /home/hudson/.ivy2/local/commons-lang/commons-lang/2.4/jars/commons-lang.jar
[ivy:resolve] 	==== apache-snapshot: tried
[ivy:resolve] 	  https://repository.apache.org/content/repositories/snapshots/commons-lang/commons-lang/2.4/commons-lang-2.4.pom
[ivy:resolve] 	  -- artifact commons-lang#commons-lang;2.4!commons-lang.jar:
[ivy:resolve] 	  https://repository.apache.org/content/repositories/snapshots/commons-lang/commons-lang/2.4/commons-lang-2.4.jar
[ivy:resolve] 	==== maven2: tried
[ivy:resolve] 	  http://repo1.maven.org/maven2/commons-lang/commons-lang/2.4/commons-lang-2.4.pom
[ivy:resolve] 	==== datanucleus-repo: tried
[ivy:resolve] 	  -- artifact commons-lang#commons-lang;2.4!commons-lang.jar:
[ivy:resolve] 	  http://www.datanucleus.org/downloads/maven2/commons-lang/commons-lang/2.4/commons-lang-2.4.jar
[ivy:resolve] 	==== hadoop-source: tried
[ivy:resolve] 	  -- artifact commons-lang#commons-lang;2.4!commons-lang.jar:
[ivy:resolve] 	  http://mirror.facebook.net/facebook/hive-deps/hadoop/core/commons-lang-2.4/commons-lang-2.4.jar
[ivy:resolve] 	==== hadoop-source2: tried
[ivy:resolve] 	  -- artifact commons-lang#commons-lang;2.4!commons-lang.jar:
[ivy:resolve] 	  http://archive.cloudera.com/hive-deps/hadoop/core/commons-lang-2.4/commons-lang-2.4.jar
[ivy:resolve] 		::::::::::::::::::::::::::::::::::::::::::::::
[ivy:resolve] 		::          UNRESOLVED DEPENDENCIES         ::
[ivy:resolve] 		::::::::::::::::::::::::::::::::::::::::::::::
[ivy:resolve] 		:: commons-lang#commons-lang;2.4: not found
[ivy:resolve] 		::::::::::::::::::::::::::::::::::::::::::::::
[ivy:resolve] 
[ivy:resolve] :: USE VERBOSE OR DEBUG MESSAGE LEVEL FOR MORE DETAILS

BUILD FAILED
<https://builds.apache.org/job/Hive-0.9.1-SNAPSHOT-h0.21/ws/hive/build.xml>:256: The following error occurred while executing this line:
<https://builds.apache.org/job/Hive-0.9.1-SNAPSHOT-h0.21/ws/hive/build-common.xml>:132: impossible to resolve dependencies:
	resolve failed - see output for details

Total time: 11 seconds
Build step 'Invoke Ant' marked build as failure
Archiving artifacts
Recording test results