You are viewing a plain text version of this content. The canonical link for it is here.
Posted to dev@lucene.apache.org by Policeman Jenkins Server <je...@thetaphi.de> on 2015/08/18 06:14:28 UTC
[JENKINS] Lucene-Solr-5.x-Windows (32bit/jdk1.7.0_80) - Build #
5036 - Failure!
Build: http://jenkins.thetaphi.de/job/Lucene-Solr-5.x-Windows/5036/
Java: 32bit/jdk1.7.0_80 -server -XX:+UseG1GC
1 tests failed.
FAILED: org.apache.lucene.store.TestSleepingLockWrapper.testStressLocks
Error Message:
IndexWriter hit unexpected exceptions
Stack Trace:
java.lang.AssertionError: IndexWriter hit unexpected exceptions
at __randomizedtesting.SeedInfo.seed([E01231EAB5647778:BE237F17A9C8BF1E]:0)
at org.junit.Assert.fail(Assert.java:93)
at org.junit.Assert.assertTrue(Assert.java:43)
at org.apache.lucene.store.BaseLockFactoryTestCase.testStressLocks(BaseLockFactoryTestCase.java:169)
at sun.reflect.NativeMethodAccessorImpl.invoke0(Native Method)
at sun.reflect.NativeMethodAccessorImpl.invoke(NativeMethodAccessorImpl.java:57)
at sun.reflect.DelegatingMethodAccessorImpl.invoke(DelegatingMethodAccessorImpl.java:43)
at java.lang.reflect.Method.invoke(Method.java:606)
at com.carrotsearch.randomizedtesting.RandomizedRunner.invoke(RandomizedRunner.java:1627)
at com.carrotsearch.randomizedtesting.RandomizedRunner$6.evaluate(RandomizedRunner.java:836)
at com.carrotsearch.randomizedtesting.RandomizedRunner$7.evaluate(RandomizedRunner.java:872)
at com.carrotsearch.randomizedtesting.RandomizedRunner$8.evaluate(RandomizedRunner.java:886)
at org.apache.lucene.util.TestRuleSetupTeardownChained$1.evaluate(TestRuleSetupTeardownChained.java:50)
at org.apache.lucene.util.AbstractBeforeAfterRule$1.evaluate(AbstractBeforeAfterRule.java:46)
at org.apache.lucene.util.TestRuleThreadAndTestName$1.evaluate(TestRuleThreadAndTestName.java:49)
at org.apache.lucene.util.TestRuleIgnoreAfterMaxFailures$1.evaluate(TestRuleIgnoreAfterMaxFailures.java:65)
at org.apache.lucene.util.TestRuleMarkFailure$1.evaluate(TestRuleMarkFailure.java:48)
at com.carrotsearch.randomizedtesting.rules.StatementAdapter.evaluate(StatementAdapter.java:36)
at com.carrotsearch.randomizedtesting.ThreadLeakControl$StatementRunner.run(ThreadLeakControl.java:365)
at com.carrotsearch.randomizedtesting.ThreadLeakControl.forkTimeoutingTask(ThreadLeakControl.java:798)
at com.carrotsearch.randomizedtesting.ThreadLeakControl$3.evaluate(ThreadLeakControl.java:458)
at com.carrotsearch.randomizedtesting.RandomizedRunner.runSingleTest(RandomizedRunner.java:845)
at com.carrotsearch.randomizedtesting.RandomizedRunner$3.evaluate(RandomizedRunner.java:747)
at com.carrotsearch.randomizedtesting.RandomizedRunner$4.evaluate(RandomizedRunner.java:781)
at com.carrotsearch.randomizedtesting.RandomizedRunner$5.evaluate(RandomizedRunner.java:792)
at org.apache.lucene.util.AbstractBeforeAfterRule$1.evaluate(AbstractBeforeAfterRule.java:46)
at com.carrotsearch.randomizedtesting.rules.StatementAdapter.evaluate(StatementAdapter.java:36)
at org.apache.lucene.util.TestRuleStoreClassName$1.evaluate(TestRuleStoreClassName.java:42)
at com.carrotsearch.randomizedtesting.rules.NoShadowingOrOverridesOnMethodsRule$1.evaluate(NoShadowingOrOverridesOnMethodsRule.java:39)
at com.carrotsearch.randomizedtesting.rules.NoShadowingOrOverridesOnMethodsRule$1.evaluate(NoShadowingOrOverridesOnMethodsRule.java:39)
at com.carrotsearch.randomizedtesting.rules.StatementAdapter.evaluate(StatementAdapter.java:36)
at com.carrotsearch.randomizedtesting.rules.StatementAdapter.evaluate(StatementAdapter.java:36)
at com.carrotsearch.randomizedtesting.rules.StatementAdapter.evaluate(StatementAdapter.java:36)
at org.apache.lucene.util.TestRuleAssertionsRequired$1.evaluate(TestRuleAssertionsRequired.java:54)
at org.apache.lucene.util.TestRuleMarkFailure$1.evaluate(TestRuleMarkFailure.java:48)
at org.apache.lucene.util.TestRuleIgnoreAfterMaxFailures$1.evaluate(TestRuleIgnoreAfterMaxFailures.java:65)
at org.apache.lucene.util.TestRuleIgnoreTestSuites$1.evaluate(TestRuleIgnoreTestSuites.java:55)
at com.carrotsearch.randomizedtesting.rules.StatementAdapter.evaluate(StatementAdapter.java:36)
at com.carrotsearch.randomizedtesting.ThreadLeakControl$StatementRunner.run(ThreadLeakControl.java:365)
at java.lang.Thread.run(Thread.java:745)
Build Log:
[...truncated 1767 lines...]
[junit4] Suite: org.apache.lucene.store.TestSleepingLockWrapper
[junit4] 1> Stress Test Index Writer: creation hit unexpected exception: java.nio.file.AccessDeniedException: C:\Users\JenkinsSlave\workspace\Lucene-Solr-5.x-Windows\lucene\build\core\test\J0\temp\lucene.store.TestSleepingLockWrapper_E01231EAB5647778-001\tempDir-003\segments_3
[junit4] 1> java.nio.file.AccessDeniedException: C:\Users\JenkinsSlave\workspace\Lucene-Solr-5.x-Windows\lucene\build\core\test\J0\temp\lucene.store.TestSleepingLockWrapper_E01231EAB5647778-001\tempDir-003\segments_3
[junit4] 1> at sun.nio.fs.WindowsException.translateToIOException(WindowsException.java:83)
[junit4] 1> at sun.nio.fs.WindowsException.rethrowAsIOException(WindowsException.java:97)
[junit4] 1> at sun.nio.fs.WindowsException.rethrowAsIOException(WindowsException.java:102)
[junit4] 1> at sun.nio.fs.WindowsFileSystemProvider.newFileChannel(WindowsFileSystemProvider.java:115)
[junit4] 1> at org.apache.lucene.mockfile.FilterFileSystemProvider.newFileChannel(FilterFileSystemProvider.java:203)
[junit4] 1> at org.apache.lucene.mockfile.DisableFsyncFS.newFileChannel(DisableFsyncFS.java:46)
[junit4] 1> at org.apache.lucene.mockfile.FilterFileSystemProvider.newFileChannel(FilterFileSystemProvider.java:203)
[junit4] 1> at java.nio.channels.FileChannel.open(FileChannel.java:287)
[junit4] 1> at java.nio.channels.FileChannel.open(FileChannel.java:334)
[junit4] 1> at org.apache.lucene.store.MMapDirectory.openInput(MMapDirectory.java:236)
[junit4] 1> at org.apache.lucene.util.LuceneTestCase.slowFileExists(LuceneTestCase.java:2553)
[junit4] 1> at org.apache.lucene.store.MockDirectoryWrapper.openInput(MockDirectoryWrapper.java:640)
[junit4] 1> at org.apache.lucene.store.FilterDirectory.openInput(FilterDirectory.java:89)
[junit4] 1> at org.apache.lucene.store.Directory.openChecksumInput(Directory.java:109)
[junit4] 1> at org.apache.lucene.index.SegmentInfos.readCommit(SegmentInfos.java:294)
[junit4] 1> at org.apache.lucene.index.IndexFileDeleter.<init>(IndexFileDeleter.java:170)
[junit4] 1> at org.apache.lucene.index.IndexWriter.<init>(IndexWriter.java:948)
[junit4] 1> at org.apache.lucene.store.BaseLockFactoryTestCase$WriterThread.run(BaseLockFactoryTestCase.java:197)
[junit4] 2> NOTE: reproduce with: ant test -Dtestcase=TestSleepingLockWrapper -Dtests.method=testStressLocks -Dtests.seed=E01231EAB5647778 -Dtests.slow=true -Dtests.locale=fr_CA -Dtests.timezone=Asia/Choibalsan -Dtests.asserts=true -Dtests.file.encoding=US-ASCII
[junit4] FAILURE 1.00s J0 | TestSleepingLockWrapper.testStressLocks <<<
[junit4] > Throwable #1: java.lang.AssertionError: IndexWriter hit unexpected exceptions
[junit4] > at __randomizedtesting.SeedInfo.seed([E01231EAB5647778:BE237F17A9C8BF1E]:0)
[junit4] > at org.apache.lucene.store.BaseLockFactoryTestCase.testStressLocks(BaseLockFactoryTestCase.java:169)
[junit4] > at java.lang.Thread.run(Thread.java:745)
[junit4] 2> NOTE: leaving temporary files on disk at: C:\Users\JenkinsSlave\workspace\Lucene-Solr-5.x-Windows\lucene\build\core\test\J0\temp\lucene.store.TestSleepingLockWrapper_E01231EAB5647778-001
[junit4] 2> NOTE: test params are: codec=Asserting(Lucene53): {content=PostingsFormat(name=Direct)}, docValues:{}, sim=RandomSimilarityProvider(queryNorm=false,coord=crazy): {content=DFR I(F)L3(800.0)}, locale=fr_CA, timezone=Asia/Choibalsan
[junit4] 2> NOTE: Windows 7 6.1 x86/Oracle Corporation 1.7.0_80 (32-bit)/cpus=3,threads=1,free=175243600,total=400556032
[junit4] 2> NOTE: All tests run in this JVM: [TestMmapDirectory, MultiCollectorTest, TestSimpleFSLockFactory, TestSpanTermQuery, Test2BBinaryDocValues, TestNorms, TestDefaultSimilarity, TestNamedSPILoader, TestSumDocFreq, TestPhraseQuery, TestSortRescorer, TestPositionIncrement, TestFSTs, TestCheckIndex, TestIndexWriterOutOfFileDescriptors, TestSimpleSearchEquivalence, TestBytesRef, TestMatchAllDocsQuery, TestMultiThreadTermVectors, TestTryDelete, TestBufferedChecksum, TestFieldsReader, TestIntsRef, TestIndexWriterUnicode, TestSpans, TestDocValues, Test4GBStoredFields, TestPackedTokenAttributeImpl, TestManyFields, TestIndexWriter, TestBlendedTermQuery, TestIndexWriterNRTIsCurrent, TestWindowsMMap, TestUniqueTermCount, TestStressNRT, TestForceMergeForever, TestFieldReuse, TestBytesRefHash, TestFuzzyQuery, TestSparseFixedBitDocIdSet, Test2BPositions, TestBoolean2, TestTopDocsMerge, TestDocumentsWriterDeleteQueue, TestAutomatonQueryUnicode, TestNGramPhraseQuery, TestLucene53NormsFormat, TestBinaryDocument, TestIntArrayDocIdSet, TestTermsEnum, TestSimilarityBase, TestSimilarityProvider, TestLucene50StoredFieldsFormatHighCompression, TestSegmentReader, TestCollectionUtil, TestLiveFieldValues, TestAtomicUpdate, TestTopDocsCollector, TestOmitTf, TestParallelCompositeReader, TestSpanMultiTermQueryWrapper, TestDemoParallelLeafReader, TestFilterSpans, TestRecyclingByteBlockAllocator, TestSearchWithThreads, TestCustomNorms, TestPerFieldPostingsFormat2, TestTwoPhaseCommitTool, TestIndexWriterDelete, TestIndexWriterMerging, TestMixedDocValuesUpdates, TestExceedMaxTermLength, TestInPlaceMergeSorter, TestFilterIterator, TestDirectoryReaderReopen, TestNRTReaderWithThreads, TestNeverDelete, TestFixedBitDocIdSet, TestBooleanMinShouldMatch, TestByteArrayDataInput, TestAllFilesHaveCodecHeader, TestDirectPacked, Test2BPostings, TestSearch, TestSortedSetSelector, TestDocValuesScoring, TestPerFieldPostingsFormat, TestBufferedIndexInput, TestDuelingCodecs, TestComplexExplanations, TestVirtualMethod, TestIndexWriterExceptions, TestExternalCodecs, TestCachingWrapperFilter, TestSizeBoundedForceMerge, TestBlockPostingsFormat3, TestMinShouldMatch2, TestSloppyMath, TestNot, TestShardSearching, TestMultiPhraseQuery, TestParallelReaderEmptyIndex, TestMultiFields, TestSearcherManager, TestBooleanOr, TestBasics, TestSloppyPhraseQuery, TestIndexWriterMergePolicy, TestIndexWriterCommit, TestSearchAfter, TestHighCompressionMode, TestStressIndexing, TestMinimize, TestDocTermOrdsRewriteMethod, TestTieredMergePolicy, TestArrayUtil, TestConsistentFieldNumbers, TestWeakIdentityMap, TestDirectoryReader, TestBagOfPositions, TestPayloadTermQuery, TestMixedCodecs, TestFlex, TestUTF32ToUTF8, TestFastCompressionMode, TestLazyProxSkipping, TestDeterminism, TestBagOfPostings, TestDisjunctionMaxQuery, TestNearSpansOrdered, TestQueryWrapperFilter, TestTermRangeQuery, TestPayloadNearQuery, TestScorerPerf, TestPayloads, TestWildcard, TestTermRangeFilter, TestSimpleExplanationsOfNonMatches, TestPerSegmentDeletes, TestIntBlockPool, TestBooleanQuery, TestComplexExplanationsOfNonMatches, TestPrefixCodedTerms, TestDocument, TestTermScorer, TestTopFieldCollector, TestFileSwitchDirectory, TestCompiledAutomaton, TestPrefixQuery, TestConjunctions, TestDateSort, TestRollingBuffer, TestSpansAdvanced, TestSameTokenSamePosition, TestBooleanScorer, TestSpanFirstQuery, TestNoMergePolicy, TestByteBlockPool, TestCloseableThreadLocal, TestPrefixFilter, TestCodecHoldsOpenFiles, TestDocBoost, TestSimpleAttributeImpl, TestTerm, TestPositiveScoresOnlyCollector, TestNewestSegment, Test2BPagedBytes, TestReusableStringReader, TestForUtil, TestLucene50CompoundFormat, TestLucene50FieldInfoFormat, TestLucene50SegmentInfoFormat, TestFieldType, TestDocInverterPerFieldErrorInfo, TestDuelingCodecsAtNight, TestExitableDirectoryReader, TestFilterDirectoryReader, TestIndexWriterDeleteByQuery, TestIndexWriterExceptions2, TestIndexWriterFromReader, TestIndexWriterMaxDocs, TestIndexWriterThreadsToSegments, TestInfoStream, TestLogMergePolicy, TestMaxPosition, TestMergeRateLimiter, TestNRTReaderCleanup, TestNumericDocValuesUpdates, TestReadOnlyIndex, TestReaderWrapperDVTypeCheck, TestSegmentInfos, TestStressDeletes, TestTermVectors, TestTerms, TestTragicIndexWriterDeadlock, TestCachingWrapperQuery, TestControlledRealTimeReopenThread, TestDocValuesRewriteMethod, TestFilterCachingPolicy, TestLRUFilterCache, TestMatchNoDocsQuery, TestMultiPhraseEnum, TestSortedNumericSortField, TestSortedSetSortField, TestUsageTrackingFilterCachingPolicy, TestPayloadScoreQuery, TestSpanCollection, TestSpanContainQuery, TestSpanOrQuery, TestSpansEnum, TestFilterDirectory, TestRateLimiter, TestSimpleFSDirectory, TestSleepingLockWrapper]
[junit4] Completed [391/411] on J0 in 1.13s, 6 tests, 1 failure <<< FAILURES!
[...truncated 78 lines...]
BUILD FAILED
C:\Users\JenkinsSlave\workspace\Lucene-Solr-5.x-Windows\build.xml:785: The following error occurred while executing this line:
C:\Users\JenkinsSlave\workspace\Lucene-Solr-5.x-Windows\build.xml:729: The following error occurred while executing this line:
C:\Users\JenkinsSlave\workspace\Lucene-Solr-5.x-Windows\build.xml:59: The following error occurred while executing this line:
C:\Users\JenkinsSlave\workspace\Lucene-Solr-5.x-Windows\lucene\build.xml:50: The following error occurred while executing this line:
C:\Users\JenkinsSlave\workspace\Lucene-Solr-5.x-Windows\lucene\common-build.xml:1449: The following error occurred while executing this line:
C:\Users\JenkinsSlave\workspace\Lucene-Solr-5.x-Windows\lucene\common-build.xml:1003: There were test failures: 411 suites, 3323 tests, 1 failure, 57 ignored (53 assumptions)
Total time: 6 minutes 38 seconds
Build step 'Invoke Ant' marked build as failure
Archiving artifacts
[WARNINGS] Skipping publisher since build result is FAILURE
Recording test results
Email was triggered for: Failure - Any
Sending email for trigger: Failure - Any