You are viewing a plain text version of this content. The canonical link for it is here.
Posted to builds@beam.apache.org by Apache Jenkins Server <je...@builds.apache.org> on 2020/10/23 00:38:05 UTC
Build failed in Jenkins: beam_PostCommit_XVR_Direct #417
See <https://ci-beam.apache.org/job/beam_PostCommit_XVR_Direct/417/display/redirect?page=changes>
Changes:
[Kenneth Knowles] Make checkerframework qualifiers compile+runtime scope
------------------------------------------
[...truncated 536.31 KB...]
Requirement already satisfied: docker in <https://ci-beam.apache.org/job/beam_PostCommit_XVR_Direct/ws/src/build/gradleenv/1922375555/lib/python3.6/site-packages> (from testcontainers<4.0.0,>=3.0.3->apache-beam==2.26.0.dev0) (4.3.1)
Requirement already satisfied: cffi!=1.11.3,>=1.8 in <https://ci-beam.apache.org/job/beam_PostCommit_XVR_Direct/ws/src/build/gradleenv/1922375555/lib/python3.6/site-packages> (from cryptography>=2.1.4->azure-storage-blob>=12.3.2->apache-beam==2.26.0.dev0) (1.14.3)
Requirement already satisfied: isodate>=0.6.0 in <https://ci-beam.apache.org/job/beam_PostCommit_XVR_Direct/ws/src/build/gradleenv/1922375555/lib/python3.6/site-packages> (from msrest>=0.6.10->azure-storage-blob>=12.3.2->apache-beam==2.26.0.dev0) (0.6.0)
Requirement already satisfied: requests-oauthlib>=0.5.0 in <https://ci-beam.apache.org/job/beam_PostCommit_XVR_Direct/ws/src/build/gradleenv/1922375555/lib/python3.6/site-packages> (from msrest>=0.6.10->azure-storage-blob>=12.3.2->apache-beam==2.26.0.dev0) (1.3.0)
Requirement already satisfied: monotonic>=0.1 in <https://ci-beam.apache.org/job/beam_PostCommit_XVR_Direct/ws/src/build/gradleenv/1922375555/lib/python3.6/site-packages> (from fasteners>=0.14->google-apitools<0.5.32,>=0.5.31->apache-beam==2.26.0.dev0) (1.5)
Requirement already satisfied: googleapis-common-protos<2.0dev,>=1.6.0 in <https://ci-beam.apache.org/job/beam_PostCommit_XVR_Direct/ws/src/build/gradleenv/1922375555/lib/python3.6/site-packages> (from google-api-core[grpc]<2.0.0dev,>=1.14.0->google-cloud-datastore<2,>=1.7.1->apache-beam==2.26.0.dev0) (1.52.0)
Requirement already satisfied: google-crc32c<2.0dev,>=1.0; python_version >= "3.5" in <https://ci-beam.apache.org/job/beam_PostCommit_XVR_Direct/ws/src/build/gradleenv/1922375555/lib/python3.6/site-packages> (from google-resumable-media<2.0dev,>=0.6.0->google-cloud-bigquery<2,>=1.6.0->apache-beam==2.26.0.dev0) (1.0.0)
Requirement already satisfied: typing-inspect>=0.4.0 in <https://ci-beam.apache.org/job/beam_PostCommit_XVR_Direct/ws/src/build/gradleenv/1922375555/lib/python3.6/site-packages> (from libcst>=0.2.5->google-cloud-build<3,>=2.0.0->apache-beam==2.26.0.dev0) (0.6.0)
Requirement already satisfied: dataclasses>=0.6.0; python_version < "3.7" in <https://ci-beam.apache.org/job/beam_PostCommit_XVR_Direct/ws/src/build/gradleenv/1922375555/lib/python3.6/site-packages> (from libcst>=0.2.5->google-cloud-build<3,>=2.0.0->apache-beam==2.26.0.dev0) (0.7)
Requirement already satisfied: zipp>=0.5 in <https://ci-beam.apache.org/job/beam_PostCommit_XVR_Direct/ws/src/build/gradleenv/1922375555/lib/python3.6/site-packages> (from importlib-metadata>=0.12; python_version < "3.8"->pytest<5.0,>=4.4.0->apache-beam==2.26.0.dev0) (3.3.1)
Requirement already satisfied: apipkg>=1.4 in <https://ci-beam.apache.org/job/beam_PostCommit_XVR_Direct/ws/src/build/gradleenv/1922375555/lib/python3.6/site-packages> (from execnet>=1.1->pytest-xdist<2,>=1.29.0->apache-beam==2.26.0.dev0) (1.5)
Requirement already satisfied: colorama in <https://ci-beam.apache.org/job/beam_PostCommit_XVR_Direct/ws/src/build/gradleenv/1922375555/lib/python3.6/site-packages> (from crayons->testcontainers<4.0.0,>=3.0.3->apache-beam==2.26.0.dev0) (0.4.4)
Requirement already satisfied: websocket-client>=0.32.0 in <https://ci-beam.apache.org/job/beam_PostCommit_XVR_Direct/ws/src/build/gradleenv/1922375555/lib/python3.6/site-packages> (from docker->testcontainers<4.0.0,>=3.0.3->apache-beam==2.26.0.dev0) (0.57.0)
Requirement already satisfied: pycparser in <https://ci-beam.apache.org/job/beam_PostCommit_XVR_Direct/ws/src/build/gradleenv/1922375555/lib/python3.6/site-packages> (from cffi!=1.11.3,>=1.8->cryptography>=2.1.4->azure-storage-blob>=12.3.2->apache-beam==2.26.0.dev0) (2.20)
Requirement already satisfied: oauthlib>=3.0.0 in <https://ci-beam.apache.org/job/beam_PostCommit_XVR_Direct/ws/src/build/gradleenv/1922375555/lib/python3.6/site-packages> (from requests-oauthlib>=0.5.0->msrest>=0.6.10->azure-storage-blob>=12.3.2->apache-beam==2.26.0.dev0) (3.1.0)
Requirement already satisfied: mypy-extensions>=0.3.0 in <https://ci-beam.apache.org/job/beam_PostCommit_XVR_Direct/ws/src/build/gradleenv/1922375555/lib/python3.6/site-packages> (from typing-inspect>=0.4.0->libcst>=0.2.5->google-cloud-build<3,>=2.0.0->apache-beam==2.26.0.dev0) (0.4.3)
Building wheels for collected packages: apache-beam
Building wheel for apache-beam (setup.py): started
> Task :sdks:go:buildLinuxAmd64
> Task :sdks:go:goBuild
> Task :runners:java-fn-execution:compileJava UP-TO-DATE
> Task :runners:java-fn-execution:classes UP-TO-DATE
> Task :runners:java-fn-execution:jar UP-TO-DATE
> Task :sdks:java:expansion-service:compileJava UP-TO-DATE
> Task :sdks:java:expansion-service:classes UP-TO-DATE
> Task :sdks:java:expansion-service:jar UP-TO-DATE
> Task :sdks:java:testing:expansion-service:compileJava NO-SOURCE
> Task :sdks:java:testing:expansion-service:classes UP-TO-DATE
> Task :runners:java-job-service:compileJava UP-TO-DATE
> Task :runners:java-job-service:classes UP-TO-DATE
> Task :runners:direct-java:compileJava UP-TO-DATE
> Task :runners:direct-java:classes UP-TO-DATE
> Task :runners:java-job-service:jar UP-TO-DATE
> Task :sdks:java:testing:expansion-service:compileTestJava UP-TO-DATE
> Task :sdks:java:testing:expansion-service:testClasses UP-TO-DATE
> Task :runners:portability:java:compileJava UP-TO-DATE
> Task :runners:portability:java:classes UP-TO-DATE
> Task :sdks:java:testing:expansion-service:buildTestExpansionServiceJar UP-TO-DATE
> Task :runners:portability:java:compileTestJava UP-TO-DATE
> Task :runners:portability:java:testClasses UP-TO-DATE
> Task :runners:direct-java:shadowJar UP-TO-DATE
> Task :sdks:python:installGcpTest
Building wheel for apache-beam (setup.py): finished with status 'done'
Created wheel for apache-beam: filename=apache_beam-2.26.0.dev0-py3-none-any.whl size=2305156 sha256=0b7916ffa387c575a11e28313123bce335394cf80c2b6c0e84701f7be684b598
Stored in directory: /home/jenkins/.cache/pip/wheels/17/a0/ae/813f9bdd135d96171d60dd94dd231a1f529a546b1deb1d2eca
Successfully built apache-beam
Installing collected packages: apache-beam
Attempting uninstall: apache-beam
Found existing installation: apache-beam 2.26.0.dev0
Uninstalling apache-beam-2.26.0.dev0:
Successfully uninstalled apache-beam-2.26.0.dev0
> Task :sdks:python:container:resolveBuildDependencies
Resolving ./github.com/apache/beam/sdks/go@<https://ci-beam.apache.org/job/beam_PostCommit_XVR_Direct/ws/src/sdks/go>
> Task :sdks:python:installGcpTest
Successfully installed apache-beam-2.26.0.dev0
> Task :sdks:java:io:kafka:compileJava UP-TO-DATE
> Task :sdks:java:io:kafka:classes UP-TO-DATE
> Task :sdks:java:io:kafka:jar UP-TO-DATE
> Task :sdks:java:io:google-cloud-platform:compileJava UP-TO-DATE
> Task :sdks:java:io:google-cloud-platform:classes UP-TO-DATE
> Task :sdks:java:io:google-cloud-platform:jar UP-TO-DATE
> Task :sdks:python:test-suites:direct:xlang:fnApiJobServerSetup
Waiting for server to start up...
Server started at port 18091
> Task :sdks:java:container:pullLicenses
> Task :sdks:java:container:generateLicenseReport
Deprecated Gradle features were used in this build, making it incompatible with Gradle 7.0.
Use '--warning-mode all' to show the individual deprecation warnings.
See https://docs.gradle.org/6.6.1/userguide/command_line_interface.html#sec:command_line_warnings
BUILD SUCCESSFUL in 1m 2s
1 actionable task: 1 executed
> Task :sdks:java:extensions:sql:compileJava UP-TO-DATE
> Task :sdks:java:extensions:sql:classes UP-TO-DATE
> Task :sdks:java:extensions:sql:jar UP-TO-DATE
> Task :sdks:java:extensions:sql:zetasql:compileJava UP-TO-DATE
> Task :sdks:java:extensions:sql:zetasql:classes UP-TO-DATE
> Task :sdks:java:extensions:sql:zetasql:jar UP-TO-DATE
> Task :sdks:java:extensions:sql:expansion-service:compileJava UP-TO-DATE
> Task :sdks:java:extensions:sql:expansion-service:classes UP-TO-DATE
> Task :sdks:java:extensions:sql:expansion-service:shadowJar UP-TO-DATE
> Task :sdks:java:container:pullLicenses
Publishing build scan...
https://gradle.com/s/qaeg42fch5sug
Already using interpreter /usr/bin/python3
Using base prefix '/usr'
New python executable in <https://ci-beam.apache.org/job/beam_PostCommit_XVR_Direct/ws/src/sdks/java/container/build/virtualenv/bin/python3>
Not overwriting existing python script <https://ci-beam.apache.org/job/beam_PostCommit_XVR_Direct/ws/src/sdks/java/container/build/virtualenv/bin/python> (you must use <https://ci-beam.apache.org/job/beam_PostCommit_XVR_Direct/ws/src/sdks/java/container/build/virtualenv/bin/python3)>
Installing setuptools, pip, wheel...
done.
DEPRECATION: Python 3.5 reached the end of its life on September 13th, 2020. Please upgrade your Python as Python 3.5 is no longer maintained. pip 21.0 will drop support for Python 3.5 in January 2021. pip 21.0 will remove support for this functionality.
Requirement already satisfied: beautifulsoup4<5.0,>=4.9.0 in ./sdks/java/container/build/virtualenv/lib/python3.5/site-packages (from -r <https://ci-beam.apache.org/job/beam_PostCommit_XVR_Direct/ws/src/sdks/java/container/license_scripts/requirement.txt> (line 19)) (4.9.3)
Requirement already satisfied: future<1.0.0,>=0.16.0 in ./sdks/java/container/build/virtualenv/lib/python3.5/site-packages (from -r <https://ci-beam.apache.org/job/beam_PostCommit_XVR_Direct/ws/src/sdks/java/container/license_scripts/requirement.txt> (line 20)) (0.18.2)
Requirement already satisfied: pyyaml<6.0.0,>=3.12 in ./sdks/java/container/build/virtualenv/lib/python3.5/site-packages (from -r <https://ci-beam.apache.org/job/beam_PostCommit_XVR_Direct/ws/src/sdks/java/container/license_scripts/requirement.txt> (line 21)) (5.3.1)
Requirement already satisfied: tenacity<6.0,>=5.0.2 in ./sdks/java/container/build/virtualenv/lib/python3.5/site-packages (from -r <https://ci-beam.apache.org/job/beam_PostCommit_XVR_Direct/ws/src/sdks/java/container/license_scripts/requirement.txt> (line 22)) (5.1.5)
Requirement already satisfied: soupsieve>1.2; python_version >= "3.0" in ./sdks/java/container/build/virtualenv/lib/python3.5/site-packages (from beautifulsoup4<5.0,>=4.9.0->-r <https://ci-beam.apache.org/job/beam_PostCommit_XVR_Direct/ws/src/sdks/java/container/license_scripts/requirement.txt> (line 19)) (2.0.1)
Requirement already satisfied: six>=1.9.0 in ./sdks/java/container/build/virtualenv/lib/python3.5/site-packages (from tenacity<6.0,>=5.0.2->-r <https://ci-beam.apache.org/job/beam_PostCommit_XVR_Direct/ws/src/sdks/java/container/license_scripts/requirement.txt> (line 22)) (1.15.0)
Executing <https://ci-beam.apache.org/job/beam_PostCommit_XVR_Direct/ws/src/sdks/java/container/build/virtualenv/bin/python> <https://ci-beam.apache.org/job/beam_PostCommit_XVR_Direct/ws/src/sdks/java/container/license_scripts/pull_licenses_java.py> --license_dir=<https://ci-beam.apache.org/job/beam_PostCommit_XVR_Direct/ws/src/java_third_party_licenses> --dep_url_yaml=<https://ci-beam.apache.org/job/beam_PostCommit_XVR_Direct/ws/src/sdks/java/container/license_scripts/dep_urls_java.yaml>
> Task :sdks:python:container:installDependencies
> Task :sdks:python:container:buildDarwinAmd64 UP-TO-DATE
> Task :sdks:python:container:buildLinuxAmd64 UP-TO-DATE
> Task :sdks:python:container:goBuild
> Task :sdks:python:container:py38:copyLauncherDependencies
> Task :sdks:java:container:pullLicenses
INFO:root:Pulling license for 180 dependencies using 16 threads.
> Task :sdks:python:container:py38:dockerPrepare
> Task :sdks:java:container:pullLicenses
INFO:root:pull_licenses_java.py succeed. It took 2.902912 seconds with 16 threads.
> Task :sdks:java:container:copyDockerfileDependencies UP-TO-DATE
> Task :sdks:java:container:resolveBuildDependencies
Resolving ./github.com/apache/beam/sdks/go@<https://ci-beam.apache.org/job/beam_PostCommit_XVR_Direct/ws/src/sdks/go>
> Task :sdks:java:container:installDependencies
> Task :sdks:java:container:buildLinuxAmd64 UP-TO-DATE
> Task :sdks:java:container:goBuild
> Task :sdks:python:container:py38:docker
---> Running in 610dd1cc5140
Removing intermediate container 610dd1cc5140
---> c2052b54b627
Step 4/23 : ARG pull_licenses
---> Running in ba2010c11546
Removing intermediate container ba2010c11546
---> 0dfe826c7274
Step 5/23 : RUN apt-get update && apt-get install -y libsnappy-dev libyaml-dev ccache && rm -rf /var/lib/apt/lists/*
---> Running in ef3057344c96
Get:1 http://security.debian.org/debian-security buster/updates InRelease [65.4 kB]
Get:2 http://deb.debian.org/debian buster InRelease [121 kB]
Get:3 http://deb.debian.org/debian buster-updates InRelease [51.9 kB]
Get:4 http://security.debian.org/debian-security buster/updates/main amd64 Packages [243 kB]
Get:5 http://deb.debian.org/debian buster/main amd64 Packages [7906 kB]
Get:6 http://deb.debian.org/debian buster-updates/main amd64 Packages [7868 B]
> Task :sdks:java:container:dockerPrepare
> Task :sdks:java:container:docker
> Task :sdks:python:container:py38:docker
Collecting oauth2client==4.1.3
Downloading oauth2client-4.1.3-py2.py3-none-any.whl (98 kB)
Collecting protobuf==3.12.2
Downloading protobuf-3.12.2-cp38-cp38-manylinux1_x86_64.whl (1.3 MB)
Collecting pyarrow==0.16.0
Downloading pyarrow-0.16.0-cp38-cp38-manylinux2014_x86_64.whl (63.2 MB)
[91mERROR: Exception:
Traceback (most recent call last):
File "/usr/local/lib/python3.8/site-packages/pip/_vendor/urllib3/response.py", line 437, in _error_catcher
yield
File "/usr/local/lib/python3.8/site-packages/pip/_vendor/urllib3/response.py", line 519, in read
data = self._fp.read(amt) if not fp_closed else b""
File "/usr/local/lib/python3.8/site-packages/pip/_vendor/cachecontrol/filewrapper.py", line 62, in read
data = self.__fp.read(amt)
File "/usr/local/lib/python3.8/http/client.py", line 458, in read
n = self.readinto(b)
File "/usr/local/lib/python3.8/http/client.py", line 502, in readinto
n = self.fp.readinto(b)
File "/usr/local/lib/python3.8/socket.py", line 669, in readinto
return self._sock.recv_into(b)
File "/usr/local/lib/python3.8/ssl.py", line 1241, in recv_into
return self.read(nbytes, buffer)
File "/usr/local/lib/python3.8/ssl.py", line 1099, in read
return self._sslobj.read(len, buffer)
ConnectionResetError: [Errno 104] Connection reset by peer
During handling of the above exception, another exception occurred:
Traceback (most recent call last):
File "/usr/local/lib/python3.8/site-packages/pip/_internal/cli/base_command.py", line 228, in _main
status = self.run(options, args)
File "/usr/local/lib/python3.8/site-packages/pip/_internal/cli/req_command.py", line 182, in wrapper
return func(self, options, args)
File "/usr/local/lib/python3.8/site-packages/pip/_internal/commands/install.py", line 323, in run
requirement_set = resolver.resolve(
File "/usr/local/lib/python3.8/site-packages/pip/_internal/resolution/legacy/resolver.py", line 183, in resolve
discovered_reqs.extend(self._resolve_one(requirement_set, req))
File "/usr/local/lib/python3.8/site-packages/pip/_internal/resolution/legacy/resolver.py", line 388, in _resolve_one
abstract_dist = self._get_abstract_dist_for(req_to_install)
File "/usr/local/lib/python3.8/site-packages/pip/_internal/resolution/legacy/resolver.py", line 340, in _get_abstract_dist_for
abstract_dist = self.preparer.prepare_linked_requirement(req)
File "/usr/local/lib/python3.8/site-packages/pip/_internal/operations/prepare.py", line 467, in prepare_linked_requirement
local_file = unpack_url(
File "/usr/local/lib/python3.8/site-packages/pip/_internal/operations/prepare.py", line 255, in unpack_url
file = get_http_url(
File "/usr/local/lib/python3.8/site-packages/pip/_internal/operations/prepare.py", line 129, in get_http_url
from_path, content_type = _download_http_url(
File "/usr/local/lib/python3.8/site-packages/pip/_internal/operations/prepare.py", line 282, in _download_http_url
for chunk in download.chunks:
File "/usr/local/lib/python3.8/site-packages/pip/_internal/cli/progress_bars.py", line 168, in iter
for x in it:
File "/usr/local/lib/python3.8/site-packages/pip/_internal/network/utils.py", line 64, in response_chunks
for chunk in response.raw.stream(
File "/usr/local/lib/python3.8/site-packages/pip/_vendor/urllib3/response.py", line 576, in stream
data = self.read(amt=amt, decode_content=decode_content)
File "/usr/local/lib/python3.8/site-packages/pip/_vendor/urllib3/response.py", line 541, in read
raise IncompleteRead(self._fp_bytes_read, self.length_remaining)
File "/usr/local/lib/python3.8/contextlib.py", line 131, in __exit__
self.gen.throw(type, value, traceback)
File "/usr/local/lib/python3.8/site-packages/pip/_vendor/urllib3/response.py", line 455, in _error_catcher
raise ProtocolError("Connection broken: %r" % e, e)
pip._vendor.urllib3.exceptions.ProtocolError: ("Connection broken: ConnectionResetError(104, 'Connection reset by peer')", ConnectionResetError(104, 'Connection reset by peer'))
[0mThe command '/bin/sh -c pip install -r /tmp/base_image_requirements.txt && python -c "from google.protobuf.internal import api_implementation; assert api_implementation._default_implementation_type == 'cpp'; print ('Verified fast protobuf used.')" && rm -rf /root/.cache/pip && rm -rf /tmp/base_image_requirements.txt' returned a non-zero code: 2
> Task :sdks:python:container:py38:docker FAILED
> Task :sdks:python:test-suites:direct:xlang:fnApiJobServerCleanup
Killing process at 29865
FAILURE: Build failed with an exception.
* What went wrong:
Execution failed for task ':sdks:python:container:py38:docker'.
> Process 'command 'docker'' finished with non-zero exit value 2
* Try:
Run with --stacktrace option to get the stack trace. Run with --info or --debug option to get more log output. Run with --scan to get full insights.
* Get more help at https://help.gradle.org
Deprecated Gradle features were used in this build, making it incompatible with Gradle 7.0.
Use '--warning-mode all' to show the individual deprecation warnings.
See https://docs.gradle.org/6.6.1/userguide/command_line_interface.html#sec:command_line_warnings
BUILD FAILED in 2m 11s
123 actionable tasks: 28 executed, 95 up-to-date
Publishing build scan...
https://gradle.com/s/dlfyz6rjugv4e
Build step 'Invoke Gradle script' changed build result to FAILURE
Build step 'Invoke Gradle script' marked build as failure
No JDK named ‘JDK 1.8 (latest)’ found
---------------------------------------------------------------------
To unsubscribe, e-mail: builds-unsubscribe@beam.apache.org
For additional commands, e-mail: builds-help@beam.apache.org
Jenkins build is back to normal : beam_PostCommit_XVR_Direct #418
Posted by Apache Jenkins Server <je...@builds.apache.org>.
See <https://ci-beam.apache.org/job/beam_PostCommit_XVR_Direct/418/display/redirect?page=changes>
---------------------------------------------------------------------
To unsubscribe, e-mail: builds-unsubscribe@beam.apache.org
For additional commands, e-mail: builds-help@beam.apache.org