You are viewing a plain text version of this content. The canonical link for it is here.
Posted to builds@lucene.apache.org by Policeman Jenkins Server via builds <bu...@lucene.apache.org> on 2026/10/05 21:27:49 UTC

[JENKINS] Lucene-MMAPv2-macOS (64bit/hotspot/jdk-26.0.2) - Build # 2204 - Unstable!

Build: https://jenkins.thetaphi.de/job/Lucene-MMAPv2-macOS/2204/
Java: 64bit/hotspot/jdk-26.0.2 -XX:-UseCompressedOops -XX:+UseZGC

1 tests failed.
FAILED:  org.apache.lucene.sandbox.codecs.dedup.TestDedupScalarQuantizedVectorsFormat.testAllEncodingsMergeAndSearch

Error Message:
java.lang.AssertionError: expected:<20> but was:<23>

Stack Trace:
java.lang.AssertionError: expected:<20> but was:<23>
	at __randomizedtesting.SeedInfo.seed([AD6330E90495EC75:15D45B241BAC2374]:0)
	at junit@4.13.2/org.junit.Assert.fail(Assert.java:89)
	at junit@4.13.2/org.junit.Assert.failNotEquals(Assert.java:835)
	at junit@4.13.2/org.junit.Assert.assertEquals(Assert.java:647)
	at junit@4.13.2/org.junit.Assert.assertEquals(Assert.java:633)
	at org.apache.lucene.sandbox.codecs.dedup.TestDedupScalarQuantizedVectorsFormat.testAllEncodingsMergeAndSearch(TestDedupScalarQuantizedVectorsFormat.java:381)