You are viewing a plain text version of this content. The canonical link for it is here.
Posted to builds@cassandra.apache.org by Apache Jenkins Server <je...@builds.apache.org> on 2021/03/05 21:44:21 UTC
Build complete: Cassandra-trunk #308 [UNSTABLE]
0979bda958a35f748b30ce102872278bfbafa578
-------------------------------------------------------------------------------
Build Cassandra-trunk #308 Still Unstable
URL: https://ci-cassandra.apache.org/job/Cassandra-trunk/308/
-------------------------------------------------------------------------------
Changes:
[Marcus Eriksson] Add possibility to copy SSTables in SSTableImporter instead of moving
[Marcus Eriksson] Expose data dirs to ColumnFamilyStoreMBean
-------------------------------------------------------------------------------
Failed Tests:
19 tests failed.
FAILED: dtest-offheap.disk_balance_test.TestDiskBalance.test_disk_balance_after_joining_ring_lcs
FAILED: dtest-upgrade.upgrade_tests.paging_test.TestPagingWithDeletionsNodes2RF1_Upgrade_indev_3_0_x_To_indev_trunk.test_failure_threshold_deletions
FAILED: dtest-upgrade.upgrade_tests.paging_test.TestPagingWithDeletionsNodes2RF1_Upgrade_indev_3_11_x_To_indev_trunk.test_failure_threshold_deletions
FAILED: dtest-upgrade.upgrade_tests.paging_test.TestPagingWithDeletionsNodes3RF3_Upgrade_indev_3_0_x_To_indev_trunk.test_failure_threshold_deletions
FAILED: dtest-upgrade.upgrade_tests.paging_test.cls.test_failure_threshold_deletions
FAILED: dtest-upgrade.upgrade_tests.paging_test.TestPagingWithDeletionsNodes3RF3_Upgrade_indev_3_11_x_To_indev_trunk.test_failure_threshold_deletions
FAILED: org.apache.cassandra.db.marshal.ValueAccessorTest.testSlice-compression
FAILED: org.apache.cassandra.audit.AuditLoggerAuthTest.BeforeFirstTest
FAILED: org.apache.cassandra.transport.CQLUserAuditTest.BeforeFirstTest
FAILED: dtest-novnode.cql_test.TestCQLSlowQuery.test_local_query
FAILED: dtest-novnode.cql_test.TestCQLSlowQuery.test_remote_query
FAILED: dtest-offheap.cql_test.TestCQLSlowQuery.test_local_query
FAILED: dtest-offheap.cql_test.TestCQLSlowQuery.test_remote_query
FAILED: dtest.cql_test.TestCQLSlowQuery.test_local_query
FAILED: dtest.cql_test.TestCQLSlowQuery.test_remote_query
FAILED: org.apache.cassandra.concurrent.LongSharedExecutorPoolTest.testPromptnessOfExecution
FAILED: org.apache.cassandra.distributed.test.IPMembershipTest.sameIPFailWithoutReplace
FAILED: org.apache.cassandra.distributed.test.TopologyChangeTest.testRestartNode[1: provision strategy=OneNetworkInterface]
FAILED: org.apache.cassandra.distributed.test.TopologyChangeTest.testDecommission[1: provision strategy=OneNetworkInterface]
-------------------------------------------------------------------------------
For complete test report and logs see https://nightlies.apache.org/cassandra/Cassandra-trunk/308/