You are viewing a plain text version of this content. The canonical link for it is here.
Posted to dev@kafka.apache.org by Apache Jenkins Server <je...@builds.apache.org> on 2016/01/12 03:57:58 UTC

Build failed in Jenkins: kafka-trunk-jdk8 #282

See <https://builds.apache.org/job/kafka-trunk-jdk8/282/changes>

Changes:

[wangguoz] MINOR: remove unused TimeUnit from MetricConfig

------------------------------------------
[...truncated 1452 lines...]

kafka.KafkaTest > testGetKafkaConfigFromArgsNonArgsOnly PASSED

kafka.KafkaTest > testGetKafkaConfigFromArgsNonArgsAtTheBegging PASSED

kafka.metrics.KafkaTimerTest > testKafkaTimer PASSED

kafka.utils.UtilsTest > testAbs PASSED

kafka.utils.UtilsTest > testReplaceSuffix PASSED

kafka.utils.UtilsTest > testCircularIterator PASSED

kafka.utils.UtilsTest > testReadBytes PASSED

kafka.utils.UtilsTest > testCsvList PASSED

kafka.utils.UtilsTest > testReadInt PASSED

kafka.utils.UtilsTest > testCsvMap PASSED

kafka.utils.UtilsTest > testInLock PASSED

kafka.utils.UtilsTest > testSwallow PASSED

kafka.utils.SchedulerTest > testMockSchedulerNonPeriodicTask PASSED

kafka.utils.SchedulerTest > testMockSchedulerPeriodicTask PASSED

kafka.utils.SchedulerTest > testNonPeriodicTask PASSED

kafka.utils.SchedulerTest > testRestart PASSED

kafka.utils.SchedulerTest > testReentrantTaskInMockScheduler PASSED

kafka.utils.SchedulerTest > testPeriodicTask PASSED

kafka.utils.ByteBoundedBlockingQueueTest > testByteBoundedBlockingQueue PASSED

kafka.utils.timer.TimerTaskListTest > testAll PASSED

kafka.utils.timer.TimerTest > testAlreadyExpiredTask PASSED

kafka.utils.timer.TimerTest > testTaskExpiration PASSED

kafka.utils.CommandLineUtilsTest > testParseEmptyArg PASSED

kafka.utils.CommandLineUtilsTest > testParseSingleArg PASSED

kafka.utils.CommandLineUtilsTest > testParseArgs PASSED

kafka.utils.IteratorTemplateTest > testIterator PASSED

kafka.utils.ReplicationUtilsTest > testUpdateLeaderAndIsr PASSED

kafka.utils.ReplicationUtilsTest > testGetLeaderIsrAndEpochForPartition PASSED

kafka.utils.JsonTest > testJsonEncoding PASSED

kafka.message.MessageCompressionTest > testCompressSize PASSED

kafka.message.MessageCompressionTest > testSimpleCompressDecompress PASSED

kafka.message.MessageWriterTest > testWithNoCompressionAttribute PASSED

kafka.message.MessageWriterTest > testWithCompressionAttribute PASSED

kafka.message.MessageWriterTest > testBufferingOutputStream PASSED

kafka.message.MessageWriterTest > testWithKey PASSED

kafka.message.MessageTest > testChecksum PASSED

kafka.message.MessageTest > testIsHashable PASSED

kafka.message.MessageTest > testFieldValues PASSED

kafka.message.MessageTest > testEquality PASSED

kafka.message.ByteBufferMessageSetTest > testOffsetAssignment PASSED

kafka.message.ByteBufferMessageSetTest > testValidBytes PASSED

kafka.message.ByteBufferMessageSetTest > testValidBytesWithCompression PASSED

kafka.message.ByteBufferMessageSetTest > testIteratorIsConsistent PASSED

kafka.message.ByteBufferMessageSetTest > testWrittenEqualsRead PASSED

kafka.message.ByteBufferMessageSetTest > testWriteTo PASSED

kafka.message.ByteBufferMessageSetTest > testEquals PASSED

kafka.message.ByteBufferMessageSetTest > testSizeInBytes PASSED

kafka.message.ByteBufferMessageSetTest > testIterator PASSED

kafka.tools.ConsoleProducerTest > testParseKeyProp PASSED

kafka.tools.ConsoleProducerTest > testValidConfigsOldProducer PASSED

kafka.tools.ConsoleProducerTest > testInvalidConfigs PASSED

kafka.tools.ConsoleProducerTest > testValidConfigsNewProducer PASSED

kafka.network.SocketServerTest > testMaxConnectionsPerIp PASSED

kafka.network.SocketServerTest > simpleRequest PASSED

kafka.network.SocketServerTest > testSessionPrincipal PASSED

kafka.network.SocketServerTest > testSocketsCloseOnShutdown PASSED

kafka.network.SocketServerTest > testMaxConnectionsPerIPOverrides PASSED

kafka.network.SocketServerTest > testSslSocketServer PASSED

kafka.network.SocketServerTest > tooBigRequestIsRejected PASSED

kafka.zk.ZKPathTest > testCreatePersistentSequentialThrowsException PASSED

kafka.zk.ZKPathTest > testCreatePersistentSequentialExists PASSED

kafka.zk.ZKPathTest > testCreateEphemeralPathExists PASSED

kafka.zk.ZKPathTest > testCreatePersistentPath PASSED

kafka.zk.ZKPathTest > testMakeSurePersistsPathExistsThrowsException PASSED

kafka.zk.ZKPathTest > testCreateEphemeralPathThrowsException PASSED

kafka.zk.ZKPathTest > testCreatePersistentPathThrowsException PASSED

kafka.zk.ZKPathTest > testMakeSurePersistsPathExists PASSED

kafka.zk.ZKEphemeralTest > testOverlappingSessions[0] PASSED

kafka.zk.ZKEphemeralTest > testEphemeralNodeCleanup[0] PASSED

kafka.zk.ZKEphemeralTest > testZkWatchedEphemeral[0] PASSED

kafka.zk.ZKEphemeralTest > testSameSession[0] PASSED

kafka.zk.ZKEphemeralTest > testOverlappingSessions[1] PASSED

kafka.zk.ZKEphemeralTest > testEphemeralNodeCleanup[1] PASSED

kafka.zk.ZKEphemeralTest > testZkWatchedEphemeral[1] PASSED

kafka.zk.ZKEphemeralTest > testSameSession[1] PASSED

kafka.common.ConfigTest > testInvalidGroupIds PASSED

kafka.common.ConfigTest > testInvalidClientIds PASSED

kafka.common.TopicTest > testInvalidTopicNames PASSED

kafka.common.TopicTest > testTopicHasCollision PASSED

kafka.common.TopicTest > testTopicHasCollisionChars PASSED

kafka.common.ZkNodeChangeNotificationListenerTest > testProcessNotification PASSED
:test_core_2_11
Building project 'core' with Scala version 2.11.7
:kafka-trunk-jdk8:clients:compileJava UP-TO-DATE
:kafka-trunk-jdk8:clients:processResources UP-TO-DATE
:kafka-trunk-jdk8:clients:classes UP-TO-DATE
:kafka-trunk-jdk8:clients:determineCommitId UP-TO-DATE
:kafka-trunk-jdk8:clients:createVersionFile
:kafka-trunk-jdk8:clients:jar UP-TO-DATE
:kafka-trunk-jdk8:clients:compileTestJava UP-TO-DATE
:kafka-trunk-jdk8:clients:processTestResources UP-TO-DATE
:kafka-trunk-jdk8:clients:testClasses UP-TO-DATE
:kafka-trunk-jdk8:core:compileJava UP-TO-DATE
:kafka-trunk-jdk8:core:compileScalaJava HotSpot(TM) 64-Bit Server VM warning: ignoring option MaxPermSize=512m; support was removed in 8.0

/x1/jenkins/jenkins-slave/workspace/kafka-trunk-jdk8/core/src/main/scala/kafka/api/OffsetCommitRequest.scala:79: value DEFAULT_TIMESTAMP in object OffsetCommitRequest is deprecated: see corresponding Javadoc for more information.
            org.apache.kafka.common.requests.OffsetCommitRequest.DEFAULT_TIMESTAMP
                                                                 ^
/x1/jenkins/jenkins-slave/workspace/kafka-trunk-jdk8/core/src/main/scala/kafka/common/OffsetMetadataAndError.scala:36: value DEFAULT_TIMESTAMP in object OffsetCommitRequest is deprecated: see corresponding Javadoc for more information.
                             commitTimestamp: Long = org.apache.kafka.common.requests.OffsetCommitRequest.DEFAULT_TIMESTAMP,
                                                                                                          ^
/x1/jenkins/jenkins-slave/workspace/kafka-trunk-jdk8/core/src/main/scala/kafka/common/OffsetMetadataAndError.scala:37: value DEFAULT_TIMESTAMP in object OffsetCommitRequest is deprecated: see corresponding Javadoc for more information.
                             expireTimestamp: Long = org.apache.kafka.common.requests.OffsetCommitRequest.DEFAULT_TIMESTAMP) {
                                                                                                          ^
/x1/jenkins/jenkins-slave/workspace/kafka-trunk-jdk8/core/src/main/scala/kafka/coordinator/GroupMetadataManager.scala:394: value DEFAULT_TIMESTAMP in object OffsetCommitRequest is deprecated: see corresponding Javadoc for more information.
                          if (value.expireTimestamp == org.apache.kafka.common.requests.OffsetCommitRequest.DEFAULT_TIMESTAMP)
                                                                                                            ^
/x1/jenkins/jenkins-slave/workspace/kafka-trunk-jdk8/core/src/main/scala/kafka/server/KafkaApis.scala:293: value DEFAULT_TIMESTAMP in object OffsetCommitRequest is deprecated: see corresponding Javadoc for more information.
            if (offsetAndMetadata.commitTimestamp == org.apache.kafka.common.requests.OffsetCommitRequest.DEFAULT_TIMESTAMP)
                                                                                                          ^
/x1/jenkins/jenkins-slave/workspace/kafka-trunk-jdk8/core/src/main/scala/kafka/server/KafkaServer.scala:301: a pure expression does nothing in statement position; you may be omitting necessary parentheses
    ControllerStats.uncleanLeaderElectionRate
                    ^
/x1/jenkins/jenkins-slave/workspace/kafka-trunk-jdk8/core/src/main/scala/kafka/server/KafkaServer.scala:302: a pure expression does nothing in statement position; you may be omitting necessary parentheses
    ControllerStats.leaderElectionTimer
                    ^
/x1/jenkins/jenkins-slave/workspace/kafka-trunk-jdk8/core/src/main/scala/kafka/admin/AclCommand.scala:245: method readLine in class DeprecatedConsole is deprecated: Use the method in scala.io.StdIn
    Console.readLine().equalsIgnoreCase("y")
            ^
/x1/jenkins/jenkins-slave/workspace/kafka-trunk-jdk8/core/src/main/scala/kafka/admin/TopicCommand.scala:366: method readLine in class DeprecatedConsole is deprecated: Use the method in scala.io.StdIn
    if (!Console.readLine().equalsIgnoreCase("y")) {
                 ^
/x1/jenkins/jenkins-slave/workspace/kafka-trunk-jdk8/core/src/main/scala/kafka/controller/ControllerChannelManager.scala:389: class BrokerEndPoint in object UpdateMetadataRequest is deprecated: see corresponding Javadoc for more information.
              new UpdateMetadataRequest.BrokerEndPoint(brokerEndPoint.id, brokerEndPoint.host, brokerEndPoint.port)
                                        ^
/x1/jenkins/jenkins-slave/workspace/kafka-trunk-jdk8/core/src/main/scala/kafka/controller/ControllerChannelManager.scala:391: constructor UpdateMetadataRequest in class UpdateMetadataRequest is deprecated: see corresponding Javadoc for more information.
            new UpdateMetadataRequest(controllerId, controllerEpoch, liveBrokers.asJava, partitionStates.asJava)
            ^
/x1/jenkins/jenkins-slave/workspace/kafka-trunk-jdk8/core/src/main/scala/kafka/network/BlockingChannel.scala:129: method readFromReadableChannel in class NetworkReceive is deprecated: see corresponding Javadoc for more information.
      response.readFromReadableChannel(channel)
               ^
there were 15 feature warnings; re-run with -feature for details
13 warnings found
warning: [options] bootstrap class path not set in conjunction with -source 1.7
1 warning
:kafka-trunk-jdk8:core:processResources UP-TO-DATE
:kafka-trunk-jdk8:core:classes
:kafka-trunk-jdk8:core:checkstyleMain
:kafka-trunk-jdk8:core:compileTestJava UP-TO-DATE
:kafka-trunk-jdk8:core:compileTestScala
/x1/jenkins/jenkins-slave/workspace/kafka-trunk-jdk8/core/src/test/scala/integration/kafka/api/QuotasTest.scala:74: value BLOCK_ON_BUFFER_FULL_CONFIG in object ProducerConfig is deprecated: see corresponding Javadoc for more information.
    producerProps.put(ProducerConfig.BLOCK_ON_BUFFER_FULL_CONFIG, "false")
                                     ^
/x1/jenkins/jenkins-slave/workspace/kafka-trunk-jdk8/core/src/test/scala/kafka/tools/TestLogCleaning.scala:250: value BLOCK_ON_BUFFER_FULL_CONFIG in object ProducerConfig is deprecated: see corresponding Javadoc for more information.
    producerProps.setProperty(ProducerConfig.BLOCK_ON_BUFFER_FULL_CONFIG, "true")
                                             ^
there were four feature warnings; re-run with -feature for details
three warnings found
:kafka-trunk-jdk8:core:processTestResources
:test_core_2_11 FAILED

FAILURE: Build failed with an exception.

* What went wrong:
org.gradle.api.internal.changedetection.state.DefaultFileCollectionSnapshotter$FileCollectionSnapshotImpl cannot be cast to org.gradle.api.internal.changedetection.state.OutputFilesCollectionSnapshotter$OutputFilesSnapshot

* Try:
Run with --stacktrace option to get the stack trace. Run with --info or --debug option to get more log output.

BUILD FAILED

Total time: 45 mins 24.352 secs
Build step 'Execute shell' marked build as failure
Recording test results
Setting JDK1_8_0_45_HOME=/home/jenkins/jenkins-slave/tools/hudson.model.JDK/jdk1.8.0_45
Setting GRADLE_2_4_RC_2_HOME=/home/jenkins/jenkins-slave/tools/hudson.plugins.gradle.GradleInstallation/Gradle_2.4-rc-2
Setting JDK1_8_0_45_HOME=/home/jenkins/jenkins-slave/tools/hudson.model.JDK/jdk1.8.0_45
Setting GRADLE_2_4_RC_2_HOME=/home/jenkins/jenkins-slave/tools/hudson.plugins.gradle.GradleInstallation/Gradle_2.4-rc-2

Jenkins build is back to normal : kafka-trunk-jdk8 #292

Posted by Apache Jenkins Server <je...@builds.apache.org>.
See <https://builds.apache.org/job/kafka-trunk-jdk8/292/changes>


Build failed in Jenkins: kafka-trunk-jdk8 #291

Posted by Apache Jenkins Server <je...@builds.apache.org>.
See <https://builds.apache.org/job/kafka-trunk-jdk8/291/changes>

Changes:

[wangguoz] KAFKA-2993: Calculate compression rate at close() call

------------------------------------------
Started by an SCM change
[EnvInject] - Loading node environment variables.
Building remotely on H11 (Ubuntu ubuntu) in workspace <https://builds.apache.org/job/kafka-trunk-jdk8/ws/>
 > git rev-parse --is-inside-work-tree # timeout=10
Fetching changes from the remote Git repository
 > git config remote.origin.url https://git-wip-us.apache.org/repos/asf/kafka.git # timeout=10
Fetching upstream changes from https://git-wip-us.apache.org/repos/asf/kafka.git
 > git --version # timeout=10
 > git -c core.askpass=true fetch --tags --progress https://git-wip-us.apache.org/repos/asf/kafka.git +refs/heads/*:refs/remotes/origin/*
 > git rev-parse refs/remotes/origin/trunk^{commit} # timeout=10
 > git rev-parse refs/remotes/origin/origin/trunk^{commit} # timeout=10
Checking out Revision a071e3554bf626182557dfaca491afebe9c17020 (refs/remotes/origin/trunk)
 > git config core.sparsecheckout # timeout=10
 > git checkout -f a071e3554bf626182557dfaca491afebe9c17020
 > git rev-list 6dc974312590f089c9e0ac27e8eb9b848caf32b5 # timeout=10
Setting JDK1_8_0_45_HOME=/home/jenkins/jenkins-slave/tools/hudson.model.JDK/jdk1.8.0_45
Setting GRADLE_2_4_RC_2_HOME=/home/jenkins/jenkins-slave/tools/hudson.plugins.gradle.GradleInstallation/Gradle_2.4-rc-2
[kafka-trunk-jdk8] $ /bin/bash -xe /tmp/hudson7877794870241702028.sh
+ /home/jenkins/jenkins-slave/tools/hudson.plugins.gradle.GradleInstallation/Gradle_2.4-rc-2/bin/gradle
To honour the JVM settings for this build a new JVM will be forked. Please consider using the daemon: http://gradle.org/docs/2.4-rc-2/userguide/gradle_daemon.html.
Building project 'core' with Scala version 2.10.6
:downloadWrapper

BUILD SUCCESSFUL

Total time: 10.14 secs
Setting JDK1_8_0_45_HOME=/home/jenkins/jenkins-slave/tools/hudson.model.JDK/jdk1.8.0_45
Setting GRADLE_2_4_RC_2_HOME=/home/jenkins/jenkins-slave/tools/hudson.plugins.gradle.GradleInstallation/Gradle_2.4-rc-2
[kafka-trunk-jdk8] $ /bin/bash -xe /tmp/hudson1511679139988647922.sh
+ export GRADLE_OPTS=-Xmx1024m
+ GRADLE_OPTS=-Xmx1024m
+ ./gradlew -Dorg.gradle.project.maxParallelForks=1 clean jarAll testAll
To honour the JVM settings for this build a new JVM will be forked. Please consider using the daemon: https://docs.gradle.org/2.10/userguide/gradle_daemon.html.
Building project 'core' with Scala version 2.10.6
:clean UP-TO-DATE
:clients:clean UP-TO-DATE
:connect:clean UP-TO-DATE
:core:clean UP-TO-DATE
:examples:clean UP-TO-DATE
:log4j-appender:clean UP-TO-DATE
:streams:clean UP-TO-DATE
:tools:clean UP-TO-DATE
:connect:api:clean UP-TO-DATE
:connect:file:clean UP-TO-DATE
:connect:json:clean UP-TO-DATE
:connect:runtime:clean UP-TO-DATE
:jar_core_2_10
Building project 'core' with Scala version 2.10.6
:kafka-trunk-jdk8:clients:compileJava
:jar_core_2_10 FAILED

FAILURE: Build failed with an exception.

* What went wrong:
Failed to capture snapshot of input files for task 'compileJava' during up-to-date check.  See stacktrace for details.
> Could not add entry '/home/jenkins/.gradle/caches/modules-2/files-2.1/net.jpountz.lz4/lz4/1.3.0/c708bb2590c0652a642236ef45d9f99ff842a2ce/lz4-1.3.0.jar' to cache fileHashes.bin (<https://builds.apache.org/job/kafka-trunk-jdk8/ws/.gradle/2.10/taskArtifacts/fileHashes.bin).>

* Try:
Run with --stacktrace option to get the stack trace. Run with --info or --debug option to get more log output.

BUILD FAILED

Total time: 10.005 secs
Build step 'Execute shell' marked build as failure
Recording test results
Setting JDK1_8_0_45_HOME=/home/jenkins/jenkins-slave/tools/hudson.model.JDK/jdk1.8.0_45
Setting GRADLE_2_4_RC_2_HOME=/home/jenkins/jenkins-slave/tools/hudson.plugins.gradle.GradleInstallation/Gradle_2.4-rc-2
ERROR: Publisher 'Publish JUnit test result report' failed: No test report files were found. Configuration error?
Setting JDK1_8_0_45_HOME=/home/jenkins/jenkins-slave/tools/hudson.model.JDK/jdk1.8.0_45
Setting GRADLE_2_4_RC_2_HOME=/home/jenkins/jenkins-slave/tools/hudson.plugins.gradle.GradleInstallation/Gradle_2.4-rc-2

Build failed in Jenkins: kafka-trunk-jdk8 #290

Posted by Apache Jenkins Server <je...@builds.apache.org>.
See <https://builds.apache.org/job/kafka-trunk-jdk8/290/changes>

Changes:

[me] KAFKA-2886: Handle sink task rebalance failures by stopping worker task

------------------------------------------
Started by an SCM change
[EnvInject] - Loading node environment variables.
Building remotely on ubuntu-2 (docker Ubuntu ubuntu) in workspace <https://builds.apache.org/job/kafka-trunk-jdk8/ws/>
 > git rev-parse --is-inside-work-tree # timeout=10
Fetching changes from the remote Git repository
 > git config remote.origin.url https://git-wip-us.apache.org/repos/asf/kafka.git # timeout=10
Fetching upstream changes from https://git-wip-us.apache.org/repos/asf/kafka.git
 > git --version # timeout=10
 > git -c core.askpass=true fetch --tags --progress https://git-wip-us.apache.org/repos/asf/kafka.git +refs/heads/*:refs/remotes/origin/*
 > git rev-parse refs/remotes/origin/trunk^{commit} # timeout=10
 > git rev-parse refs/remotes/origin/origin/trunk^{commit} # timeout=10
Checking out Revision 6dc974312590f089c9e0ac27e8eb9b848caf32b5 (refs/remotes/origin/trunk)
 > git config core.sparsecheckout # timeout=10
 > git checkout -f 6dc974312590f089c9e0ac27e8eb9b848caf32b5
 > git rev-list 37be6d98da842512367ab0b31d8f0244afafda92 # timeout=10
Setting JDK1_8_0_45_HOME=/home/jenkins/jenkins-slave/tools/hudson.model.JDK/jdk1.8.0_45
Setting GRADLE_2_4_RC_2_HOME=/home/jenkins/jenkins-slave/tools/hudson.plugins.gradle.GradleInstallation/Gradle_2.4-rc-2
[kafka-trunk-jdk8] $ /bin/bash -xe /tmp/hudson6656231897041407086.sh
+ /home/jenkins/jenkins-slave/tools/hudson.plugins.gradle.GradleInstallation/Gradle_2.4-rc-2/bin/gradle
To honour the JVM settings for this build a new JVM will be forked. Please consider using the daemon: http://gradle.org/docs/2.4-rc-2/userguide/gradle_daemon.html.
Building project 'core' with Scala version 2.10.6
:downloadWrapper

BUILD SUCCESSFUL

Total time: 16.714 secs
Setting JDK1_8_0_45_HOME=/home/jenkins/jenkins-slave/tools/hudson.model.JDK/jdk1.8.0_45
Setting GRADLE_2_4_RC_2_HOME=/home/jenkins/jenkins-slave/tools/hudson.plugins.gradle.GradleInstallation/Gradle_2.4-rc-2
[kafka-trunk-jdk8] $ /bin/bash -xe /tmp/hudson2067268241578000168.sh
+ export GRADLE_OPTS=-Xmx1024m
+ GRADLE_OPTS=-Xmx1024m
+ ./gradlew -Dorg.gradle.project.maxParallelForks=1 clean jarAll testAll
To honour the JVM settings for this build a new JVM will be forked. Please consider using the daemon: https://docs.gradle.org/2.10/userguide/gradle_daemon.html.
Building project 'core' with Scala version 2.10.6
:clean UP-TO-DATE
:clients:clean
:connect:clean UP-TO-DATE
:core:clean UP-TO-DATE
:examples:clean UP-TO-DATE
:log4j-appender:clean UP-TO-DATE
:streams:clean UP-TO-DATE
:tools:clean UP-TO-DATE
:connect:api:clean UP-TO-DATE
:connect:file:clean UP-TO-DATE
:connect:json:clean UP-TO-DATE
:connect:runtime:clean UP-TO-DATE
:jar_core_2_10
Building project 'core' with Scala version 2.10.6
:kafka-trunk-jdk8:clients:compileJava
:jar_core_2_10 FAILED

FAILURE: Build failed with an exception.

* What went wrong:
Failed to capture snapshot of input files for task 'compileJava' during up-to-date check.  See stacktrace for details.
> Could not add entry '/home/jenkins/.gradle/caches/modules-2/files-2.1/net.jpountz.lz4/lz4/1.3.0/c708bb2590c0652a642236ef45d9f99ff842a2ce/lz4-1.3.0.jar' to cache fileHashes.bin (<https://builds.apache.org/job/kafka-trunk-jdk8/ws/.gradle/2.10/taskArtifacts/fileHashes.bin).>

* Try:
Run with --stacktrace option to get the stack trace. Run with --info or --debug option to get more log output.

BUILD FAILED

Total time: 15.832 secs
Build step 'Execute shell' marked build as failure
Recording test results
Setting JDK1_8_0_45_HOME=/home/jenkins/jenkins-slave/tools/hudson.model.JDK/jdk1.8.0_45
Setting GRADLE_2_4_RC_2_HOME=/home/jenkins/jenkins-slave/tools/hudson.plugins.gradle.GradleInstallation/Gradle_2.4-rc-2
ERROR: Publisher 'Publish JUnit test result report' failed: No test report files were found. Configuration error?
Setting JDK1_8_0_45_HOME=/home/jenkins/jenkins-slave/tools/hudson.model.JDK/jdk1.8.0_45
Setting GRADLE_2_4_RC_2_HOME=/home/jenkins/jenkins-slave/tools/hudson.plugins.gradle.GradleInstallation/Gradle_2.4-rc-2

Build failed in Jenkins: kafka-trunk-jdk8 #289

Posted by Apache Jenkins Server <je...@builds.apache.org>.
See <https://builds.apache.org/job/kafka-trunk-jdk8/289/changes>

Changes:

[wangguoz] KAFKA-3108: custom StreamParitioner for Windowed key

------------------------------------------
[...truncated 2797 lines...]

kafka.log.BrokerCompressionTest > testBrokerSideCompression[17] PASSED

kafka.log.BrokerCompressionTest > testBrokerSideCompression[18] PASSED

kafka.log.BrokerCompressionTest > testBrokerSideCompression[19] PASSED

kafka.log.LogSegmentTest > testRecoveryWithCorruptMessage PASSED

kafka.log.LogSegmentTest > testRecoveryFixesCorruptIndex PASSED

kafka.log.LogSegmentTest > testReadFromGap PASSED

kafka.log.LogSegmentTest > testTruncate PASSED

kafka.log.LogSegmentTest > testReadBeforeFirstOffset PASSED

kafka.log.LogSegmentTest > testCreateWithInitFileSizeAppendMessage PASSED

kafka.log.LogSegmentTest > testChangeFileSuffixes PASSED

kafka.log.LogSegmentTest > testMaxOffset PASSED

kafka.log.LogSegmentTest > testNextOffsetCalculation PASSED

kafka.log.LogSegmentTest > testReadOnEmptySegment PASSED

kafka.log.LogSegmentTest > testReadAfterLast PASSED

kafka.log.LogSegmentTest > testCreateWithInitFileSizeClearShutdown PASSED

kafka.log.LogSegmentTest > testTruncateFull PASSED

kafka.log.LogConfigTest > testFromPropsEmpty PASSED

kafka.log.LogConfigTest > testKafkaConfigToProps PASSED

kafka.log.LogConfigTest > testFromPropsInvalid PASSED

kafka.log.LogCleanerIntegrationTest > cleanerTest[0] PASSED

kafka.log.LogCleanerIntegrationTest > cleanerTest[1] PASSED

kafka.log.LogCleanerIntegrationTest > cleanerTest[2] PASSED

kafka.log.LogCleanerIntegrationTest > cleanerTest[3] PASSED

kafka.log.LogManagerTest > testCleanupSegmentsToMaintainSize PASSED

kafka.log.LogManagerTest > testRecoveryDirectoryMappingWithRelativeDirectory PASSED

kafka.log.LogManagerTest > testGetNonExistentLog PASSED

kafka.log.LogManagerTest > testTwoLogManagersUsingSameDirFails PASSED

kafka.log.LogManagerTest > testLeastLoadedAssignment PASSED

kafka.log.LogManagerTest > testCleanupExpiredSegments PASSED

kafka.log.LogManagerTest > testCheckpointRecoveryPoints PASSED

kafka.log.LogManagerTest > testTimeBasedFlush PASSED

kafka.log.LogManagerTest > testCreateLog PASSED

kafka.log.LogManagerTest > testRecoveryDirectoryMappingWithTrailingSlash PASSED

kafka.coordinator.MemberMetadataTest > testMatchesSupportedProtocols PASSED

kafka.coordinator.MemberMetadataTest > testMetadata PASSED

kafka.coordinator.MemberMetadataTest > testMetadataRaisesOnUnsupportedProtocol PASSED

kafka.coordinator.MemberMetadataTest > testVoteForPreferredProtocol PASSED

kafka.coordinator.MemberMetadataTest > testVoteRaisesOnNoSupportedProtocols PASSED

kafka.coordinator.GroupCoordinatorResponseTest > testHeartbeatWrongCoordinator PASSED

kafka.coordinator.GroupCoordinatorResponseTest > testDescribeGroupStable PASSED

kafka.coordinator.GroupCoordinatorResponseTest > testHeartbeatIllegalGeneration PASSED

kafka.coordinator.GroupCoordinatorResponseTest > testDescribeGroupWrongCoordinator PASSED

kafka.coordinator.GroupCoordinatorResponseTest > testDescribeGroupRebalancing PASSED

kafka.coordinator.GroupCoordinatorResponseTest > testLeaderFailureInSyncGroup PASSED

kafka.coordinator.GroupCoordinatorResponseTest > testGenerationIdIncrementsOnRebalance PASSED

kafka.coordinator.GroupCoordinatorResponseTest > testSyncGroupFromIllegalGeneration PASSED

kafka.coordinator.GroupCoordinatorResponseTest > testInvalidGroupId PASSED

kafka.coordinator.GroupCoordinatorResponseTest > testHeartbeatUnknownGroup PASSED

kafka.coordinator.GroupCoordinatorResponseTest > testListGroupsIncludesStableGroups PASSED

kafka.coordinator.GroupCoordinatorResponseTest > testHeartbeatDuringRebalanceCausesRebalanceInProgress PASSED

kafka.coordinator.GroupCoordinatorResponseTest > testJoinGroupInconsistentGroupProtocol PASSED

kafka.coordinator.GroupCoordinatorResponseTest > testJoinGroupSessionTimeoutTooLarge PASSED

kafka.coordinator.GroupCoordinatorResponseTest > testJoinGroupSessionTimeoutTooSmall PASSED

kafka.coordinator.GroupCoordinatorResponseTest > testSyncGroupEmptyAssignment PASSED

kafka.coordinator.GroupCoordinatorResponseTest > testCommitOffsetWithDefaultGeneration PASSED

kafka.coordinator.GroupCoordinatorResponseTest > testJoinGroupFromUnchangedLeaderShouldRebalance PASSED

kafka.coordinator.GroupCoordinatorResponseTest > testHeartbeatRebalanceInProgress PASSED

kafka.coordinator.GroupCoordinatorResponseTest > testLeaveGroupUnknownGroup PASSED

kafka.coordinator.GroupCoordinatorResponseTest > testListGroupsIncludesRebalancingGroups PASSED

kafka.coordinator.GroupCoordinatorResponseTest > testSyncGroupFollowerAfterLeader PASSED

kafka.coordinator.GroupCoordinatorResponseTest > testCommitOffsetInAwaitingSync PASSED

kafka.coordinator.GroupCoordinatorResponseTest > testJoinGroupWrongCoordinator PASSED

kafka.coordinator.GroupCoordinatorResponseTest > testJoinGroupUnknownConsumerExistingGroup PASSED

kafka.coordinator.GroupCoordinatorResponseTest > testSyncGroupFromUnknownGroup PASSED

kafka.coordinator.GroupCoordinatorResponseTest > testJoinGroupInconsistentProtocolType PASSED

kafka.coordinator.GroupCoordinatorResponseTest > testCommitOffsetFromUnknownGroup PASSED

kafka.coordinator.GroupCoordinatorResponseTest > testLeaveGroupWrongCoordinator PASSED

kafka.coordinator.GroupCoordinatorResponseTest > testLeaveGroupUnknownConsumerExistingGroup PASSED

kafka.coordinator.GroupCoordinatorResponseTest > testJoinGroupUnknownConsumerNewGroup PASSED

kafka.coordinator.GroupCoordinatorResponseTest > testJoinGroupFromUnchangedFollowerDoesNotRebalance PASSED

kafka.coordinator.GroupCoordinatorResponseTest > testValidJoinGroup PASSED

kafka.coordinator.GroupCoordinatorResponseTest > testSyncGroupLeaderAfterFollower PASSED

kafka.coordinator.GroupCoordinatorResponseTest > testSyncGroupFromUnknownMember PASSED

kafka.coordinator.GroupCoordinatorResponseTest > testValidLeaveGroup PASSED

kafka.coordinator.GroupCoordinatorResponseTest > testDescribeGroupInactiveGroup PASSED

kafka.coordinator.GroupCoordinatorResponseTest > testSyncGroupNotCoordinator PASSED

kafka.coordinator.GroupCoordinatorResponseTest > testHeartbeatUnknownConsumerExistingGroup PASSED

kafka.coordinator.GroupCoordinatorResponseTest > testValidHeartbeat PASSED

kafka.coordinator.GroupMetadataTest > testDeadToAwaitingSyncIllegalTransition PASSED

kafka.coordinator.GroupMetadataTest > testPreparingRebalanceToStableIllegalTransition PASSED

kafka.coordinator.GroupMetadataTest > testCannotRebalanceWhenDead PASSED

kafka.coordinator.GroupMetadataTest > testSelectProtocol PASSED

kafka.coordinator.GroupMetadataTest > testCannotRebalanceWhenPreparingRebalance PASSED

kafka.coordinator.GroupMetadataTest > testDeadToPreparingRebalanceIllegalTransition PASSED

kafka.coordinator.GroupMetadataTest > testCanRebalanceWhenAwaitingSync PASSED

kafka.coordinator.GroupMetadataTest > testAwaitingSyncToPreparingRebalanceTransition PASSED

kafka.coordinator.GroupMetadataTest > testStableToAwaitingSyncIllegalTransition PASSED

kafka.coordinator.GroupMetadataTest > testDeadToDeadIllegalTransition PASSED

kafka.coordinator.GroupMetadataTest > testSelectProtocolRaisesIfNoMembers PASSED

kafka.coordinator.GroupMetadataTest > testStableToPreparingRebalanceTransition PASSED

kafka.coordinator.GroupMetadataTest > testPreparingRebalanceToDeadTransition PASSED

kafka.coordinator.GroupMetadataTest > testStableToStableIllegalTransition PASSED

kafka.coordinator.GroupMetadataTest > testAwaitingSyncToStableTransition PASSED

kafka.coordinator.GroupMetadataTest > testDeadToStableIllegalTransition PASSED

kafka.coordinator.GroupMetadataTest > testAwaitingSyncToAwaitingSyncIllegalTransition PASSED

kafka.coordinator.GroupMetadataTest > testSupportsProtocols PASSED

kafka.coordinator.GroupMetadataTest > testCanRebalanceWhenStable PASSED

kafka.coordinator.GroupMetadataTest > testPreparingRebalanceToPreparingRebalanceIllegalTransition PASSED

kafka.coordinator.GroupMetadataTest > testSelectProtocolChoosesCompatibleProtocol PASSED

kafka.KafkaTest > testGetKafkaConfigFromArgsWrongSetValue PASSED

kafka.KafkaTest > testKafkaSslPasswords PASSED

kafka.KafkaTest > testGetKafkaConfigFromArgs PASSED

kafka.KafkaTest > testGetKafkaConfigFromArgsNonArgsAtTheEnd PASSED

kafka.KafkaTest > testGetKafkaConfigFromArgsNonArgsOnly PASSED

kafka.KafkaTest > testGetKafkaConfigFromArgsNonArgsAtTheBegging PASSED

kafka.tools.ConsoleProducerTest > testParseKeyProp PASSED

kafka.tools.ConsoleProducerTest > testValidConfigsOldProducer PASSED

kafka.tools.ConsoleProducerTest > testInvalidConfigs PASSED

kafka.tools.ConsoleProducerTest > testValidConfigsNewProducer PASSED

integration.kafka.api.AdminClientTest > testDescribeGroup PASSED

integration.kafka.api.AdminClientTest > testDescribeConsumerGroup PASSED

integration.kafka.api.AdminClientTest > testListGroups PASSED

integration.kafka.api.AdminClientTest > testDescribeConsumerGroupForNonExistentGroup PASSED

650 tests completed, 1 failed
:kafka-trunk-jdk8:core:test FAILED
:test_core_2_11 FAILED

FAILURE: Build failed with an exception.

* What went wrong:
Execution failed for task ':core:test'.
> There were failing tests. See the report at: file://<https://builds.apache.org/job/kafka-trunk-jdk8/ws/core/build/reports/tests/index.html>

* Try:
Run with --stacktrace option to get the stack trace. Run with --info or --debug option to get more log output.

BUILD FAILED

Total time: 1 hrs 31 mins 6.517 secs
Build step 'Execute shell' marked build as failure
Recording test results
Setting JDK1_8_0_45_HOME=/home/jenkins/jenkins-slave/tools/hudson.model.JDK/jdk1.8.0_45
Setting GRADLE_2_4_RC_2_HOME=/home/jenkins/jenkins-slave/tools/hudson.plugins.gradle.GradleInstallation/Gradle_2.4-rc-2
Setting JDK1_8_0_45_HOME=/home/jenkins/jenkins-slave/tools/hudson.model.JDK/jdk1.8.0_45
Setting GRADLE_2_4_RC_2_HOME=/home/jenkins/jenkins-slave/tools/hudson.plugins.gradle.GradleInstallation/Gradle_2.4-rc-2

Build failed in Jenkins: kafka-trunk-jdk8 #288

Posted by Apache Jenkins Server <je...@builds.apache.org>.
See <https://builds.apache.org/job/kafka-trunk-jdk8/288/changes>

Changes:

[wangguoz] MINOR: add internal source topic for tracking

------------------------------------------
Started by an SCM change
[EnvInject] - Loading node environment variables.
Building remotely on H11 (Ubuntu ubuntu) in workspace <https://builds.apache.org/job/kafka-trunk-jdk8/ws/>
 > git rev-parse --is-inside-work-tree # timeout=10
Fetching changes from the remote Git repository
 > git config remote.origin.url https://git-wip-us.apache.org/repos/asf/kafka.git # timeout=10
Fetching upstream changes from https://git-wip-us.apache.org/repos/asf/kafka.git
 > git --version # timeout=10
 > git -c core.askpass=true fetch --tags --progress https://git-wip-us.apache.org/repos/asf/kafka.git +refs/heads/*:refs/remotes/origin/*
 > git rev-parse refs/remotes/origin/trunk^{commit} # timeout=10
 > git rev-parse refs/remotes/origin/origin/trunk^{commit} # timeout=10
Checking out Revision a3d3d5379df71e7a2c653d06ebf1b30923dde738 (refs/remotes/origin/trunk)
 > git config core.sparsecheckout # timeout=10
 > git checkout -f a3d3d5379df71e7a2c653d06ebf1b30923dde738
 > git rev-list 4f22705c7d0c8e8cab68883e76f554439341e34a # timeout=10
Setting JDK1_8_0_45_HOME=/home/jenkins/jenkins-slave/tools/hudson.model.JDK/jdk1.8.0_45
Setting GRADLE_2_4_RC_2_HOME=/home/jenkins/jenkins-slave/tools/hudson.plugins.gradle.GradleInstallation/Gradle_2.4-rc-2
[kafka-trunk-jdk8] $ /bin/bash -xe /tmp/hudson8008829539694329741.sh
+ /home/jenkins/jenkins-slave/tools/hudson.plugins.gradle.GradleInstallation/Gradle_2.4-rc-2/bin/gradle
To honour the JVM settings for this build a new JVM will be forked. Please consider using the daemon: http://gradle.org/docs/2.4-rc-2/userguide/gradle_daemon.html.
Building project 'core' with Scala version 2.10.6
:downloadWrapper

BUILD SUCCESSFUL

Total time: 9.239 secs
Setting JDK1_8_0_45_HOME=/home/jenkins/jenkins-slave/tools/hudson.model.JDK/jdk1.8.0_45
Setting GRADLE_2_4_RC_2_HOME=/home/jenkins/jenkins-slave/tools/hudson.plugins.gradle.GradleInstallation/Gradle_2.4-rc-2
[kafka-trunk-jdk8] $ /bin/bash -xe /tmp/hudson8339974357914235697.sh
+ export GRADLE_OPTS=-Xmx1024m
+ GRADLE_OPTS=-Xmx1024m
+ ./gradlew -Dorg.gradle.project.maxParallelForks=1 clean jarAll testAll
To honour the JVM settings for this build a new JVM will be forked. Please consider using the daemon: https://docs.gradle.org/2.10/userguide/gradle_daemon.html.
Building project 'core' with Scala version 2.10.6
:clean UP-TO-DATE
:clients:clean UP-TO-DATE
:connect:clean UP-TO-DATE
:core:clean UP-TO-DATE
:examples:clean UP-TO-DATE
:log4j-appender:clean UP-TO-DATE
:streams:clean UP-TO-DATE
:tools:clean UP-TO-DATE
:connect:api:clean UP-TO-DATE
:connect:file:clean UP-TO-DATE
:connect:json:clean UP-TO-DATE
:connect:runtime:clean UP-TO-DATE
:jar_core_2_10
Building project 'core' with Scala version 2.10.6
:kafka-trunk-jdk8:clients:compileJava
:jar_core_2_10 FAILED

FAILURE: Build failed with an exception.

* What went wrong:
Failed to capture snapshot of input files for task 'compileJava' during up-to-date check.  See stacktrace for details.
> Could not add entry '/home/jenkins/.gradle/caches/modules-2/files-2.1/net.jpountz.lz4/lz4/1.3.0/c708bb2590c0652a642236ef45d9f99ff842a2ce/lz4-1.3.0.jar' to cache fileHashes.bin (<https://builds.apache.org/job/kafka-trunk-jdk8/ws/.gradle/2.10/taskArtifacts/fileHashes.bin).>

* Try:
Run with --stacktrace option to get the stack trace. Run with --info or --debug option to get more log output.

BUILD FAILED

Total time: 10.189 secs
Build step 'Execute shell' marked build as failure
Recording test results
Setting JDK1_8_0_45_HOME=/home/jenkins/jenkins-slave/tools/hudson.model.JDK/jdk1.8.0_45
Setting GRADLE_2_4_RC_2_HOME=/home/jenkins/jenkins-slave/tools/hudson.plugins.gradle.GradleInstallation/Gradle_2.4-rc-2
ERROR: Publisher 'Publish JUnit test result report' failed: No test report files were found. Configuration error?
Setting JDK1_8_0_45_HOME=/home/jenkins/jenkins-slave/tools/hudson.model.JDK/jdk1.8.0_45
Setting GRADLE_2_4_RC_2_HOME=/home/jenkins/jenkins-slave/tools/hudson.plugins.gradle.GradleInstallation/Gradle_2.4-rc-2

Build failed in Jenkins: kafka-trunk-jdk8 #287

Posted by Apache Jenkins Server <je...@builds.apache.org>.
See <https://builds.apache.org/job/kafka-trunk-jdk8/287/changes>

Changes:

[wangguoz] KAFKA-3081: KTable Aggregation

------------------------------------------
Started by an SCM change
[EnvInject] - Loading node environment variables.
Building remotely on H11 (Ubuntu ubuntu) in workspace <https://builds.apache.org/job/kafka-trunk-jdk8/ws/>
 > git rev-parse --is-inside-work-tree # timeout=10
Fetching changes from the remote Git repository
 > git config remote.origin.url https://git-wip-us.apache.org/repos/asf/kafka.git # timeout=10
Fetching upstream changes from https://git-wip-us.apache.org/repos/asf/kafka.git
 > git --version # timeout=10
 > git -c core.askpass=true fetch --tags --progress https://git-wip-us.apache.org/repos/asf/kafka.git +refs/heads/*:refs/remotes/origin/*
 > git rev-parse refs/remotes/origin/trunk^{commit} # timeout=10
 > git rev-parse refs/remotes/origin/origin/trunk^{commit} # timeout=10
Checking out Revision 4f22705c7d0c8e8cab68883e76f554439341e34a (refs/remotes/origin/trunk)
 > git config core.sparsecheckout # timeout=10
 > git checkout -f 4f22705c7d0c8e8cab68883e76f554439341e34a
 > git rev-list 70011747c85337817497bc005ac9ea191d8688e3 # timeout=10
Setting JDK1_8_0_45_HOME=/home/jenkins/jenkins-slave/tools/hudson.model.JDK/jdk1.8.0_45
Setting GRADLE_2_4_RC_2_HOME=/home/jenkins/jenkins-slave/tools/hudson.plugins.gradle.GradleInstallation/Gradle_2.4-rc-2
[kafka-trunk-jdk8] $ /bin/bash -xe /tmp/hudson5117152372922907482.sh
+ /home/jenkins/jenkins-slave/tools/hudson.plugins.gradle.GradleInstallation/Gradle_2.4-rc-2/bin/gradle
To honour the JVM settings for this build a new JVM will be forked. Please consider using the daemon: http://gradle.org/docs/2.4-rc-2/userguide/gradle_daemon.html.
Building project 'core' with Scala version 2.10.6
:downloadWrapper

BUILD SUCCESSFUL

Total time: 11.243 secs
Setting JDK1_8_0_45_HOME=/home/jenkins/jenkins-slave/tools/hudson.model.JDK/jdk1.8.0_45
Setting GRADLE_2_4_RC_2_HOME=/home/jenkins/jenkins-slave/tools/hudson.plugins.gradle.GradleInstallation/Gradle_2.4-rc-2
[kafka-trunk-jdk8] $ /bin/bash -xe /tmp/hudson2762353943461882792.sh
+ export GRADLE_OPTS=-Xmx1024m
+ GRADLE_OPTS=-Xmx1024m
+ ./gradlew -Dorg.gradle.project.maxParallelForks=1 clean jarAll testAll
To honour the JVM settings for this build a new JVM will be forked. Please consider using the daemon: https://docs.gradle.org/2.10/userguide/gradle_daemon.html.
Building project 'core' with Scala version 2.10.6
:clean UP-TO-DATE
:clients:clean UP-TO-DATE
:connect:clean UP-TO-DATE
:core:clean UP-TO-DATE
:examples:clean UP-TO-DATE
:log4j-appender:clean UP-TO-DATE
:streams:clean UP-TO-DATE
:tools:clean UP-TO-DATE
:connect:api:clean UP-TO-DATE
:connect:file:clean UP-TO-DATE
:connect:json:clean UP-TO-DATE
:connect:runtime:clean UP-TO-DATE
:jar_core_2_10
Building project 'core' with Scala version 2.10.6
:kafka-trunk-jdk8:clients:compileJava
:jar_core_2_10 FAILED

FAILURE: Build failed with an exception.

* What went wrong:
Failed to capture snapshot of input files for task 'compileJava' during up-to-date check.  See stacktrace for details.
> Could not add entry '/home/jenkins/.gradle/caches/modules-2/files-2.1/net.jpountz.lz4/lz4/1.3.0/c708bb2590c0652a642236ef45d9f99ff842a2ce/lz4-1.3.0.jar' to cache fileHashes.bin (<https://builds.apache.org/job/kafka-trunk-jdk8/ws/.gradle/2.10/taskArtifacts/fileHashes.bin).>

* Try:
Run with --stacktrace option to get the stack trace. Run with --info or --debug option to get more log output.

BUILD FAILED

Total time: 10.474 secs
Build step 'Execute shell' marked build as failure
Recording test results
Setting JDK1_8_0_45_HOME=/home/jenkins/jenkins-slave/tools/hudson.model.JDK/jdk1.8.0_45
Setting GRADLE_2_4_RC_2_HOME=/home/jenkins/jenkins-slave/tools/hudson.plugins.gradle.GradleInstallation/Gradle_2.4-rc-2
ERROR: Publisher 'Publish JUnit test result report' failed: No test report files were found. Configuration error?
Setting JDK1_8_0_45_HOME=/home/jenkins/jenkins-slave/tools/hudson.model.JDK/jdk1.8.0_45
Setting GRADLE_2_4_RC_2_HOME=/home/jenkins/jenkins-slave/tools/hudson.plugins.gradle.GradleInstallation/Gradle_2.4-rc-2

Build failed in Jenkins: kafka-trunk-jdk8 #286

Posted by Apache Jenkins Server <je...@builds.apache.org>.
See <https://builds.apache.org/job/kafka-trunk-jdk8/286/changes>

Changes:

[wangguoz] MINOR: Typo in documentation of topic config removal

[wangguoz] MINOR: modify config specification of topic level

------------------------------------------
[...truncated 1388 lines...]

kafka.log.BrokerCompressionTest > testBrokerSideCompression[17] PASSED

kafka.log.BrokerCompressionTest > testBrokerSideCompression[18] PASSED

kafka.log.BrokerCompressionTest > testBrokerSideCompression[19] PASSED

kafka.log.LogSegmentTest > testRecoveryWithCorruptMessage PASSED

kafka.log.LogSegmentTest > testRecoveryFixesCorruptIndex PASSED

kafka.log.LogSegmentTest > testReadFromGap PASSED

kafka.log.LogSegmentTest > testTruncate PASSED

kafka.log.LogSegmentTest > testReadBeforeFirstOffset PASSED

kafka.log.LogSegmentTest > testCreateWithInitFileSizeAppendMessage PASSED

kafka.log.LogSegmentTest > testChangeFileSuffixes PASSED

kafka.log.LogSegmentTest > testMaxOffset PASSED

kafka.log.LogSegmentTest > testNextOffsetCalculation PASSED

kafka.log.LogSegmentTest > testReadOnEmptySegment PASSED

kafka.log.LogSegmentTest > testReadAfterLast PASSED

kafka.log.LogSegmentTest > testCreateWithInitFileSizeClearShutdown PASSED

kafka.log.LogSegmentTest > testTruncateFull PASSED

kafka.log.LogConfigTest > testFromPropsEmpty PASSED

kafka.log.LogConfigTest > testKafkaConfigToProps PASSED

kafka.log.LogConfigTest > testFromPropsInvalid PASSED

kafka.log.LogCleanerIntegrationTest > cleanerTest[0] PASSED

kafka.log.LogCleanerIntegrationTest > cleanerTest[1] PASSED

kafka.log.LogCleanerIntegrationTest > cleanerTest[2] PASSED

kafka.log.LogCleanerIntegrationTest > cleanerTest[3] PASSED

kafka.log.LogManagerTest > testCleanupSegmentsToMaintainSize PASSED

kafka.log.LogManagerTest > testRecoveryDirectoryMappingWithRelativeDirectory PASSED

kafka.log.LogManagerTest > testGetNonExistentLog PASSED

kafka.log.LogManagerTest > testTwoLogManagersUsingSameDirFails PASSED

kafka.log.LogManagerTest > testLeastLoadedAssignment PASSED

kafka.log.LogManagerTest > testCleanupExpiredSegments PASSED

kafka.log.LogManagerTest > testCheckpointRecoveryPoints PASSED

kafka.log.LogManagerTest > testTimeBasedFlush PASSED

kafka.log.LogManagerTest > testCreateLog PASSED

kafka.log.LogManagerTest > testRecoveryDirectoryMappingWithTrailingSlash PASSED

kafka.coordinator.MemberMetadataTest > testMatchesSupportedProtocols PASSED

kafka.coordinator.MemberMetadataTest > testMetadata PASSED

kafka.coordinator.MemberMetadataTest > testMetadataRaisesOnUnsupportedProtocol PASSED

kafka.coordinator.MemberMetadataTest > testVoteForPreferredProtocol PASSED

kafka.coordinator.MemberMetadataTest > testVoteRaisesOnNoSupportedProtocols PASSED

kafka.coordinator.GroupCoordinatorResponseTest > testHeartbeatWrongCoordinator PASSED

kafka.coordinator.GroupCoordinatorResponseTest > testDescribeGroupStable PASSED

kafka.coordinator.GroupCoordinatorResponseTest > testHeartbeatIllegalGeneration PASSED

kafka.coordinator.GroupCoordinatorResponseTest > testDescribeGroupWrongCoordinator PASSED

kafka.coordinator.GroupCoordinatorResponseTest > testDescribeGroupRebalancing PASSED

kafka.coordinator.GroupCoordinatorResponseTest > testLeaderFailureInSyncGroup PASSED

kafka.coordinator.GroupCoordinatorResponseTest > testGenerationIdIncrementsOnRebalance PASSED

kafka.coordinator.GroupCoordinatorResponseTest > testSyncGroupFromIllegalGeneration PASSED

kafka.coordinator.GroupCoordinatorResponseTest > testInvalidGroupId PASSED

kafka.coordinator.GroupCoordinatorResponseTest > testHeartbeatUnknownGroup PASSED

kafka.coordinator.GroupCoordinatorResponseTest > testListGroupsIncludesStableGroups PASSED

kafka.coordinator.GroupCoordinatorResponseTest > testHeartbeatDuringRebalanceCausesRebalanceInProgress PASSED

kafka.coordinator.GroupCoordinatorResponseTest > testJoinGroupInconsistentGroupProtocol PASSED

kafka.coordinator.GroupCoordinatorResponseTest > testJoinGroupSessionTimeoutTooLarge PASSED

kafka.coordinator.GroupCoordinatorResponseTest > testJoinGroupSessionTimeoutTooSmall PASSED

kafka.coordinator.GroupCoordinatorResponseTest > testSyncGroupEmptyAssignment PASSED

kafka.coordinator.GroupCoordinatorResponseTest > testCommitOffsetWithDefaultGeneration PASSED

kafka.coordinator.GroupCoordinatorResponseTest > testJoinGroupFromUnchangedLeaderShouldRebalance PASSED

kafka.coordinator.GroupCoordinatorResponseTest > testHeartbeatRebalanceInProgress PASSED

kafka.coordinator.GroupCoordinatorResponseTest > testLeaveGroupUnknownGroup PASSED

kafka.coordinator.GroupCoordinatorResponseTest > testListGroupsIncludesRebalancingGroups PASSED

kafka.coordinator.GroupCoordinatorResponseTest > testSyncGroupFollowerAfterLeader PASSED

kafka.coordinator.GroupCoordinatorResponseTest > testCommitOffsetInAwaitingSync PASSED

kafka.coordinator.GroupCoordinatorResponseTest > testJoinGroupWrongCoordinator PASSED

kafka.coordinator.GroupCoordinatorResponseTest > testJoinGroupUnknownConsumerExistingGroup PASSED

kafka.coordinator.GroupCoordinatorResponseTest > testSyncGroupFromUnknownGroup PASSED

kafka.coordinator.GroupCoordinatorResponseTest > testJoinGroupInconsistentProtocolType PASSED

kafka.coordinator.GroupCoordinatorResponseTest > testCommitOffsetFromUnknownGroup PASSED

kafka.coordinator.GroupCoordinatorResponseTest > testLeaveGroupWrongCoordinator PASSED

kafka.coordinator.GroupCoordinatorResponseTest > testLeaveGroupUnknownConsumerExistingGroup PASSED

kafka.coordinator.GroupCoordinatorResponseTest > testJoinGroupUnknownConsumerNewGroup PASSED

kafka.coordinator.GroupCoordinatorResponseTest > testJoinGroupFromUnchangedFollowerDoesNotRebalance PASSED

kafka.coordinator.GroupCoordinatorResponseTest > testValidJoinGroup PASSED

kafka.coordinator.GroupCoordinatorResponseTest > testSyncGroupLeaderAfterFollower PASSED

kafka.coordinator.GroupCoordinatorResponseTest > testSyncGroupFromUnknownMember PASSED

kafka.coordinator.GroupCoordinatorResponseTest > testValidLeaveGroup PASSED

kafka.coordinator.GroupCoordinatorResponseTest > testDescribeGroupInactiveGroup PASSED

kafka.coordinator.GroupCoordinatorResponseTest > testSyncGroupNotCoordinator PASSED

kafka.coordinator.GroupCoordinatorResponseTest > testHeartbeatUnknownConsumerExistingGroup PASSED

kafka.coordinator.GroupCoordinatorResponseTest > testValidHeartbeat PASSED

kafka.coordinator.GroupMetadataTest > testDeadToAwaitingSyncIllegalTransition PASSED

kafka.coordinator.GroupMetadataTest > testPreparingRebalanceToStableIllegalTransition PASSED

kafka.coordinator.GroupMetadataTest > testCannotRebalanceWhenDead PASSED

kafka.coordinator.GroupMetadataTest > testSelectProtocol PASSED

kafka.coordinator.GroupMetadataTest > testCannotRebalanceWhenPreparingRebalance PASSED

kafka.coordinator.GroupMetadataTest > testDeadToPreparingRebalanceIllegalTransition PASSED

kafka.coordinator.GroupMetadataTest > testCanRebalanceWhenAwaitingSync PASSED

kafka.coordinator.GroupMetadataTest > testAwaitingSyncToPreparingRebalanceTransition PASSED

kafka.coordinator.GroupMetadataTest > testStableToAwaitingSyncIllegalTransition PASSED

kafka.coordinator.GroupMetadataTest > testDeadToDeadIllegalTransition PASSED

kafka.coordinator.GroupMetadataTest > testSelectProtocolRaisesIfNoMembers PASSED

kafka.coordinator.GroupMetadataTest > testStableToPreparingRebalanceTransition PASSED

kafka.coordinator.GroupMetadataTest > testPreparingRebalanceToDeadTransition PASSED

kafka.coordinator.GroupMetadataTest > testStableToStableIllegalTransition PASSED

kafka.coordinator.GroupMetadataTest > testAwaitingSyncToStableTransition PASSED

kafka.coordinator.GroupMetadataTest > testDeadToStableIllegalTransition PASSED

kafka.coordinator.GroupMetadataTest > testAwaitingSyncToAwaitingSyncIllegalTransition PASSED

kafka.coordinator.GroupMetadataTest > testSupportsProtocols PASSED

kafka.coordinator.GroupMetadataTest > testCanRebalanceWhenStable PASSED

kafka.coordinator.GroupMetadataTest > testPreparingRebalanceToPreparingRebalanceIllegalTransition PASSED

kafka.coordinator.GroupMetadataTest > testSelectProtocolChoosesCompatibleProtocol PASSED

kafka.KafkaTest > testGetKafkaConfigFromArgsWrongSetValue PASSED

kafka.KafkaTest > testKafkaSslPasswords PASSED

kafka.KafkaTest > testGetKafkaConfigFromArgs PASSED

kafka.KafkaTest > testGetKafkaConfigFromArgsNonArgsAtTheEnd PASSED

kafka.KafkaTest > testGetKafkaConfigFromArgsNonArgsOnly PASSED

kafka.KafkaTest > testGetKafkaConfigFromArgsNonArgsAtTheBegging PASSED

kafka.tools.ConsoleProducerTest > testParseKeyProp PASSED

kafka.tools.ConsoleProducerTest > testValidConfigsOldProducer PASSED

kafka.tools.ConsoleProducerTest > testInvalidConfigs PASSED

kafka.tools.ConsoleProducerTest > testValidConfigsNewProducer PASSED

integration.kafka.api.AdminClientTest > testDescribeGroup PASSED

integration.kafka.api.AdminClientTest > testDescribeConsumerGroup PASSED

integration.kafka.api.AdminClientTest > testListGroups PASSED

integration.kafka.api.AdminClientTest > testDescribeConsumerGroupForNonExistentGroup PASSED

650 tests completed, 1 failed
:kafka-trunk-jdk8:core:test FAILED
:test_core_2_10 FAILED

FAILURE: Build failed with an exception.

* What went wrong:
Execution failed for task ':core:test'.
> There were failing tests. See the report at: file://<https://builds.apache.org/job/kafka-trunk-jdk8/ws/core/build/reports/tests/index.html>

* Try:
Run with --stacktrace option to get the stack trace. Run with --info or --debug option to get more log output.

BUILD FAILED

Total time: 48 mins 33.129 secs
Build step 'Execute shell' marked build as failure
Recording test results
Setting JDK1_8_0_45_HOME=/home/jenkins/jenkins-slave/tools/hudson.model.JDK/jdk1.8.0_45
Setting GRADLE_2_4_RC_2_HOME=/home/jenkins/jenkins-slave/tools/hudson.plugins.gradle.GradleInstallation/Gradle_2.4-rc-2
Setting JDK1_8_0_45_HOME=/home/jenkins/jenkins-slave/tools/hudson.model.JDK/jdk1.8.0_45
Setting GRADLE_2_4_RC_2_HOME=/home/jenkins/jenkins-slave/tools/hudson.plugins.gradle.GradleInstallation/Gradle_2.4-rc-2

Build failed in Jenkins: kafka-trunk-jdk8 #285

Posted by Apache Jenkins Server <je...@builds.apache.org>.
See <https://builds.apache.org/job/kafka-trunk-jdk8/285/changes>

Changes:

[me] KAFKA-3063; LogRecoveryTest causes JVM to exit occasionally

------------------------------------------
Started by an SCM change
[EnvInject] - Loading node environment variables.
Building remotely on H11 (Ubuntu ubuntu) in workspace <https://builds.apache.org/job/kafka-trunk-jdk8/ws/>
 > git rev-parse --is-inside-work-tree # timeout=10
Fetching changes from the remote Git repository
 > git config remote.origin.url https://git-wip-us.apache.org/repos/asf/kafka.git # timeout=10
Fetching upstream changes from https://git-wip-us.apache.org/repos/asf/kafka.git
 > git --version # timeout=10
 > git -c core.askpass=true fetch --tags --progress https://git-wip-us.apache.org/repos/asf/kafka.git +refs/heads/*:refs/remotes/origin/*
 > git rev-parse refs/remotes/origin/trunk^{commit} # timeout=10
 > git rev-parse refs/remotes/origin/origin/trunk^{commit} # timeout=10
Checking out Revision 836cb1963330a9e342379899e0fe52b72347736e (refs/remotes/origin/trunk)
 > git config core.sparsecheckout # timeout=10
 > git checkout -f 836cb1963330a9e342379899e0fe52b72347736e
 > git rev-list 72eebad43d5aaf4bbd29532eedc2a793fc3ee9d5 # timeout=10
Setting JDK1_8_0_45_HOME=/home/jenkins/jenkins-slave/tools/hudson.model.JDK/jdk1.8.0_45
Setting GRADLE_2_4_RC_2_HOME=/home/jenkins/jenkins-slave/tools/hudson.plugins.gradle.GradleInstallation/Gradle_2.4-rc-2
[kafka-trunk-jdk8] $ /bin/bash -xe /tmp/hudson5907063534117567346.sh
+ /home/jenkins/jenkins-slave/tools/hudson.plugins.gradle.GradleInstallation/Gradle_2.4-rc-2/bin/gradle
To honour the JVM settings for this build a new JVM will be forked. Please consider using the daemon: http://gradle.org/docs/2.4-rc-2/userguide/gradle_daemon.html.
Building project 'core' with Scala version 2.10.6
:downloadWrapper

BUILD SUCCESSFUL

Total time: 10.835 secs
Setting JDK1_8_0_45_HOME=/home/jenkins/jenkins-slave/tools/hudson.model.JDK/jdk1.8.0_45
Setting GRADLE_2_4_RC_2_HOME=/home/jenkins/jenkins-slave/tools/hudson.plugins.gradle.GradleInstallation/Gradle_2.4-rc-2
[kafka-trunk-jdk8] $ /bin/bash -xe /tmp/hudson907499875783623451.sh
+ export GRADLE_OPTS=-Xmx1024m
+ GRADLE_OPTS=-Xmx1024m
+ ./gradlew -Dorg.gradle.project.maxParallelForks=1 clean jarAll testAll
To honour the JVM settings for this build a new JVM will be forked. Please consider using the daemon: https://docs.gradle.org/2.10/userguide/gradle_daemon.html.
Building project 'core' with Scala version 2.10.6
:clean UP-TO-DATE
:clients:clean UP-TO-DATE
:connect:clean UP-TO-DATE
:core:clean UP-TO-DATE
:examples:clean UP-TO-DATE
:log4j-appender:clean UP-TO-DATE
:streams:clean UP-TO-DATE
:tools:clean UP-TO-DATE
:connect:api:clean UP-TO-DATE
:connect:file:clean UP-TO-DATE
:connect:json:clean UP-TO-DATE
:connect:runtime:clean UP-TO-DATE
:jar_core_2_10
Building project 'core' with Scala version 2.10.6
:kafka-trunk-jdk8:clients:compileJava
:jar_core_2_10 FAILED

FAILURE: Build failed with an exception.

* What went wrong:
Failed to capture snapshot of input files for task 'compileJava' during up-to-date check.  See stacktrace for details.
> Could not add entry '/home/jenkins/.gradle/caches/modules-2/files-2.1/net.jpountz.lz4/lz4/1.3.0/c708bb2590c0652a642236ef45d9f99ff842a2ce/lz4-1.3.0.jar' to cache fileHashes.bin (<https://builds.apache.org/job/kafka-trunk-jdk8/ws/.gradle/2.10/taskArtifacts/fileHashes.bin).>

* Try:
Run with --stacktrace option to get the stack trace. Run with --info or --debug option to get more log output.

BUILD FAILED

Total time: 11.727 secs
Build step 'Execute shell' marked build as failure
Recording test results
Setting JDK1_8_0_45_HOME=/home/jenkins/jenkins-slave/tools/hudson.model.JDK/jdk1.8.0_45
Setting GRADLE_2_4_RC_2_HOME=/home/jenkins/jenkins-slave/tools/hudson.plugins.gradle.GradleInstallation/Gradle_2.4-rc-2
ERROR: Publisher 'Publish JUnit test result report' failed: No test report files were found. Configuration error?
Setting JDK1_8_0_45_HOME=/home/jenkins/jenkins-slave/tools/hudson.model.JDK/jdk1.8.0_45
Setting GRADLE_2_4_RC_2_HOME=/home/jenkins/jenkins-slave/tools/hudson.plugins.gradle.GradleInstallation/Gradle_2.4-rc-2

Build failed in Jenkins: kafka-trunk-jdk8 #284

Posted by Apache Jenkins Server <je...@builds.apache.org>.
See <https://builds.apache.org/job/kafka-trunk-jdk8/284/changes>

Changes:

[me] KAFKA-3069: Fix recursion in ZkSecurityMigrator

------------------------------------------
[...truncated 2008 lines...]
java.lang.NullPointerException
	at hudson.plugins.toolenv.ToolEnvBuildWrapper$1.buildEnvVars(ToolEnvBuildWrapper.java:46)
	at hudson.model.AbstractBuild.getEnvironment(AbstractBuild.java:941)
	at hudson.plugins.git.GitSCM.getParamExpandedRepos(GitSCM.java:390)
	at hudson.plugins.git.GitSCM.compareRemoteRevisionWithImpl(GitSCM.java:577)
	at hudson.plugins.git.GitSCM.compareRemoteRevisionWith(GitSCM.java:527)
	at hudson.scm.SCM.compareRemoteRevisionWith(SCM.java:380)
	at hudson.scm.SCM.poll(SCM.java:397)
	at hudson.model.AbstractProject._poll(AbstractProject.java:1450)
	at hudson.model.AbstractProject.poll(AbstractProject.java:1353)
	at hudson.triggers.SCMTrigger$Runner.runPolling(SCMTrigger.java:510)
	at hudson.triggers.SCMTrigger$Runner.run(SCMTrigger.java:539)
	at hudson.util.SequentialExecutionQueue$QueueEntry.run(SequentialExecutionQueue.java:118)
	at java.util.concurrent.Executors$RunnableAdapter.call(Executors.java:471)
	at java.util.concurrent.FutureTask.run(FutureTask.java:262)
	at java.util.concurrent.ThreadPoolExecutor.runWorker(ThreadPoolExecutor.java:1145)
	at java.util.concurrent.ThreadPoolExecutor$Worker.run(ThreadPoolExecutor.java:615)
	at java.lang.Thread.run(Thread.java:745)

kafka.integration.SaslPlaintextTopicMetadataTest > testAutoCreateTopic PASSED

kafka.integration.SaslPlaintextTopicMetadataTest > testGetAllTopicMetadata PASSED

kafka.integration.SaslPlaintextTopicMetadataTest > testAliveBrokersListWithNoTopicsAfterNewBrokerStartup PASSED

kafka.integration.SaslPlaintextTopicMetadataTest > testBasicTopicMetadata PASSED

kafka.integration.SaslPlaintextTopicMetadataTest > testTopicMetadataRequest PASSED

kafka.integration.SaslPlaintextTopicMetadataTest > testAliveBrokersListWithNoTopicsAfterABrokerShutdown PASSED

kafka.integration.PrimitiveApiTest > testMultiProduce PASSED

kafka.integration.PrimitiveApiTest > testDefaultEncoderProducerAndFetch PASSED

kafka.integration.PrimitiveApiTest > testFetchRequestCanProperlySerialize PASSED

kafka.integration.PrimitiveApiTest > testPipelinedProduceRequests PASSED

kafka.integration.PrimitiveApiTest > testProduceAndMultiFetch PASSED

kafka.integration.PrimitiveApiTest > testDefaultEncoderProducerAndFetchWithCompression PASSED

kafka.integration.PrimitiveApiTest > testConsumerEmptyTopic PASSED

kafka.integration.PrimitiveApiTest > testEmptyFetchRequest PASSED

kafka.integration.SslTopicMetadataTest > testIsrAfterBrokerShutDownAndJoinsBack PASSED

kafka.integration.SslTopicMetadataTest > testAutoCreateTopicWithCollision PASSED

kafka.integration.SslTopicMetadataTest > testAliveBrokerListWithNoTopics PASSED

kafka.integration.SslTopicMetadataTest > testAutoCreateTopic PASSED

kafka.integration.SslTopicMetadataTest > testGetAllTopicMetadata PASSED

kafka.integration.SslTopicMetadataTest > testAliveBrokersListWithNoTopicsAfterNewBrokerStartup PASSED

kafka.integration.SslTopicMetadataTest > testBasicTopicMetadata PASSED

kafka.integration.SslTopicMetadataTest > testTopicMetadataRequest PASSED

kafka.integration.SslTopicMetadataTest > testAliveBrokersListWithNoTopicsAfterABrokerShutdown PASSED

kafka.integration.FetcherTest > testFetcher PASSED

kafka.integration.UncleanLeaderElectionTest > testUncleanLeaderElectionEnabled PASSED

kafka.integration.UncleanLeaderElectionTest > testCleanLeaderElectionDisabledByTopicOverride PASSED

kafka.integration.UncleanLeaderElectionTest > testUncleanLeaderElectionDisabled PASSED

kafka.integration.UncleanLeaderElectionTest > testUncleanLeaderElectionInvalidTopicOverride PASSED

kafka.integration.UncleanLeaderElectionTest > testUncleanLeaderElectionEnabledByTopicOverride PASSED

kafka.zk.ZKEphemeralTest > testOverlappingSessions[0] PASSED

kafka.zk.ZKEphemeralTest > testEphemeralNodeCleanup[0] PASSED

kafka.zk.ZKEphemeralTest > testZkWatchedEphemeral[0] PASSED

kafka.zk.ZKEphemeralTest > testSameSession[0] PASSED

kafka.zk.ZKEphemeralTest > testOverlappingSessions[1] PASSED

kafka.zk.ZKEphemeralTest > testEphemeralNodeCleanup[1] PASSED

kafka.zk.ZKEphemeralTest > testZkWatchedEphemeral[1] PASSED

kafka.zk.ZKEphemeralTest > testSameSession[1] PASSED

kafka.zk.ZKPathTest > testCreatePersistentSequentialThrowsException PASSED

kafka.zk.ZKPathTest > testCreatePersistentSequentialExists PASSED

kafka.zk.ZKPathTest > testCreateEphemeralPathExists PASSED

kafka.zk.ZKPathTest > testCreatePersistentPath PASSED

kafka.zk.ZKPathTest > testMakeSurePersistsPathExistsThrowsException PASSED

kafka.zk.ZKPathTest > testCreateEphemeralPathThrowsException PASSED

kafka.zk.ZKPathTest > testCreatePersistentPathThrowsException PASSED

kafka.zk.ZKPathTest > testMakeSurePersistsPathExists PASSED

kafka.metrics.KafkaTimerTest > testKafkaTimer PASSED

kafka.message.MessageCompressionTest > testCompressSize PASSED

kafka.message.MessageCompressionTest > testSimpleCompressDecompress PASSED

kafka.message.MessageWriterTest > testWithNoCompressionAttribute PASSED

kafka.message.MessageWriterTest > testWithCompressionAttribute PASSED

kafka.message.MessageWriterTest > testBufferingOutputStream PASSED

kafka.message.MessageWriterTest > testWithKey PASSED

kafka.message.ByteBufferMessageSetTest > testOffsetAssignment PASSED

kafka.message.ByteBufferMessageSetTest > testValidBytes PASSED

kafka.message.ByteBufferMessageSetTest > testValidBytesWithCompression PASSED

kafka.message.ByteBufferMessageSetTest > testIteratorIsConsistent PASSED

kafka.message.ByteBufferMessageSetTest > testWrittenEqualsRead PASSED

kafka.message.ByteBufferMessageSetTest > testWriteTo PASSED

kafka.message.ByteBufferMessageSetTest > testEquals PASSED

kafka.message.ByteBufferMessageSetTest > testSizeInBytes PASSED

kafka.message.ByteBufferMessageSetTest > testIterator PASSED

kafka.message.MessageTest > testChecksum PASSED

kafka.message.MessageTest > testIsHashable PASSED

kafka.message.MessageTest > testFieldValues PASSED

kafka.message.MessageTest > testEquality PASSED

kafka.server.KafkaConfigTest > testAdvertiseConfigured PASSED

kafka.server.KafkaConfigTest > testLogRetentionTimeHoursProvided PASSED

kafka.server.KafkaConfigTest > testLogRollTimeBothMsAndHoursProvided PASSED

kafka.server.KafkaConfigTest > testLogRetentionValid PASSED

kafka.server.KafkaConfigTest > testSpecificProperties PASSED

kafka.server.KafkaConfigTest > testDefaultCompressionType PASSED

kafka.server.KafkaConfigTest > testDuplicateListeners PASSED

kafka.server.KafkaConfigTest > testLogRetentionUnlimited PASSED

kafka.server.KafkaConfigTest > testLogRetentionTimeMsProvided PASSED

kafka.server.KafkaConfigTest > testLogRollTimeNoConfigProvided PASSED

kafka.server.KafkaConfigTest > testAdvertiseDefaults PASSED

kafka.server.KafkaConfigTest > testBadListenerProtocol PASSED

kafka.server.KafkaConfigTest > testListenerDefaults PASSED

kafka.server.KafkaConfigTest > testLogRetentionTimeBothMinutesAndHoursProvided PASSED

kafka.server.KafkaConfigTest > testUncleanElectionDisabled PASSED

kafka.server.KafkaConfigTest > testLogRetentionTimeNoConfigProvided PASSED

kafka.server.KafkaConfigTest > testFromPropsInvalid PASSED

kafka.server.KafkaConfigTest > testInvalidCompressionType PASSED

kafka.server.KafkaConfigTest > testAdvertiseHostNameDefault PASSED

kafka.server.KafkaConfigTest > testLogRetentionTimeMinutesProvided PASSED

kafka.server.KafkaConfigTest > testValidCompressionType PASSED

kafka.server.KafkaConfigTest > testUncleanElectionInvalid PASSED

kafka.server.KafkaConfigTest > testLogRetentionTimeBothMinutesAndMsProvided PASSED

kafka.server.KafkaConfigTest > testLogRollTimeMsProvided PASSED

kafka.server.KafkaConfigTest > testUncleanLeaderElectionDefault PASSED

kafka.server.KafkaConfigTest > testUncleanElectionEnabled PASSED

kafka.server.KafkaConfigTest > testAdvertisePortDefault PASSED

kafka.server.KafkaConfigTest > testVersionConfiguration PASSED

kafka.server.DynamicConfigChangeTest > testProcessNotification PASSED

kafka.server.DynamicConfigChangeTest > testClientQuotaConfigChange PASSED

kafka.server.DynamicConfigChangeTest > testConfigChangeOnNonExistingTopic PASSED

kafka.server.DynamicConfigChangeTest > testConfigChange PASSED

kafka.server.SaslSslReplicaFetchTest > testReplicaFetcherThread PASSED

kafka.server.LogOffsetTest > testGetOffsetsBeforeEarliestTime PASSED

kafka.server.LogOffsetTest > testGetOffsetsForUnknownTopic PASSED

kafka.server.LogOffsetTest > testEmptyLogsGetOffsets PASSED

kafka.server.LogOffsetTest > testGetOffsetsBeforeLatestTime PASSED

kafka.server.LogOffsetTest > testGetOffsetsBeforeNow PASSED

kafka.server.SimpleFetchTest > testReadFromLog PASSED

kafka.server.LogRecoveryTest > testHWCheckpointNoFailuresMultipleLogSegments PASSED
:kafka-trunk-jdk8:core:test FAILED
:test_core_2_11 FAILED

FAILURE: Build failed with an exception.

* What went wrong:
Execution failed for task ':core:test'.
> Process 'Gradle Test Executor 2' finished with non-zero exit value 1

* Try:
Run with --stacktrace option to get the stack trace. Run with --info or --debug option to get more log output.

BUILD FAILED

Total time: 1 hrs 4 mins 2.971 secs
Build step 'Execute shell' marked build as failure
Recording test results
Setting JDK1_8_0_45_HOME=/home/jenkins/jenkins-slave/tools/hudson.model.JDK/jdk1.8.0_45
Setting GRADLE_2_4_RC_2_HOME=/home/jenkins/jenkins-slave/tools/hudson.plugins.gradle.GradleInstallation/Gradle_2.4-rc-2
Setting JDK1_8_0_45_HOME=/home/jenkins/jenkins-slave/tools/hudson.model.JDK/jdk1.8.0_45
Setting GRADLE_2_4_RC_2_HOME=/home/jenkins/jenkins-slave/tools/hudson.plugins.gradle.GradleInstallation/Gradle_2.4-rc-2

Build failed in Jenkins: kafka-trunk-jdk8 #283

Posted by Apache Jenkins Server <je...@builds.apache.org>.
See <https://builds.apache.org/job/kafka-trunk-jdk8/283/changes>

Changes:

[me] KAFKA-3077: Enable KafkaLog4jAppender to work with SASL enabled brokers

[me] KAFKA-3078: Add ducktape tests for KafkaLog4jAppender producing to SASL

------------------------------------------
Started by an SCM change
[EnvInject] - Loading node environment variables.
Building remotely on H11 (Ubuntu ubuntu) in workspace <https://builds.apache.org/job/kafka-trunk-jdk8/ws/>
 > git rev-parse --is-inside-work-tree # timeout=10
Fetching changes from the remote Git repository
 > git config remote.origin.url https://git-wip-us.apache.org/repos/asf/kafka.git # timeout=10
Fetching upstream changes from https://git-wip-us.apache.org/repos/asf/kafka.git
 > git --version # timeout=10
 > git -c core.askpass=true fetch --tags --progress https://git-wip-us.apache.org/repos/asf/kafka.git +refs/heads/*:refs/remotes/origin/*
 > git rev-parse refs/remotes/origin/trunk^{commit} # timeout=10
 > git rev-parse refs/remotes/origin/origin/trunk^{commit} # timeout=10
Checking out Revision 3e5afbfa0dd4ddfca65fae1f3b2a268ae1ed2025 (refs/remotes/origin/trunk)
 > git config core.sparsecheckout # timeout=10
 > git checkout -f 3e5afbfa0dd4ddfca65fae1f3b2a268ae1ed2025
 > git rev-list c9114488b3c266fe60cf96426bfa143b4b8109c0 # timeout=10
Setting JDK1_8_0_45_HOME=/home/jenkins/jenkins-slave/tools/hudson.model.JDK/jdk1.8.0_45
Setting GRADLE_2_4_RC_2_HOME=/home/jenkins/jenkins-slave/tools/hudson.plugins.gradle.GradleInstallation/Gradle_2.4-rc-2
[kafka-trunk-jdk8] $ /bin/bash -xe /tmp/hudson5029082849137075693.sh
+ /home/jenkins/jenkins-slave/tools/hudson.plugins.gradle.GradleInstallation/Gradle_2.4-rc-2/bin/gradle
To honour the JVM settings for this build a new JVM will be forked. Please consider using the daemon: http://gradle.org/docs/2.4-rc-2/userguide/gradle_daemon.html.
Building project 'core' with Scala version 2.10.6
:downloadWrapper

BUILD SUCCESSFUL

Total time: 9.77 secs
Setting JDK1_8_0_45_HOME=/home/jenkins/jenkins-slave/tools/hudson.model.JDK/jdk1.8.0_45
Setting GRADLE_2_4_RC_2_HOME=/home/jenkins/jenkins-slave/tools/hudson.plugins.gradle.GradleInstallation/Gradle_2.4-rc-2
[kafka-trunk-jdk8] $ /bin/bash -xe /tmp/hudson562357031729644668.sh
+ export GRADLE_OPTS=-Xmx1024m
+ GRADLE_OPTS=-Xmx1024m
+ ./gradlew -Dorg.gradle.project.maxParallelForks=1 clean jarAll testAll
To honour the JVM settings for this build a new JVM will be forked. Please consider using the daemon: https://docs.gradle.org/2.10/userguide/gradle_daemon.html.
Building project 'core' with Scala version 2.10.6
:clean UP-TO-DATE
:clients:clean UP-TO-DATE
:connect:clean UP-TO-DATE
:core:clean UP-TO-DATE
:examples:clean UP-TO-DATE
:log4j-appender:clean UP-TO-DATE
:streams:clean UP-TO-DATE
:tools:clean UP-TO-DATE
:connect:api:clean UP-TO-DATE
:connect:file:clean UP-TO-DATE
:connect:json:clean UP-TO-DATE
:connect:runtime:clean UP-TO-DATE
:jar_core_2_10
Building project 'core' with Scala version 2.10.6
:kafka-trunk-jdk8:clients:compileJava
:jar_core_2_10 FAILED

FAILURE: Build failed with an exception.

* What went wrong:
Failed to capture snapshot of input files for task 'compileJava' during up-to-date check.  See stacktrace for details.
> Could not add entry '/home/jenkins/.gradle/caches/modules-2/files-2.1/net.jpountz.lz4/lz4/1.3.0/c708bb2590c0652a642236ef45d9f99ff842a2ce/lz4-1.3.0.jar' to cache fileHashes.bin (<https://builds.apache.org/job/kafka-trunk-jdk8/ws/.gradle/2.10/taskArtifacts/fileHashes.bin).>

* Try:
Run with --stacktrace option to get the stack trace. Run with --info or --debug option to get more log output.

BUILD FAILED

Total time: 9.996 secs
Build step 'Execute shell' marked build as failure
Recording test results
Setting JDK1_8_0_45_HOME=/home/jenkins/jenkins-slave/tools/hudson.model.JDK/jdk1.8.0_45
Setting GRADLE_2_4_RC_2_HOME=/home/jenkins/jenkins-slave/tools/hudson.plugins.gradle.GradleInstallation/Gradle_2.4-rc-2
ERROR: Publisher 'Publish JUnit test result report' failed: No test report files were found. Configuration error?
Setting JDK1_8_0_45_HOME=/home/jenkins/jenkins-slave/tools/hudson.model.JDK/jdk1.8.0_45
Setting GRADLE_2_4_RC_2_HOME=/home/jenkins/jenkins-slave/tools/hudson.plugins.gradle.GradleInstallation/Gradle_2.4-rc-2