You are viewing a plain text version of this content. The canonical link for it is here.
Posted to builds@cassandra.apache.org by Apache Jenkins Server <je...@builds.apache.org> on 2022/06/29 09:19:18 UTC

Build complete: Cassandra-trunk #1210 [UNSTABLE] 8ffaf4af62b87e2b7a70aea88a850242eb522f9a

-------------------------------------------------------------------------------
Build Cassandra-trunk #1210 Still Unstable
URL: https://ci-cassandra.apache.org/job/Cassandra-trunk/1210/
-------------------------------------------------------------------------------
Changes:
[Ekaterina Dimitrova] Add toBytesInLong to IntKibibytesBound to support widening to long in


-------------------------------------------------------------------------------
Failed Tests:
20 tests failed.
FAILED:  org.apache.cassandra.distributed.upgrade.CompactStorageHiddenColumnTest.testHiddenColumnWithCompactStorage
FAILED:  org.apache.cassandra.distributed.upgrade.MixedModeReadRepairWriteTest.mixedModeReadRepairInsert
FAILED:  org.apache.cassandra.distributed.upgrade.CompactStoragePagingTest.testPagingWithCompactStorage
FAILED:  org.apache.cassandra.distributed.test.SchemaTest.readRepairWithCompaction
FAILED:  org.apache.cassandra.distributed.test.SchemaTest.readRepair
FAILED:  org.apache.cassandra.distributed.test.CASTest.testSuccessfulWriteBeforeRangeMovement
FAILED:  org.apache.cassandra.db.monitoring.MonitoringTaskTest.testNoReportSlowIfZeroSlowTimeout-cdc
FAILED:  org.apache.cassandra.cql3.validation.entities.SecondaryIndexTest.testIndexOnCountersInvalid
FAILED:  org.apache.cassandra.cql3.validation.entities.SecondaryIndexTest.testWithEmptyRestrictionValueAndSecondaryIndex
FAILED:  org.apache.cassandra.cql3.validation.entities.SecondaryIndexTest.testRangeQuery
FAILED:  org.apache.cassandra.cql3.validation.entities.SecondaryIndexTest.testRangeQuery
FAILED:  org.apache.cassandra.cql3.validation.entities.SecondaryIndexTest.testIndexOnRegularColumnInsertExpiringColumnWithFlush
FAILED:  org.apache.cassandra.cql3.ViewComplexTTLTest.testUpdateColumnInViewPKWithTTLWithFlush[3]
FAILED:  org.apache.cassandra.cql3.validation.operations.SelectTest.testTokenFctRejectsInvalidColumnName
FAILED:  org.apache.cassandra.cql3.validation.operations.SelectTest.testCKQueryWithValueOver64K
FAILED:  org.apache.cassandra.distributed.upgrade.BatchUpgradeTest.batchTest
FAILED:  org.apache.cassandra.distributed.upgrade.BatchUpgradeTest.batchTest
FAILED:  dtest-novnode.snitch_test.TestGossipingPropertyFileSnitch.test_prefer_local_reconnect_on_listen_address
FAILED:  dtest-offheap.snitch_test.TestGossipingPropertyFileSnitch.test_prefer_local_reconnect_on_listen_address
FAILED:  dtest.snitch_test.TestGossipingPropertyFileSnitch.test_prefer_local_reconnect_on_listen_address

-------------------------------------------------------------------------------
For complete test report and logs see https://nightlies.apache.org/cassandra/Cassandra-trunk/1210/