You are viewing a plain text version of this content. The canonical link for it is here.
Posted to commits@phoenix.apache.org by Apache Jenkins Server <je...@builds.apache.org> on 2017/02/28 22:35:03 UTC
Build failed in Jenkins: Phoenix-4.x-HBase-1.1 #347
See <https://builds.apache.org/job/Phoenix-4.x-HBase-1.1/347/display/redirect?page=changes>
Changes:
[elserj] PHOENIX-3686 Allow client-authentication to be disabled for PQS
------------------------------------------
[...truncated 74.90 KB...]
Results :
Tests run: 1680, Failures: 0, Errors: 0, Skipped: 28
[INFO]
[INFO] --- maven-failsafe-plugin:2.19.1:integration-test (ClientManagedTimeTests) @ phoenix-core ---
-------------------------------------------------------
T E S T S
-------------------------------------------------------
Running org.apache.phoenix.end2end.ColumnProjectionOptimizationIT
Running org.apache.phoenix.end2end.CaseStatementIT
Running org.apache.phoenix.end2end.AggregateQueryIT
Running org.apache.phoenix.end2end.ArrayIT
Running org.apache.phoenix.end2end.CastAndCoerceIT
Running org.apache.phoenix.end2end.ClientTimeArithmeticQueryIT
Tests run: 3, Failures: 0, Errors: 0, Skipped: 0, Time elapsed: 26.044 sec - in org.apache.phoenix.end2end.ColumnProjectionOptimizationIT
Running org.apache.phoenix.end2end.CreateSchemaIT
Tests run: 1, Failures: 0, Errors: 0, Skipped: 0, Time elapsed: 0.27 sec - in org.apache.phoenix.end2end.CreateSchemaIT
Running org.apache.phoenix.end2end.CreateTableIT
Tests run: 56, Failures: 0, Errors: 0, Skipped: 0, Time elapsed: 93.689 sec - in org.apache.phoenix.end2end.CaseStatementIT
Running org.apache.phoenix.end2end.CustomEntityDataIT
Tests run: 80, Failures: 0, Errors: 0, Skipped: 0, Time elapsed: 95.24 sec - in org.apache.phoenix.end2end.ArrayIT
Running org.apache.phoenix.end2end.DerivedTableIT
Tests run: 3, Failures: 0, Errors: 0, Skipped: 0, Time elapsed: 6.648 sec - in org.apache.phoenix.end2end.CustomEntityDataIT
Tests run: 49, Failures: 0, Errors: 0, Skipped: 0, Time elapsed: 95.1 sec - in org.apache.phoenix.end2end.CastAndCoerceIT
Running org.apache.phoenix.end2end.DistinctCountIT
Running org.apache.phoenix.end2end.DropSchemaIT
Tests run: 2, Failures: 0, Errors: 0, Skipped: 0, Time elapsed: 10.326 sec - in org.apache.phoenix.end2end.DropSchemaIT
Tests run: 42, Failures: 0, Errors: 0, Skipped: 0, Time elapsed: 112.781 sec - in org.apache.phoenix.end2end.AggregateQueryIT
Running org.apache.phoenix.end2end.ExtendedQueryExecIT
Running org.apache.phoenix.end2end.FunkyNamesIT
Tests run: 18, Failures: 0, Errors: 0, Skipped: 0, Time elapsed: 18.794 sec - in org.apache.phoenix.end2end.DerivedTableIT
Tests run: 3, Failures: 0, Errors: 0, Skipped: 0, Time elapsed: 5.417 sec - in org.apache.phoenix.end2end.FunkyNamesIT
Tests run: 4, Failures: 0, Errors: 0, Skipped: 0, Time elapsed: 7.12 sec - in org.apache.phoenix.end2end.ExtendedQueryExecIT
Running org.apache.phoenix.end2end.GroupByIT
Tests run: 10, Failures: 0, Errors: 0, Skipped: 0, Time elapsed: 20.092 sec - in org.apache.phoenix.end2end.DistinctCountIT
Running org.apache.phoenix.end2end.MutableQueryIT
Running org.apache.phoenix.end2end.NotQueryIT
Tests run: 16, Failures: 0, Errors: 0, Skipped: 0, Time elapsed: 97.124 sec - in org.apache.phoenix.end2end.CreateTableIT
Running org.apache.phoenix.end2end.NativeHBaseTypesIT
Running org.apache.phoenix.end2end.PointInTimeQueryIT
Tests run: 7, Failures: 0, Errors: 0, Skipped: 0, Time elapsed: 4.606 sec - in org.apache.phoenix.end2end.NativeHBaseTypesIT
Running org.apache.phoenix.end2end.ProductMetricsIT
Tests run: 61, Failures: 0, Errors: 0, Skipped: 0, Time elapsed: 32.43 sec - in org.apache.phoenix.end2end.ProductMetricsIT
Running org.apache.phoenix.end2end.QueryDatabaseMetaDataIT
Tests run: 245, Failures: 0, Errors: 0, Skipped: 0, Time elapsed: 162.617 sec - in org.apache.phoenix.end2end.ClientTimeArithmeticQueryIT
Tests run: 77, Failures: 0, Errors: 0, Skipped: 0, Time elapsed: 64.302 sec - in org.apache.phoenix.end2end.NotQueryIT
Running org.apache.phoenix.end2end.ReadIsolationLevelIT
Tests run: 2, Failures: 0, Errors: 0, Skipped: 0, Time elapsed: 6.858 sec - in org.apache.phoenix.end2end.ReadIsolationLevelIT
Running org.apache.phoenix.end2end.RowValueConstructorIT
Running org.apache.phoenix.end2end.QueryIT
Tests run: 7, Failures: 0, Errors: 0, Skipped: 0, Time elapsed: 75.69 sec - in org.apache.phoenix.end2end.PointInTimeQueryIT
Running org.apache.phoenix.end2end.ScanQueryIT
Tests run: 91, Failures: 0, Errors: 0, Skipped: 0, Time elapsed: 109.46 sec - in org.apache.phoenix.end2end.GroupByIT
Running org.apache.phoenix.end2end.SequenceBulkAllocationIT
Tests run: 112, Failures: 0, Errors: 0, Skipped: 0, Time elapsed: 70.074 sec - in org.apache.phoenix.end2end.QueryIT
Running org.apache.phoenix.end2end.SequenceIT
Tests run: 112, Failures: 0, Errors: 0, Skipped: 0, Time elapsed: 78.287 sec - in org.apache.phoenix.end2end.ScanQueryIT
Running org.apache.phoenix.end2end.ToNumberFunctionIT
Tests run: 56, Failures: 0, Errors: 0, Skipped: 0, Time elapsed: 25.825 sec - in org.apache.phoenix.end2end.SequenceBulkAllocationIT
Running org.apache.phoenix.end2end.TopNIT
Tests run: 19, Failures: 0, Errors: 0, Skipped: 0, Time elapsed: 128.052 sec - in org.apache.phoenix.end2end.QueryDatabaseMetaDataIT
Running org.apache.phoenix.end2end.TruncateFunctionIT
Tests run: 4, Failures: 0, Errors: 0, Skipped: 0, Time elapsed: 6.798 sec - in org.apache.phoenix.end2end.TopNIT
Running org.apache.phoenix.end2end.UpsertSelectIT
Tests run: 18, Failures: 0, Errors: 0, Skipped: 0, Time elapsed: 12.645 sec - in org.apache.phoenix.end2end.ToNumberFunctionIT
Tests run: 1, Failures: 0, Errors: 0, Skipped: 0, Time elapsed: 5.223 sec - in org.apache.phoenix.end2end.TruncateFunctionIT
Running org.apache.phoenix.end2end.UpsertValuesIT
Tests run: 46, Failures: 0, Errors: 0, Skipped: 0, Time elapsed: 119.084 sec - in org.apache.phoenix.end2end.RowValueConstructorIT
Tests run: 54, Failures: 0, Errors: 0, Skipped: 0, Time elapsed: 51.037 sec - in org.apache.phoenix.end2end.SequenceIT
Tests run: 112, Failures: 0, Errors: 0, Skipped: 0, Time elapsed: 204.337 sec - in org.apache.phoenix.end2end.MutableQueryIT
Running org.apache.phoenix.end2end.VariableLengthPKIT
Running org.apache.phoenix.end2end.salted.SaltedTableIT
Tests run: 8, Failures: 0, Errors: 0, Skipped: 0, Time elapsed: 7.024 sec - in org.apache.phoenix.end2end.salted.SaltedTableIT
Running org.apache.phoenix.rpc.UpdateCacheWithScnIT
Tests run: 1, Failures: 0, Errors: 0, Skipped: 0, Time elapsed: 5.206 sec - in org.apache.phoenix.rpc.UpdateCacheWithScnIT
Tests run: 50, Failures: 0, Errors: 0, Skipped: 0, Time elapsed: 39.726 sec - in org.apache.phoenix.end2end.VariableLengthPKIT
Tests run: 25, Failures: 0, Errors: 0, Skipped: 0, Time elapsed: 111.745 sec - in org.apache.phoenix.end2end.UpsertValuesIT
Tests run: 22, Failures: 0, Errors: 0, Skipped: 0, Time elapsed: 124.556 sec - in org.apache.phoenix.end2end.UpsertSelectIT
Results :
Tests run: 1417, Failures: 0, Errors: 0, Skipped: 0
[INFO]
[INFO] --- maven-failsafe-plugin:2.19.1:integration-test (HBaseManagedTimeTests) @ phoenix-core ---
-------------------------------------------------------
T E S T S
-------------------------------------------------------
Results :
Tests run: 0, Failures: 0, Errors: 0, Skipped: 0
[INFO]
[INFO] --- maven-failsafe-plugin:2.19.1:integration-test (NeedTheirOwnClusterTests) @ phoenix-core ---
-------------------------------------------------------
T E S T S
-------------------------------------------------------
Running org.apache.hadoop.hbase.regionserver.wal.WALReplayWithIndexWritesAndCompressedWALIT
Running org.apache.phoenix.end2end.ConnectionUtilIT
Tests run: 1, Failures: 0, Errors: 0, Skipped: 0, Time elapsed: 36.479 sec - in org.apache.hadoop.hbase.regionserver.wal.WALReplayWithIndexWritesAndCompressedWALIT
Running org.apache.phoenix.end2end.AutomaticRebuildIT
Running org.apache.phoenix.end2end.CountDistinctCompressionIT
Running org.apache.phoenix.end2end.CsvBulkLoadToolIT
Running org.apache.phoenix.end2end.ContextClassloaderIT
Tests run: 1, Failures: 0, Errors: 0, Skipped: 0, Time elapsed: 9.475 sec - in org.apache.phoenix.end2end.CountDistinctCompressionIT
Tests run: 1, Failures: 0, Errors: 0, Skipped: 0, Time elapsed: 28.564 sec - in org.apache.phoenix.end2end.ConnectionUtilIT
Tests run: 3, Failures: 0, Errors: 0, Skipped: 0, Time elapsed: 9.575 sec - in org.apache.phoenix.end2end.ContextClassloaderIT
Running org.apache.phoenix.end2end.FlappingLocalIndexIT
Running org.apache.phoenix.end2end.IndexExtendedIT
Running org.apache.phoenix.end2end.IndexToolForPartialBuildIT
Running org.apache.phoenix.end2end.IndexToolForPartialBuildWithNamespaceEnabledIT
Tests run: 10, Failures: 0, Errors: 0, Skipped: 0, Time elapsed: 70.547 sec - in org.apache.phoenix.end2end.CsvBulkLoadToolIT
Tests run: 2, Failures: 0, Errors: 0, Skipped: 0, Time elapsed: 38.895 sec - in org.apache.phoenix.end2end.IndexToolForPartialBuildIT
Tests run: 2, Failures: 0, Errors: 0, Skipped: 0, Time elapsed: 61.896 sec - in org.apache.phoenix.end2end.IndexToolForPartialBuildWithNamespaceEnabledIT
Tests run: 8, Failures: 0, Errors: 0, Skipped: 0, Time elapsed: 78.328 sec - in org.apache.phoenix.end2end.FlappingLocalIndexIT
Running org.apache.phoenix.end2end.QueryWithLimitIT
Running org.apache.phoenix.end2end.QueryTimeoutIT
Tests run: 2, Failures: 0, Errors: 0, Skipped: 0, Time elapsed: 9.549 sec - in org.apache.phoenix.end2end.QueryWithLimitIT
Tests run: 2, Failures: 0, Errors: 0, Skipped: 0, Time elapsed: 19.607 sec - in org.apache.phoenix.end2end.QueryTimeoutIT
Running org.apache.phoenix.end2end.RegexBulkLoadToolIT
Running org.apache.phoenix.end2end.RenewLeaseIT
Tests run: 2, Failures: 0, Errors: 0, Skipped: 0, Time elapsed: 170.498 sec - in org.apache.phoenix.end2end.AutomaticRebuildIT
Tests run: 1, Failures: 0, Errors: 1, Skipped: 0, Time elapsed: 9.086 sec <<< FAILURE! - in org.apache.phoenix.end2end.RenewLeaseIT
testLeaseDoesNotTimeout(org.apache.phoenix.end2end.RenewLeaseIT) Time elapsed: 6.774 sec <<< ERROR!
org.apache.phoenix.exception.PhoenixIOException: org.apache.phoenix.exception.PhoenixIOException: Failed after retry of OutOfOrderScannerNextException: was there a rpc timeout?
at org.apache.phoenix.end2end.RenewLeaseIT.testLeaseDoesNotTimeout(RenewLeaseIT.java:68)
Caused by: java.util.concurrent.ExecutionException: org.apache.phoenix.exception.PhoenixIOException: Failed after retry of OutOfOrderScannerNextException: was there a rpc timeout?
at org.apache.phoenix.end2end.RenewLeaseIT.testLeaseDoesNotTimeout(RenewLeaseIT.java:68)
Caused by: org.apache.phoenix.exception.PhoenixIOException: Failed after retry of OutOfOrderScannerNextException: was there a rpc timeout?
Caused by: org.apache.phoenix.exception.PhoenixIOException: Failed after retry of OutOfOrderScannerNextException: was there a rpc timeout?
Caused by: org.apache.hadoop.hbase.DoNotRetryIOException: Failed after retry of OutOfOrderScannerNextException: was there a rpc timeout?
Caused by: org.apache.hadoop.hbase.exceptions.OutOfOrderScannerNextException:
org.apache.hadoop.hbase.exceptions.OutOfOrderScannerNextException: Expected nextCallSeq: 1 But the nextCallSeq got from client: 0; request=scanner_id: 39 number_of_rows: 2147483647 close_scanner: false next_call_seq: 0 client_handles_partials: true client_handles_heartbeats: true renew: false
at org.apache.hadoop.hbase.regionserver.RSRpcServices.scan(RSRpcServices.java:2351)
at org.apache.hadoop.hbase.protobuf.generated.ClientProtos$ClientService$2.callBlockingMethod(ClientProtos.java:32385)
at org.apache.hadoop.hbase.ipc.RpcServer.call(RpcServer.java:2137)
at org.apache.hadoop.hbase.ipc.CallRunner.run(CallRunner.java:107)
at org.apache.hadoop.hbase.ipc.RpcExecutor.consumerLoop(RpcExecutor.java:133)
at org.apache.hadoop.hbase.ipc.RpcExecutor$1.run(RpcExecutor.java:108)
at java.lang.Thread.run(Thread.java:745)
Caused by: org.apache.hadoop.hbase.ipc.RemoteWithExtrasException:
org.apache.hadoop.hbase.exceptions.OutOfOrderScannerNextException: Expected nextCallSeq: 1 But the nextCallSeq got from client: 0; request=scanner_id: 39 number_of_rows: 2147483647 close_scanner: false next_call_seq: 0 client_handles_partials: true client_handles_heartbeats: true renew: false
at org.apache.hadoop.hbase.regionserver.RSRpcServices.scan(RSRpcServices.java:2351)
at org.apache.hadoop.hbase.protobuf.generated.ClientProtos$ClientService$2.callBlockingMethod(ClientProtos.java:32385)
at org.apache.hadoop.hbase.ipc.RpcServer.call(RpcServer.java:2137)
at org.apache.hadoop.hbase.ipc.CallRunner.run(CallRunner.java:107)
at org.apache.hadoop.hbase.ipc.RpcExecutor.consumerLoop(RpcExecutor.java:133)
at org.apache.hadoop.hbase.ipc.RpcExecutor$1.run(RpcExecutor.java:108)
at java.lang.Thread.run(Thread.java:745)
Running org.apache.phoenix.end2end.SpillableGroupByIT
Running org.apache.phoenix.end2end.StatsCollectorIT
Running org.apache.phoenix.end2end.SysTableNamespaceMappedStatsCollectorIT
Tests run: 2, Failures: 0, Errors: 0, Skipped: 0, Time elapsed: 17.047 sec - in org.apache.phoenix.end2end.SpillableGroupByIT
Tests run: 10, Failures: 0, Errors: 0, Skipped: 0, Time elapsed: 70.023 sec - in org.apache.phoenix.end2end.RegexBulkLoadToolIT
Running org.apache.phoenix.end2end.UserDefinedFunctionsIT
Running org.apache.phoenix.end2end.index.ImmutableIndexIT
Running org.apache.phoenix.end2end.index.LocalIndexIT
Tests run: 14, Failures: 0, Errors: 0, Skipped: 0, Time elapsed: 41.607 sec - in org.apache.phoenix.end2end.UserDefinedFunctionsIT
Running org.apache.phoenix.end2end.index.MutableIndexFailureIT
Tests run: 80, Failures: 0, Errors: 0, Skipped: 0, Time elapsed: 261.321 sec - in org.apache.phoenix.end2end.IndexExtendedIT
Running org.apache.phoenix.end2end.index.MutableIndexReplicationIT
Tests run: 1, Failures: 0, Errors: 0, Skipped: 0, Time elapsed: 26.156 sec - in org.apache.phoenix.end2end.index.MutableIndexReplicationIT
Running org.apache.phoenix.end2end.index.ReadOnlyIndexFailureIT
Tests run: 120, Failures: 0, Errors: 0, Skipped: 24, Time elapsed: 217.352 sec - in org.apache.phoenix.end2end.StatsCollectorIT
Tests run: 2, Failures: 0, Errors: 0, Skipped: 0, Time elapsed: 32.342 sec - in org.apache.phoenix.end2end.index.ReadOnlyIndexFailureIT
Tests run: 120, Failures: 0, Errors: 0, Skipped: 24, Time elapsed: 233.851 sec - in org.apache.phoenix.end2end.SysTableNamespaceMappedStatsCollectorIT
Running org.apache.phoenix.hbase.index.FailForUnsupportedHBaseVersionsIT
Running org.apache.phoenix.end2end.index.txn.TxWriteFailureIT
Tests run: 2, Failures: 0, Errors: 0, Skipped: 0, Time elapsed: 19.208 sec - in org.apache.phoenix.hbase.index.FailForUnsupportedHBaseVersionsIT
Running org.apache.phoenix.hbase.index.covered.EndToEndCoveredColumnsIndexBuilderIT
Running org.apache.phoenix.execute.PartialCommitIT
Tests run: 2, Failures: 0, Errors: 0, Skipped: 0, Time elapsed: 18.161 sec - in org.apache.phoenix.hbase.index.covered.EndToEndCoveredColumnsIndexBuilderIT
Tests run: 28, Failures: 0, Errors: 0, Skipped: 0, Time elapsed: 230.522 sec - in org.apache.phoenix.end2end.index.LocalIndexIT
Tests run: 12, Failures: 0, Errors: 0, Skipped: 0, Time elapsed: 11.171 sec - in org.apache.phoenix.execute.PartialCommitIT
Tests run: 8, Failures: 0, Errors: 0, Skipped: 0, Time elapsed: 51.173 sec - in org.apache.phoenix.end2end.index.txn.TxWriteFailureIT
Running org.apache.phoenix.hbase.index.covered.example.FailWithoutRetriesIT
Tests run: 1, Failures: 0, Errors: 0, Skipped: 0, Time elapsed: 8.576 sec - in org.apache.phoenix.hbase.index.covered.example.FailWithoutRetriesIT
Tests run: 8, Failures: 0, Errors: 0, Skipped: 0, Time elapsed: 220.051 sec - in org.apache.phoenix.end2end.index.MutableIndexFailureIT
Running org.apache.phoenix.hbase.index.covered.example.EndToEndCoveredIndexingIT
Running org.apache.phoenix.hbase.index.covered.example.EndtoEndIndexingWithCompressionIT
Tests run: 24, Failures: 0, Errors: 0, Skipped: 0, Time elapsed: 280.82 sec - in org.apache.phoenix.end2end.index.ImmutableIndexIT
Running org.apache.phoenix.iterate.RoundRobinResultIteratorWithStatsIT
Tests run: 1, Failures: 0, Errors: 0, Skipped: 0, Time elapsed: 10.515 sec - in org.apache.phoenix.iterate.RoundRobinResultIteratorWithStatsIT
Running org.apache.phoenix.iterate.ScannerLeaseRenewalIT
Running org.apache.phoenix.monitoring.PhoenixMetricsIT
Running org.apache.phoenix.rpc.PhoenixClientRpcIT
Running org.apache.phoenix.rpc.PhoenixServerRpcIT
Tests run: 2, Failures: 0, Errors: 0, Skipped: 0, Time elapsed: 11.911 sec - in org.apache.phoenix.rpc.PhoenixClientRpcIT
Tests run: 1, Failures: 0, Errors: 0, Skipped: 0, Time elapsed: 12.52 sec - in org.apache.phoenix.rpc.PhoenixServerRpcIT
Tests run: 20, Failures: 0, Errors: 0, Skipped: 0, Time elapsed: 61.283 sec - in org.apache.phoenix.monitoring.PhoenixMetricsIT
Tests run: 11, Failures: 0, Errors: 0, Skipped: 0, Time elapsed: 119.555 sec - in org.apache.phoenix.hbase.index.covered.example.EndToEndCoveredIndexingIT
Tests run: 11, Failures: 0, Errors: 0, Skipped: 0, Time elapsed: 120.499 sec - in org.apache.phoenix.hbase.index.covered.example.EndtoEndIndexingWithCompressionIT
Tests run: 2, Failures: 0, Errors: 0, Skipped: 0, Time elapsed: 169.156 sec - in org.apache.phoenix.iterate.ScannerLeaseRenewalIT
Results :
Tests in error:
RenewLeaseIT.testLeaseDoesNotTimeout:68 » PhoenixIO org.apache.phoenix.excepti...
Tests run: 517, Failures: 0, Errors: 1, Skipped: 48
[INFO]
[INFO] --- maven-failsafe-plugin:2.19.1:verify (ParallelStatsEnabledTest) @ phoenix-core ---
[INFO] ------------------------------------------------------------------------
[INFO] Reactor Summary:
[INFO]
[INFO] Apache Phoenix ..................................... SUCCESS [ 2.516 s]
[INFO] Phoenix Core ....................................... FAILURE [51:38 min]
[INFO] Phoenix - Flume .................................... SKIPPED
[INFO] Phoenix - Kafka .................................... SKIPPED
[INFO] Phoenix - Pig ...................................... SKIPPED
[INFO] Phoenix Query Server Client ........................ SKIPPED
[INFO] Phoenix Query Server ............................... SKIPPED
[INFO] Phoenix - Pherf .................................... SKIPPED
[INFO] Phoenix - Spark .................................... SKIPPED
[INFO] Phoenix - Hive ..................................... SKIPPED
[INFO] Phoenix Client ..................................... SKIPPED
[INFO] Phoenix Server ..................................... SKIPPED
[INFO] Phoenix Assembly ................................... SKIPPED
[INFO] Phoenix - Tracing Web Application .................. SKIPPED
[INFO] ------------------------------------------------------------------------
[INFO] BUILD FAILURE
[INFO] ------------------------------------------------------------------------
[INFO] Total time: 51:42 min
[INFO] Finished at: 2017-02-28T22:30:00+00:00
[INFO] Final Memory: 61M/1134M
[INFO] ------------------------------------------------------------------------
[ERROR] Failed to execute goal org.apache.maven.plugins:maven-failsafe-plugin:2.19.1:verify (ParallelStatsEnabledTest) on project phoenix-core: There was a timeout or other error in the fork -> [Help 1]
[ERROR]
[ERROR] To see the full stack trace of the errors, re-run Maven with the -e switch.
[ERROR] Re-run Maven using the -X switch to enable full debug logging.
[ERROR]
[ERROR] For more information about the errors and possible solutions, please read the following articles:
[ERROR] [Help 1] http://cwiki.apache.org/confluence/display/MAVEN/MojoExecutionException
[ERROR]
[ERROR] After correcting the problems, you can resume the build with the command
[ERROR] mvn <goals> -rf :phoenix-core
Build step 'Invoke top-level Maven targets' marked build as failure
Archiving artifacts
Compressed 1.69 GB of artifacts by 69.4% relative to #336
Recording test results
Build failed in Jenkins: Phoenix-4.x-HBase-1.1 #350
Posted by Apache Jenkins Server <je...@builds.apache.org>.
See <https://builds.apache.org/job/Phoenix-4.x-HBase-1.1/350/display/redirect?page=changes>
Changes:
[gjacoby] PHOENIX-3663 - Implement resource controls in Phoenix JDBC driver.
------------------------------------------
[...truncated 439.71 KB...]
-------------------------------------------------------
T E S T S
-------------------------------------------------------
Results :
Tests run: 0, Failures: 0, Errors: 0, Skipped: 0
[INFO]
[INFO] --- maven-failsafe-plugin:2.19.1:integration-test (NeedTheirOwnClusterTests) @ phoenix-core ---
-------------------------------------------------------
T E S T S
-------------------------------------------------------
Running org.apache.hadoop.hbase.regionserver.wal.WALReplayWithIndexWritesAndCompressedWALIT
Running org.apache.phoenix.end2end.ConnectionUtilIT
Tests run: 1, Failures: 0, Errors: 0, Skipped: 0, Time elapsed: 29.316 sec - in org.apache.hadoop.hbase.regionserver.wal.WALReplayWithIndexWritesAndCompressedWALIT
Running org.apache.phoenix.end2end.CountDistinctCompressionIT
Running org.apache.phoenix.end2end.ContextClassloaderIT
Running org.apache.phoenix.end2end.AutomaticRebuildIT
Running org.apache.phoenix.end2end.CsvBulkLoadToolIT
Tests run: 3, Failures: 0, Errors: 0, Skipped: 0, Time elapsed: 4.531 sec - in org.apache.phoenix.end2end.ContextClassloaderIT
Tests run: 1, Failures: 0, Errors: 0, Skipped: 0, Time elapsed: 15.213 sec - in org.apache.phoenix.end2end.CountDistinctCompressionIT
Tests run: 1, Failures: 0, Errors: 0, Skipped: 0, Time elapsed: 36.497 sec - in org.apache.phoenix.end2end.ConnectionUtilIT
Running org.apache.phoenix.end2end.FlappingLocalIndexIT
Running org.apache.phoenix.end2end.IndexToolForPartialBuildIT
Running org.apache.phoenix.end2end.IndexExtendedIT
Running org.apache.phoenix.end2end.IndexToolForPartialBuildWithNamespaceEnabledIT
Tests run: 11, Failures: 0, Errors: 0, Skipped: 0, Time elapsed: 83.305 sec - in org.apache.phoenix.end2end.CsvBulkLoadToolIT
Tests run: 2, Failures: 0, Errors: 0, Skipped: 0, Time elapsed: 44.056 sec - in org.apache.phoenix.end2end.IndexToolForPartialBuildIT
Tests run: 2, Failures: 0, Errors: 0, Skipped: 0, Time elapsed: 64.961 sec - in org.apache.phoenix.end2end.IndexToolForPartialBuildWithNamespaceEnabledIT
Tests run: 8, Failures: 0, Errors: 0, Skipped: 0, Time elapsed: 92.741 sec - in org.apache.phoenix.end2end.FlappingLocalIndexIT
Running org.apache.phoenix.end2end.QueryTimeoutIT
Running org.apache.phoenix.end2end.QueryWithLimitIT
Tests run: 2, Failures: 0, Errors: 0, Skipped: 0, Time elapsed: 15.397 sec - in org.apache.phoenix.end2end.QueryWithLimitIT
Running org.apache.phoenix.end2end.RegexBulkLoadToolIT
Tests run: 2, Failures: 0, Errors: 0, Skipped: 0, Time elapsed: 160.299 sec - in org.apache.phoenix.end2end.AutomaticRebuildIT
Running org.apache.phoenix.end2end.RenewLeaseIT
Tests run: 1, Failures: 0, Errors: 1, Skipped: 0, Time elapsed: 16.323 sec <<< FAILURE! - in org.apache.phoenix.end2end.RenewLeaseIT
testLeaseDoesNotTimeout(org.apache.phoenix.end2end.RenewLeaseIT) Time elapsed: 6.691 sec <<< ERROR!
org.apache.phoenix.exception.PhoenixIOException: org.apache.phoenix.exception.PhoenixIOException: Failed after retry of OutOfOrderScannerNextException: was there a rpc timeout?
at org.apache.phoenix.end2end.RenewLeaseIT.testLeaseDoesNotTimeout(RenewLeaseIT.java:68)
Caused by: java.util.concurrent.ExecutionException: org.apache.phoenix.exception.PhoenixIOException: Failed after retry of OutOfOrderScannerNextException: was there a rpc timeout?
at org.apache.phoenix.end2end.RenewLeaseIT.testLeaseDoesNotTimeout(RenewLeaseIT.java:68)
Caused by: org.apache.phoenix.exception.PhoenixIOException: Failed after retry of OutOfOrderScannerNextException: was there a rpc timeout?
Caused by: org.apache.phoenix.exception.PhoenixIOException: Failed after retry of OutOfOrderScannerNextException: was there a rpc timeout?
Caused by: org.apache.hadoop.hbase.DoNotRetryIOException: Failed after retry of OutOfOrderScannerNextException: was there a rpc timeout?
Caused by: org.apache.hadoop.hbase.exceptions.OutOfOrderScannerNextException:
org.apache.hadoop.hbase.exceptions.OutOfOrderScannerNextException: Expected nextCallSeq: 1 But the nextCallSeq got from client: 0; request=scanner_id: 40 number_of_rows: 2147483647 close_scanner: false next_call_seq: 0 client_handles_partials: true client_handles_heartbeats: true renew: false
at org.apache.hadoop.hbase.regionserver.RSRpcServices.scan(RSRpcServices.java:2351)
at org.apache.hadoop.hbase.protobuf.generated.ClientProtos$ClientService$2.callBlockingMethod(ClientProtos.java:32385)
at org.apache.hadoop.hbase.ipc.RpcServer.call(RpcServer.java:2137)
at org.apache.hadoop.hbase.ipc.CallRunner.run(CallRunner.java:107)
at org.apache.hadoop.hbase.ipc.RpcExecutor.consumerLoop(RpcExecutor.java:133)
at org.apache.hadoop.hbase.ipc.RpcExecutor$1.run(RpcExecutor.java:108)
at java.lang.Thread.run(Thread.java:745)
Caused by: org.apache.hadoop.hbase.ipc.RemoteWithExtrasException:
org.apache.hadoop.hbase.exceptions.OutOfOrderScannerNextException: Expected nextCallSeq: 1 But the nextCallSeq got from client: 0; request=scanner_id: 40 number_of_rows: 2147483647 close_scanner: false next_call_seq: 0 client_handles_partials: true client_handles_heartbeats: true renew: false
at org.apache.hadoop.hbase.regionserver.RSRpcServices.scan(RSRpcServices.java:2351)
at org.apache.hadoop.hbase.protobuf.generated.ClientProtos$ClientService$2.callBlockingMethod(ClientProtos.java:32385)
at org.apache.hadoop.hbase.ipc.RpcServer.call(RpcServer.java:2137)
at org.apache.hadoop.hbase.ipc.CallRunner.run(CallRunner.java:107)
at org.apache.hadoop.hbase.ipc.RpcExecutor.consumerLoop(RpcExecutor.java:133)
at org.apache.hadoop.hbase.ipc.RpcExecutor$1.run(RpcExecutor.java:108)
at java.lang.Thread.run(Thread.java:745)
Running org.apache.phoenix.end2end.SpillableGroupByIT
Running org.apache.phoenix.end2end.StatsCollectorIT
Tests run: 2, Failures: 0, Errors: 0, Skipped: 0, Time elapsed: 14.782 sec - in org.apache.phoenix.end2end.SpillableGroupByIT
Running org.apache.phoenix.end2end.SysTableNamespaceMappedStatsCollectorIT
Tests run: 10, Failures: 0, Errors: 0, Skipped: 0, Time elapsed: 84.954 sec - in org.apache.phoenix.end2end.RegexBulkLoadToolIT
Running org.apache.phoenix.end2end.UserDefinedFunctionsIT
Running org.apache.phoenix.end2end.index.ImmutableIndexIT
Tests run: 14, Failures: 0, Errors: 0, Skipped: 0, Time elapsed: 63.953 sec - in org.apache.phoenix.end2end.UserDefinedFunctionsIT
Tests run: 80, Failures: 0, Errors: 0, Skipped: 0, Time elapsed: 298.714 sec - in org.apache.phoenix.end2end.IndexExtendedIT
Running org.apache.phoenix.end2end.index.MutableIndexFailureIT
Running org.apache.phoenix.end2end.index.LocalIndexIT
Tests run: 120, Failures: 0, Errors: 0, Skipped: 24, Time elapsed: 353.39 sec - in org.apache.phoenix.end2end.StatsCollectorIT
Tests run: 120, Failures: 0, Errors: 0, Skipped: 24, Time elapsed: 347.51 sec - in org.apache.phoenix.end2end.SysTableNamespaceMappedStatsCollectorIT
Running org.apache.phoenix.end2end.index.MutableIndexReplicationIT
Tests run: 24, Failures: 0, Errors: 0, Skipped: 0, Time elapsed: 328.639 sec - in org.apache.phoenix.end2end.index.ImmutableIndexIT
Running org.apache.phoenix.end2end.index.ReadOnlyIndexFailureIT
Tests run: 8, Failures: 0, Errors: 0, Skipped: 0, Time elapsed: 246.663 sec - in org.apache.phoenix.end2end.index.MutableIndexFailureIT
Tests run: 1, Failures: 0, Errors: 0, Skipped: 0, Time elapsed: 35.601 sec - in org.apache.phoenix.end2end.index.MutableIndexReplicationIT
Running org.apache.phoenix.hbase.index.FailForUnsupportedHBaseVersionsIT
Tests run: 2, Failures: 0, Errors: 0, Skipped: 0, Time elapsed: 35.908 sec - in org.apache.phoenix.end2end.index.ReadOnlyIndexFailureIT
Running org.apache.phoenix.end2end.index.txn.TxWriteFailureIT
Tests run: 2, Failures: 0, Errors: 0, Skipped: 0, Time elapsed: 19.699 sec - in org.apache.phoenix.hbase.index.FailForUnsupportedHBaseVersionsIT
Running org.apache.phoenix.hbase.index.covered.EndToEndCoveredColumnsIndexBuilderIT
Tests run: 28, Failures: 0, Errors: 0, Skipped: 0, Time elapsed: 279.171 sec - in org.apache.phoenix.end2end.index.LocalIndexIT
Tests run: 2, Failures: 0, Errors: 1, Skipped: 0, Time elapsed: 526.496 sec <<< FAILURE! - in org.apache.phoenix.end2end.QueryTimeoutIT
testSetRPCTimeOnConnection(org.apache.phoenix.end2end.QueryTimeoutIT) Time elapsed: 514.323 sec <<< ERROR!
java.sql.SQLException:
org.apache.hadoop.hbase.client.RetriesExhaustedException: Failed after attempts=35, exceptions:
Wed Mar 01 05:43:24 UTC 2017, RpcRetryingCaller{globalStartTime=1488347004632, pause=100, retries=35}, java.io.IOException: Call to priapus.apache.org/67.195.81.188:46439 failed on local exception: org.apache.hadoop.hbase.ipc.CallTimeoutException: Call id=4, waitTime=101, operationTimeout=100 expired.
Wed Mar 01 05:43:24 UTC 2017, RpcRetryingCaller{globalStartTime=1488347004632, pause=100, retries=35}, java.io.IOException: Call to priapus.apache.org/67.195.81.188:46439 failed on local exception: org.apache.hadoop.hbase.ipc.CallTimeoutException: Call id=6, waitTime=102, operationTimeout=100 expired.
Wed Mar 01 05:43:25 UTC 2017, RpcRetryingCaller{globalStartTime=1488347004632, pause=100, retries=35}, java.io.IOException: Call to priapus.apache.org/67.195.81.188:46439 failed on local exception: org.apache.hadoop.hbase.ipc.CallTimeoutException: Call id=8, waitTime=102, operationTimeout=100 expired.
Wed Mar 01 05:43:25 UTC 2017, RpcRetryingCaller{globalStartTime=1488347004632, pause=100, retries=35}, java.io.IOException: Call to priapus.apache.org/67.195.81.188:46439 failed on local exception: org.apache.hadoop.hbase.ipc.CallTimeoutException: Call id=10, waitTime=101, operationTimeout=100 expired.
Wed Mar 01 05:43:26 UTC 2017, RpcRetryingCaller{globalStartTime=1488347004632, pause=100, retries=35}, java.io.IOException: Call to priapus.apache.org/67.195.81.188:46439 failed on local exception: org.apache.hadoop.hbase.ipc.CallTimeoutException: Call id=12, waitTime=101, operationTimeout=100 expired.
Wed Mar 01 05:43:27 UTC 2017, RpcRetryingCaller{globalStartTime=1488347004632, pause=100, retries=35}, java.io.IOException: Call to priapus.apache.org/67.195.81.188:46439 failed on local exception: org.apache.hadoop.hbase.ipc.CallTimeoutException: Call id=14, waitTime=101, operationTimeout=100 expired.
Wed Mar 01 05:43:29 UTC 2017, RpcRetryingCaller{globalStartTime=1488347004632, pause=100, retries=35}, java.io.IOException: Call to priapus.apache.org/67.195.81.188:46439 failed on local exception: org.apache.hadoop.hbase.ipc.CallTimeoutException: Call id=16, waitTime=101, operationTimeout=100 expired.
Wed Mar 01 05:43:33 UTC 2017, RpcRetryingCaller{globalStartTime=1488347004632, pause=100, retries=35}, java.io.IOException: Call to priapus.apache.org/67.195.81.188:46439 failed on local exception: org.apache.hadoop.hbase.ipc.CallTimeoutException: Call id=18, waitTime=101, operationTimeout=100 expired.
Wed Mar 01 05:43:43 UTC 2017, RpcRetryingCaller{globalStartTime=1488347004632, pause=100, retries=35}, java.io.IOException: Call to priapus.apache.org/67.195.81.188:46439 failed on local exception: org.apache.hadoop.hbase.ipc.CallTimeoutException: Call id=20, waitTime=101, operationTimeout=100 expired.
Wed Mar 01 05:43:53 UTC 2017, RpcRetryingCaller{globalStartTime=1488347004632, pause=100, retries=35}, java.io.IOException: Call to priapus.apache.org/67.195.81.188:46439 failed on local exception: org.apache.hadoop.hbase.ipc.CallTimeoutException: Call id=22, waitTime=101, operationTimeout=100 expired.
Wed Mar 01 05:44:04 UTC 2017, RpcRetryingCaller{globalStartTime=1488347004632, pause=100, retries=35}, java.io.IOException: Call to priapus.apache.org/67.195.81.188:46439 failed on local exception: org.apache.hadoop.hbase.ipc.CallTimeoutException: Call id=24, waitTime=101, operationTimeout=100 expired.
Wed Mar 01 05:44:14 UTC 2017, RpcRetryingCaller{globalStartTime=1488347004632, pause=100, retries=35}, java.io.IOException: Call to priapus.apache.org/67.195.81.188:46439 failed on local exception: org.apache.hadoop.hbase.ipc.CallTimeoutException: Call id=26, waitTime=101, operationTimeout=100 expired.
Wed Mar 01 05:44:34 UTC 2017, RpcRetryingCaller{globalStartTime=1488347004632, pause=100, retries=35}, java.io.IOException: Call to priapus.apache.org/67.195.81.188:46439 failed on local exception: org.apache.hadoop.hbase.ipc.CallTimeoutException: Call id=28, waitTime=101, operationTimeout=100 expired.
Wed Mar 01 05:44:54 UTC 2017, RpcRetryingCaller{globalStartTime=1488347004632, pause=100, retries=35}, java.io.IOException: Call to priapus.apache.org/67.195.81.188:46439 failed on local exception: org.apache.hadoop.hbase.ipc.CallTimeoutException: Call id=30, waitTime=102, operationTimeout=100 expired.
Wed Mar 01 05:45:14 UTC 2017, RpcRetryingCaller{globalStartTime=1488347004632, pause=100, retries=35}, java.io.IOException: Call to priapus.apache.org/67.195.81.188:46439 failed on local exception: org.apache.hadoop.hbase.ipc.CallTimeoutException: Call id=32, waitTime=101, operationTimeout=100 expired.
Wed Mar 01 05:45:35 UTC 2017, RpcRetryingCaller{globalStartTime=1488347004632, pause=100, retries=35}, java.io.IOException: Call to priapus.apache.org/67.195.81.188:46439 failed on local exception: org.apache.hadoop.hbase.ipc.CallTimeoutException: Call id=34, waitTime=101, operationTimeout=100 expired.
Wed Mar 01 05:45:55 UTC 2017, RpcRetryingCaller{globalStartTime=1488347004632, pause=100, retries=35}, java.io.IOException: Call to priapus.apache.org/67.195.81.188:46439 failed on local exception: org.apache.hadoop.hbase.ipc.CallTimeoutException: Call id=36, waitTime=101, operationTimeout=100 expired.
Wed Mar 01 05:46:15 UTC 2017, RpcRetryingCaller{globalStartTime=1488347004632, pause=100, retries=35}, java.io.IOException: Call to priapus.apache.org/67.195.81.188:46439 failed on local exception: org.apache.hadoop.hbase.ipc.CallTimeoutException: Call id=38, waitTime=101, operationTimeout=100 expired.
Wed Mar 01 05:46:35 UTC 2017, RpcRetryingCaller{globalStartTime=1488347004632, pause=100, retries=35}, java.io.IOException: Call to priapus.apache.org/67.195.81.188:46439 failed on local exception: org.apache.hadoop.hbase.ipc.CallTimeoutException: Call id=40, waitTime=102, operationTimeout=100 expired.
Wed Mar 01 05:46:55 UTC 2017, RpcRetryingCaller{globalStartTime=1488347004632, pause=100, retries=35}, java.io.IOException: Call to priapus.apache.org/67.195.81.188:46439 failed on local exception: org.apache.hadoop.hbase.ipc.CallTimeoutException: Call id=42, waitTime=101, operationTimeout=100 expired.
Wed Mar 01 05:47:16 UTC 2017, RpcRetryingCaller{globalStartTime=1488347004632, pause=100, retries=35}, java.io.IOException: Call to priapus.apache.org/67.195.81.188:46439 failed on local exception: org.apache.hadoop.hbase.ipc.CallTimeoutException: Call id=44, waitTime=101, operationTimeout=100 expired.
Wed Mar 01 05:47:36 UTC 2017, RpcRetryingCaller{globalStartTime=1488347004632, pause=100, retries=35}, java.io.IOException: Call to priapus.apache.org/67.195.81.188:46439 failed on local exception: org.apache.hadoop.hbase.ipc.CallTimeoutException: Call id=46, waitTime=101, operationTimeout=100 expired.
Wed Mar 01 05:47:56 UTC 2017, RpcRetryingCaller{globalStartTime=1488347004632, pause=100, retries=35}, java.io.IOException: Call to priapus.apache.org/67.195.81.188:46439 failed on local exception: org.apache.hadoop.hbase.ipc.CallTimeoutException: Call id=48, waitTime=101, operationTimeout=100 expired.
Wed Mar 01 05:48:16 UTC 2017, RpcRetryingCaller{globalStartTime=1488347004632, pause=100, retries=35}, java.io.IOException: Call to priapus.apache.org/67.195.81.188:46439 failed on local exception: org.apache.hadoop.hbase.ipc.CallTimeoutException: Call id=50, waitTime=101, operationTimeout=100 expired.
Wed Mar 01 05:48:36 UTC 2017, RpcRetryingCaller{globalStartTime=1488347004632, pause=100, retries=35}, java.io.IOException: Call to priapus.apache.org/67.195.81.188:46439 failed on local exception: org.apache.hadoop.hbase.ipc.CallTimeoutException: Call id=52, waitTime=102, operationTimeout=100 expired.
Wed Mar 01 05:48:57 UTC 2017, RpcRetryingCaller{globalStartTime=1488347004632, pause=100, retries=35}, java.io.IOException: Call to priapus.apache.org/67.195.81.188:46439 failed on local exception: org.apache.hadoop.hbase.ipc.CallTimeoutException: Call id=54, waitTime=101, operationTimeout=100 expired.
Wed Mar 01 05:49:17 UTC 2017, RpcRetryingCaller{globalStartTime=1488347004632, pause=100, retries=35}, java.io.IOException: Call to priapus.apache.org/67.195.81.188:46439 failed on local exception: org.apache.hadoop.hbase.ipc.CallTimeoutException: Call id=56, waitTime=101, operationTimeout=100 expired.
Wed Mar 01 05:49:37 UTC 2017, RpcRetryingCaller{globalStartTime=1488347004632, pause=100, retries=35}, java.io.IOException: Call to priapus.apache.org/67.195.81.188:46439 failed on local exception: org.apache.hadoop.hbase.ipc.CallTimeoutException: Call id=58, waitTime=101, operationTimeout=100 expired.
Wed Mar 01 05:49:57 UTC 2017, RpcRetryingCaller{globalStartTime=1488347004632, pause=100, retries=35}, java.io.IOException: Call to priapus.apache.org/67.195.81.188:46439 failed on local exception: org.apache.hadoop.hbase.ipc.CallTimeoutException: Call id=60, waitTime=101, operationTimeout=100 expired.
Wed Mar 01 05:50:17 UTC 2017, RpcRetryingCaller{globalStartTime=1488347004632, pause=100, retries=35}, java.io.IOException: Call to priapus.apache.org/67.195.81.188:46439 failed on local exception: org.apache.hadoop.hbase.ipc.CallTimeoutException: Call id=62, waitTime=101, operationTimeout=100 expired.
Wed Mar 01 05:50:38 UTC 2017, RpcRetryingCaller{globalStartTime=1488347004632, pause=100, retries=35}, java.io.IOException: Call to priapus.apache.org/67.195.81.188:46439 failed on local exception: org.apache.hadoop.hbase.ipc.CallTimeoutException: Call id=64, waitTime=102, operationTimeout=100 expired.
Wed Mar 01 05:50:58 UTC 2017, RpcRetryingCaller{globalStartTime=1488347004632, pause=100, retries=35}, java.io.IOException: Call to priapus.apache.org/67.195.81.188:46439 failed on local exception: org.apache.hadoop.hbase.ipc.CallTimeoutException: Call id=66, waitTime=101, operationTimeout=100 expired.
Wed Mar 01 05:51:18 UTC 2017, RpcRetryingCaller{globalStartTime=1488347004632, pause=100, retries=35}, java.io.IOException: Call to priapus.apache.org/67.195.81.188:46439 failed on local exception: org.apache.hadoop.hbase.ipc.CallTimeoutException: Call id=68, waitTime=101, operationTimeout=100 expired.
Wed Mar 01 05:51:38 UTC 2017, RpcRetryingCaller{globalStartTime=1488347004632, pause=100, retries=35}, java.io.IOException: Call to priapus.apache.org/67.195.81.188:46439 failed on local exception: org.apache.hadoop.hbase.ipc.CallTimeoutException: Call id=70, waitTime=102, operationTimeout=100 expired.
Wed Mar 01 05:51:58 UTC 2017, RpcRetryingCaller{globalStartTime=1488347004632, pause=100, retries=35}, java.io.IOException: Call to priapus.apache.org/67.195.81.188:46439 failed on local exception: org.apache.hadoop.hbase.ipc.CallTimeoutException: Call id=72, waitTime=101, operationTimeout=100 expired.
at org.apache.phoenix.end2end.QueryTimeoutIT.testSetRPCTimeOnConnection(QueryTimeoutIT.java:88)
Caused by: org.apache.hadoop.hbase.client.RetriesExhaustedException:
Failed after attempts=35, exceptions:
Wed Mar 01 05:43:24 UTC 2017, RpcRetryingCaller{globalStartTime=1488347004632, pause=100, retries=35}, java.io.IOException: Call to priapus.apache.org/67.195.81.188:46439 failed on local exception: org.apache.hadoop.hbase.ipc.CallTimeoutException: Call id=4, waitTime=101, operationTimeout=100 expired.
Wed Mar 01 05:43:24 UTC 2017, RpcRetryingCaller{globalStartTime=1488347004632, pause=100, retries=35}, java.io.IOException: Call to priapus.apache.org/67.195.81.188:46439 failed on local exception: org.apache.hadoop.hbase.ipc.CallTimeoutException: Call id=6, waitTime=102, operationTimeout=100 expired.
Wed Mar 01 05:43:25 UTC 2017, RpcRetryingCaller{globalStartTime=1488347004632, pause=100, retries=35}, java.io.IOException: Call to priapus.apache.org/67.195.81.188:46439 failed on local exception: org.apache.hadoop.hbase.ipc.CallTimeoutException: Call id=8, waitTime=102, operationTimeout=100 expired.
Wed Mar 01 05:43:25 UTC 2017, RpcRetryingCaller{globalStartTime=1488347004632, pause=100, retries=35}, java.io.IOException: Call to priapus.apache.org/67.195.81.188:46439 failed on local exception: org.apache.hadoop.hbase.ipc.CallTimeoutException: Call id=10, waitTime=101, operationTimeout=100 expired.
Wed Mar 01 05:43:26 UTC 2017, RpcRetryingCaller{globalStartTime=1488347004632, pause=100, retries=35}, java.io.IOException: Call to priapus.apache.org/67.195.81.188:46439 failed on local exception: org.apache.hadoop.hbase.ipc.CallTimeoutException: Call id=12, waitTime=101, operationTimeout=100 expired.
Wed Mar 01 05:43:27 UTC 2017, RpcRetryingCaller{globalStartTime=1488347004632, pause=100, retries=35}, java.io.IOException: Call to priapus.apache.org/67.195.81.188:46439 failed on local exception: org.apache.hadoop.hbase.ipc.CallTimeoutException: Call id=14, waitTime=101, operationTimeout=100 expired.
Wed Mar 01 05:43:29 UTC 2017, RpcRetryingCaller{globalStartTime=1488347004632, pause=100, retries=35}, java.io.IOException: Call to priapus.apache.org/67.195.81.188:46439 failed on local exception: org.apache.hadoop.hbase.ipc.CallTimeoutException: Call id=16, waitTime=101, operationTimeout=100 expired.
Wed Mar 01 05:43:33 UTC 2017, RpcRetryingCaller{globalStartTime=1488347004632, pause=100, retries=35}, java.io.IOException: Call to priapus.apache.org/67.195.81.188:46439 failed on local exception: org.apache.hadoop.hbase.ipc.CallTimeoutException: Call id=18, waitTime=101, operationTimeout=100 expired.
Wed Mar 01 05:43:43 UTC 2017, RpcRetryingCaller{globalStartTime=1488347004632, pause=100, retries=35}, java.io.IOException: Call to priapus.apache.org/67.195.81.188:46439 failed on local exception: org.apache.hadoop.hbase.ipc.CallTimeoutException: Call id=20, waitTime=101, operationTimeout=100 expired.
Wed Mar 01 05:43:53 UTC 2017, RpcRetryingCaller{globalStartTime=1488347004632, pause=100, retries=35}, java.io.IOException: Call to priapus.apache.org/67.195.81.188:46439 failed on local exception: org.apache.hadoop.hbase.ipc.CallTimeoutException: Call id=22, waitTime=101, operationTimeout=100 expired.
Wed Mar 01 05:44:04 UTC 2017, RpcRetryingCaller{globalStartTime=1488347004632, pause=100, retries=35}, java.io.IOException: Call to priapus.apache.org/67.195.81.188:46439 failed on local exception: org.apache.hadoop.hbase.ipc.CallTimeoutException: Call id=24, waitTime=101, operationTimeout=100 expired.
Wed Mar 01 05:44:14 UTC 2017, RpcRetryingCaller{globalStartTime=1488347004632, pause=100, retries=35}, java.io.IOException: Call to priapus.apache.org/67.195.81.188:46439 failed on local exception: org.apache.hadoop.hbase.ipc.CallTimeoutException: Call id=26, waitTime=101, operationTimeout=100 expired.
Wed Mar 01 05:44:34 UTC 2017, RpcRetryingCaller{globalStartTime=1488347004632, pause=100, retries=35}, java.io.IOException: Call to priapus.apache.org/67.195.81.188:46439 failed on local exception: org.apache.hadoop.hbase.ipc.CallTimeoutException: Call id=28, waitTime=101, operationTimeout=100 expired.
Wed Mar 01 05:44:54 UTC 2017, RpcRetryingCaller{globalStartTime=1488347004632, pause=100, retries=35}, java.io.IOException: Call to priapus.apache.org/67.195.81.188:46439 failed on local exception: org.apache.hadoop.hbase.ipc.CallTimeoutException: Call id=30, waitTime=102, operationTimeout=100 expired.
Wed Mar 01 05:45:14 UTC 2017, RpcRetryingCaller{globalStartTime=1488347004632, pause=100, retries=35}, java.io.IOException: Call to priapus.apache.org/67.195.81.188:46439 failed on local exception: org.apache.hadoop.hbase.ipc.CallTimeoutException: Call id=32, waitTime=101, operationTimeout=100 expired.
Wed Mar 01 05:45:35 UTC 2017, RpcRetryingCaller{globalStartTime=1488347004632, pause=100, retries=35}, java.io.IOException: Call to priapus.apache.org/67.195.81.188:46439 failed on local exception: org.apache.hadoop.hbase.ipc.CallTimeoutException: Call id=34, waitTime=101, operationTimeout=100 expired.
Wed Mar 01 05:45:55 UTC 2017, RpcRetryingCaller{globalStartTime=1488347004632, pause=100, retries=35}, java.io.IOException: Call to priapus.apache.org/67.195.81.188:46439 failed on local exception: org.apache.hadoop.hbase.ipc.CallTimeoutException: Call id=36, waitTime=101, operationTimeout=100 expired.
Wed Mar 01 05:46:15 UTC 2017, RpcRetryingCaller{globalStartTime=1488347004632, pause=100, retries=35}, java.io.IOException: Call to priapus.apache.org/67.195.81.188:46439 failed on local exception: org.apache.hadoop.hbase.ipc.CallTimeoutException: Call id=38, waitTime=101, operationTimeout=100 expired.
Wed Mar 01 05:46:35 UTC 2017, RpcRetryingCaller{globalStartTime=1488347004632, pause=100, retries=35}, java.io.IOException: Call to priapus.apache.org/67.195.81.188:46439 failed on local exception: org.apache.hadoop.hbase.ipc.CallTimeoutException: Call id=40, waitTime=102, operationTimeout=100 expired.
Wed Mar 01 05:46:55 UTC 2017, RpcRetryingCaller{globalStartTime=1488347004632, pause=100, retries=35}, java.io.IOException: Call to priapus.apache.org/67.195.81.188:46439 failed on local exception: org.apache.hadoop.hbase.ipc.CallTimeoutException: Call id=42, waitTime=101, operationTimeout=100 expired.
Wed Mar 01 05:47:16 UTC 2017, RpcRetryingCaller{globalStartTime=1488347004632, pause=100, retries=35}, java.io.IOException: Call to priapus.apache.org/67.195.81.188:46439 failed on local exception: org.apache.hadoop.hbase.ipc.CallTimeoutException: Call id=44, waitTime=101, operationTimeout=100 expired.
Wed Mar 01 05:47:36 UTC 2017, RpcRetryingCaller{globalStartTime=1488347004632, pause=100, retries=35}, java.io.IOException: Call to priapus.apache.org/67.195.81.188:46439 failed on local exception: org.apache.hadoop.hbase.ipc.CallTimeoutException: Call id=46, waitTime=101, operationTimeout=100 expired.
Wed Mar 01 05:47:56 UTC 2017, RpcRetryingCaller{globalStartTime=1488347004632, pause=100, retries=35}, java.io.IOException: Call to priapus.apache.org/67.195.81.188:46439 failed on local exception: org.apache.hadoop.hbase.ipc.CallTimeoutException: Call id=48, waitTime=101, operationTimeout=100 expired.
Wed Mar 01 05:48:16 UTC 2017, RpcRetryingCaller{globalStartTime=1488347004632, pause=100, retries=35}, java.io.IOException: Call to priapus.apache.org/67.195.81.188:46439 failed on local exception: org.apache.hadoop.hbase.ipc.CallTimeoutException: Call id=50, waitTime=101, operationTimeout=100 expired.
Wed Mar 01 05:48:36 UTC 2017, RpcRetryingCaller{globalStartTime=1488347004632, pause=100, retries=35}, java.io.IOException: Call to priapus.apache.org/67.195.81.188:46439 failed on local exception: org.apache.hadoop.hbase.ipc.CallTimeoutException: Call id=52, waitTime=102, operationTimeout=100 expired.
Wed Mar 01 05:48:57 UTC 2017, RpcRetryingCaller{globalStartTime=1488347004632, pause=100, retries=35}, java.io.IOException: Call to priapus.apache.org/67.195.81.188:46439 failed on local exception: org.apache.hadoop.hbase.ipc.CallTimeoutException: Call id=54, waitTime=101, operationTimeout=100 expired.
Wed Mar 01 05:49:17 UTC 2017, RpcRetryingCaller{globalStartTime=1488347004632, pause=100, retries=35}, java.io.IOException: Call to priapus.apache.org/67.195.81.188:46439 failed on local exception: org.apache.hadoop.hbase.ipc.CallTimeoutException: Call id=56, waitTime=101, operationTimeout=100 expired.
Wed Mar 01 05:49:37 UTC 2017, RpcRetryingCaller{globalStartTime=1488347004632, pause=100, retries=35}, java.io.IOException: Call to priapus.apache.org/67.195.81.188:46439 failed on local exception: org.apache.hadoop.hbase.ipc.CallTimeoutException: Call id=58, waitTime=101, operationTimeout=100 expired.
Wed Mar 01 05:49:57 UTC 2017, RpcRetryingCaller{globalStartTime=1488347004632, pause=100, retries=35}, java.io.IOException: Call to priapus.apache.org/67.195.81.188:46439 failed on local exception: org.apache.hadoop.hbase.ipc.CallTimeoutException: Call id=60, waitTime=101, operationTimeout=100 expired.
Wed Mar 01 05:50:17 UTC 2017, RpcRetryingCaller{globalStartTime=1488347004632, pause=100, retries=35}, java.io.IOException: Call to priapus.apache.org/67.195.81.188:46439 failed on local exception: org.apache.hadoop.hbase.ipc.CallTimeoutException: Call id=62, waitTime=101, operationTimeout=100 expired.
Wed Mar 01 05:50:38 UTC 2017, RpcRetryingCaller{globalStartTime=1488347004632, pause=100, retries=35}, java.io.IOException: Call to priapus.apache.org/67.195.81.188:46439 failed on local exception: org.apache.hadoop.hbase.ipc.CallTimeoutException: Call id=64, waitTime=102, operationTimeout=100 expired.
Wed Mar 01 05:50:58 UTC 2017, RpcRetryingCaller{globalStartTime=1488347004632, pause=100, retries=35}, java.io.IOException: Call to priapus.apache.org/67.195.81.188:46439 failed on local exception: org.apache.hadoop.hbase.ipc.CallTimeoutException: Call id=66, waitTime=101, operationTimeout=100 expired.
Wed Mar 01 05:51:18 UTC 2017, RpcRetryingCaller{globalStartTime=1488347004632, pause=100, retries=35}, java.io.IOException: Call to priapus.apache.org/67.195.81.188:46439 failed on local exception: org.apache.hadoop.hbase.ipc.CallTimeoutException: Call id=68, waitTime=101, operationTimeout=100 expired.
Wed Mar 01 05:51:38 UTC 2017, RpcRetryingCaller{globalStartTime=1488347004632, pause=100, retries=35}, java.io.IOException: Call to priapus.apache.org/67.195.81.188:46439 failed on local exception: org.apache.hadoop.hbase.ipc.CallTimeoutException: Call id=70, waitTime=102, operationTimeout=100 expired.
Wed Mar 01 05:51:58 UTC 2017, RpcRetryingCaller{globalStartTime=1488347004632, pause=100, retries=35}, java.io.IOException: Call to priapus.apache.org/67.195.81.188:46439 failed on local exception: org.apache.hadoop.hbase.ipc.CallTimeoutException: Call id=72, waitTime=101, operationTimeout=100 expired.
at org.apache.phoenix.end2end.QueryTimeoutIT.testSetRPCTimeOnConnection(QueryTimeoutIT.java:88)
Caused by: java.io.IOException: Call to priapus.apache.org/67.195.81.188:46439 failed on local exception: org.apache.hadoop.hbase.ipc.CallTimeoutException: Call id=72, waitTime=101, operationTimeout=100 expired.
at org.apache.phoenix.end2end.QueryTimeoutIT.testSetRPCTimeOnConnection(QueryTimeoutIT.java:88)
Caused by: org.apache.hadoop.hbase.ipc.CallTimeoutException: Call id=72, waitTime=101, operationTimeout=100 expired.
at org.apache.phoenix.end2end.QueryTimeoutIT.testSetRPCTimeOnConnection(QueryTimeoutIT.java:88)
Running org.apache.phoenix.hbase.index.covered.example.FailWithoutRetriesIT
Tests run: 2, Failures: 0, Errors: 0, Skipped: 0, Time elapsed: 17.882 sec - in org.apache.phoenix.hbase.index.covered.EndToEndCoveredColumnsIndexBuilderIT
Tests run: 1, Failures: 0, Errors: 0, Skipped: 0, Time elapsed: 7.993 sec - in org.apache.phoenix.hbase.index.covered.example.FailWithoutRetriesIT
Running org.apache.phoenix.execute.PartialCommitIT
Tests run: 12, Failures: 0, Errors: 0, Skipped: 0, Time elapsed: 6.036 sec - in org.apache.phoenix.execute.PartialCommitIT
Running org.apache.phoenix.hbase.index.covered.example.EndToEndCoveredIndexingIT
Running org.apache.phoenix.hbase.index.covered.example.EndtoEndIndexingWithCompressionIT
Tests run: 8, Failures: 0, Errors: 0, Skipped: 0, Time elapsed: 64.409 sec - in org.apache.phoenix.end2end.index.txn.TxWriteFailureIT
Running org.apache.phoenix.iterate.RoundRobinResultIteratorWithStatsIT
Running org.apache.phoenix.iterate.ScannerLeaseRenewalIT
Running org.apache.phoenix.monitoring.PhoenixMetricsIT
Tests run: 1, Failures: 0, Errors: 0, Skipped: 0, Time elapsed: 12.162 sec - in org.apache.phoenix.iterate.RoundRobinResultIteratorWithStatsIT
Running org.apache.phoenix.rpc.PhoenixClientRpcIT
Running org.apache.phoenix.rpc.PhoenixServerRpcIT
Tests run: 2, Failures: 0, Errors: 0, Skipped: 0, Time elapsed: 16.894 sec - in org.apache.phoenix.rpc.PhoenixClientRpcIT
Tests run: 1, Failures: 0, Errors: 0, Skipped: 0, Time elapsed: 16.473 sec - in org.apache.phoenix.rpc.PhoenixServerRpcIT
Tests run: 21, Failures: 0, Errors: 0, Skipped: 0, Time elapsed: 104.011 sec - in org.apache.phoenix.monitoring.PhoenixMetricsIT
Tests run: 11, Failures: 0, Errors: 0, Skipped: 0, Time elapsed: 148.639 sec - in org.apache.phoenix.hbase.index.covered.example.EndToEndCoveredIndexingIT
Tests run: 11, Failures: 0, Errors: 0, Skipped: 0, Time elapsed: 155.911 sec - in org.apache.phoenix.hbase.index.covered.example.EndtoEndIndexingWithCompressionIT
Tests run: 2, Failures: 0, Errors: 0, Skipped: 0, Time elapsed: 175.327 sec - in org.apache.phoenix.iterate.ScannerLeaseRenewalIT
Results :
Tests in error:
QueryTimeoutIT.testSetRPCTimeOnConnection:88 » SQL org.apache.hadoop.hbase.cli...
RenewLeaseIT.testLeaseDoesNotTimeout:68 » PhoenixIO org.apache.phoenix.excepti...
Tests run: 519, Failures: 0, Errors: 2, Skipped: 48
[INFO]
[INFO] --- maven-failsafe-plugin:2.19.1:verify (ParallelStatsEnabledTest) @ phoenix-core ---
[INFO] ------------------------------------------------------------------------
[INFO] Reactor Summary:
[INFO]
[INFO] Apache Phoenix ..................................... SUCCESS [ 2.472 s]
[INFO] Phoenix Core ....................................... FAILURE [ 01:35 h]
[INFO] Phoenix - Flume .................................... SKIPPED
[INFO] Phoenix - Kafka .................................... SKIPPED
[INFO] Phoenix - Pig ...................................... SKIPPED
[INFO] Phoenix Query Server Client ........................ SKIPPED
[INFO] Phoenix Query Server ............................... SKIPPED
[INFO] Phoenix - Pherf .................................... SKIPPED
[INFO] Phoenix - Spark .................................... SKIPPED
[INFO] Phoenix - Hive ..................................... SKIPPED
[INFO] Phoenix Client ..................................... SKIPPED
[INFO] Phoenix Server ..................................... SKIPPED
[INFO] Phoenix Assembly ................................... SKIPPED
[INFO] Phoenix - Tracing Web Application .................. SKIPPED
[INFO] ------------------------------------------------------------------------
[INFO] BUILD FAILURE
[INFO] ------------------------------------------------------------------------
[INFO] Total time: 01:35 h
[INFO] Finished at: 2017-03-01T05:56:04+00:00
[INFO] Final Memory: 62M/1097M
[INFO] ------------------------------------------------------------------------
[ERROR] Failed to execute goal org.apache.maven.plugins:maven-failsafe-plugin:2.19.1:verify (ParallelStatsEnabledTest) on project phoenix-core: There are test failures.
[ERROR]
[ERROR] Please refer to <https://builds.apache.org/job/Phoenix-4.x-HBase-1.1/ws/phoenix-core/target/failsafe-reports> for the individual test results.
[ERROR] -> [Help 1]
[ERROR]
[ERROR] To see the full stack trace of the errors, re-run Maven with the -e switch.
[ERROR] Re-run Maven using the -X switch to enable full debug logging.
[ERROR]
[ERROR] For more information about the errors and possible solutions, please read the following articles:
[ERROR] [Help 1] http://cwiki.apache.org/confluence/display/MAVEN/MojoFailureException
[ERROR]
[ERROR] After correcting the problems, you can resume the build with the command
[ERROR] mvn <goals> -rf :phoenix-core
Build step 'Invoke top-level Maven targets' marked build as failure
Archiving artifacts
Recording test results
Build failed in Jenkins: Phoenix-4.x-HBase-1.1 #349
Posted by Apache Jenkins Server <je...@builds.apache.org>.
See <https://builds.apache.org/job/Phoenix-4.x-HBase-1.1/349/display/redirect?page=changes>
Changes:
[samarth] PHOENIX-3703 Immutable multitenant tables created as non-encoded
[samarth] PHOENIX-3539 Fix bulkload for StorageScheme -
------------------------------------------
[...truncated 445.60 KB...]
Tests run: 2024, Failures: 0, Errors: 0, Skipped: 28
[INFO]
[INFO] --- maven-failsafe-plugin:2.19.1:integration-test (ClientManagedTimeTests) @ phoenix-core ---
-------------------------------------------------------
T E S T S
-------------------------------------------------------
Running org.apache.phoenix.end2end.ColumnProjectionOptimizationIT
Running org.apache.phoenix.end2end.ArrayIT
Running org.apache.phoenix.end2end.AggregateQueryIT
Running org.apache.phoenix.end2end.CaseStatementIT
Running org.apache.phoenix.end2end.CastAndCoerceIT
Running org.apache.phoenix.end2end.ClientTimeArithmeticQueryIT
Tests run: 3, Failures: 0, Errors: 0, Skipped: 0, Time elapsed: 31.111 sec - in org.apache.phoenix.end2end.ColumnProjectionOptimizationIT
Running org.apache.phoenix.end2end.CreateSchemaIT
Tests run: 1, Failures: 0, Errors: 0, Skipped: 0, Time elapsed: 0.211 sec - in org.apache.phoenix.end2end.CreateSchemaIT
Running org.apache.phoenix.end2end.CreateTableIT
Tests run: 49, Failures: 0, Errors: 0, Skipped: 0, Time elapsed: 83.632 sec - in org.apache.phoenix.end2end.CastAndCoerceIT
Tests run: 80, Failures: 0, Errors: 0, Skipped: 0, Time elapsed: 88.698 sec - in org.apache.phoenix.end2end.ArrayIT
Running org.apache.phoenix.end2end.CustomEntityDataIT
Tests run: 56, Failures: 0, Errors: 0, Skipped: 0, Time elapsed: 84.744 sec - in org.apache.phoenix.end2end.CaseStatementIT
Running org.apache.phoenix.end2end.DerivedTableIT
Running org.apache.phoenix.end2end.DistinctCountIT
Tests run: 3, Failures: 0, Errors: 0, Skipped: 0, Time elapsed: 6.368 sec - in org.apache.phoenix.end2end.CustomEntityDataIT
Running org.apache.phoenix.end2end.DropSchemaIT
Tests run: 42, Failures: 0, Errors: 0, Skipped: 0, Time elapsed: 101.405 sec - in org.apache.phoenix.end2end.AggregateQueryIT
Tests run: 18, Failures: 0, Errors: 0, Skipped: 0, Time elapsed: 15.829 sec - in org.apache.phoenix.end2end.DerivedTableIT
Running org.apache.phoenix.end2end.ExtendedQueryExecIT
Running org.apache.phoenix.end2end.FunkyNamesIT
Tests run: 2, Failures: 0, Errors: 0, Skipped: 0, Time elapsed: 11.92 sec - in org.apache.phoenix.end2end.DropSchemaIT
Tests run: 10, Failures: 0, Errors: 0, Skipped: 0, Time elapsed: 19.117 sec - in org.apache.phoenix.end2end.DistinctCountIT
Running org.apache.phoenix.end2end.GroupByIT
Tests run: 3, Failures: 0, Errors: 0, Skipped: 0, Time elapsed: 6.218 sec - in org.apache.phoenix.end2end.FunkyNamesIT
Tests run: 4, Failures: 0, Errors: 0, Skipped: 0, Time elapsed: 6.626 sec - in org.apache.phoenix.end2end.ExtendedQueryExecIT
Running org.apache.phoenix.end2end.MutableQueryIT
Running org.apache.phoenix.end2end.NotQueryIT
Running org.apache.phoenix.end2end.NativeHBaseTypesIT
Tests run: 7, Failures: 0, Errors: 0, Skipped: 0, Time elapsed: 4.535 sec - in org.apache.phoenix.end2end.NativeHBaseTypesIT
Running org.apache.phoenix.end2end.PointInTimeQueryIT
Tests run: 245, Failures: 0, Errors: 0, Skipped: 0, Time elapsed: 146.018 sec - in org.apache.phoenix.end2end.ClientTimeArithmeticQueryIT
Tests run: 77, Failures: 0, Errors: 0, Skipped: 0, Time elapsed: 53.688 sec - in org.apache.phoenix.end2end.NotQueryIT
Running org.apache.phoenix.end2end.QueryDatabaseMetaDataIT
Tests run: 91, Failures: 0, Errors: 0, Skipped: 0, Time elapsed: 65.105 sec - in org.apache.phoenix.end2end.GroupByIT
Running org.apache.phoenix.end2end.QueryIT
Running org.apache.phoenix.end2end.ProductMetricsIT
Tests run: 17, Failures: 0, Errors: 0, Skipped: 0, Time elapsed: 157.178 sec - in org.apache.phoenix.end2end.CreateTableIT
Running org.apache.phoenix.end2end.ReadIsolationLevelIT
Tests run: 2, Failures: 0, Errors: 0, Skipped: 0, Time elapsed: 6.12 sec - in org.apache.phoenix.end2end.ReadIsolationLevelIT
Running org.apache.phoenix.end2end.RowValueConstructorIT
Tests run: 61, Failures: 0, Errors: 0, Skipped: 0, Time elapsed: 19.726 sec - in org.apache.phoenix.end2end.ProductMetricsIT
Tests run: 7, Failures: 0, Errors: 0, Skipped: 0, Time elapsed: 73.326 sec - in org.apache.phoenix.end2end.PointInTimeQueryIT
Running org.apache.phoenix.end2end.SequenceBulkAllocationIT
Running org.apache.phoenix.end2end.ScanQueryIT
Tests run: 56, Failures: 0, Errors: 0, Skipped: 0, Time elapsed: 28.508 sec - in org.apache.phoenix.end2end.SequenceBulkAllocationIT
Tests run: 112, Failures: 0, Errors: 0, Skipped: 0, Time elapsed: 66.057 sec - in org.apache.phoenix.end2end.QueryIT
Tests run: 112, Failures: 0, Errors: 0, Skipped: 0, Time elapsed: 56.742 sec - in org.apache.phoenix.end2end.ScanQueryIT
Running org.apache.phoenix.end2end.SequenceIT
Running org.apache.phoenix.end2end.ToNumberFunctionIT
Tests run: 18, Failures: 0, Errors: 0, Skipped: 0, Time elapsed: 8.223 sec - in org.apache.phoenix.end2end.ToNumberFunctionIT
Running org.apache.phoenix.end2end.TruncateFunctionIT
Tests run: 1, Failures: 0, Errors: 0, Skipped: 0, Time elapsed: 5.814 sec - in org.apache.phoenix.end2end.TruncateFunctionIT
Running org.apache.phoenix.end2end.UpsertSelectIT
Tests run: 112, Failures: 0, Errors: 0, Skipped: 0, Time elapsed: 183.007 sec - in org.apache.phoenix.end2end.MutableQueryIT
Running org.apache.phoenix.end2end.TopNIT
Tests run: 19, Failures: 0, Errors: 0, Skipped: 0, Time elapsed: 133.373 sec - in org.apache.phoenix.end2end.QueryDatabaseMetaDataIT
Running org.apache.phoenix.end2end.UpsertValuesIT
Tests run: 4, Failures: 0, Errors: 0, Skipped: 0, Time elapsed: 6.161 sec - in org.apache.phoenix.end2end.TopNIT
Running org.apache.phoenix.end2end.VariableLengthPKIT
Tests run: 54, Failures: 0, Errors: 0, Skipped: 0, Time elapsed: 51.686 sec - in org.apache.phoenix.end2end.SequenceIT
Running org.apache.phoenix.rpc.UpdateCacheWithScnIT
Tests run: 1, Failures: 0, Errors: 0, Skipped: 0, Time elapsed: 6.099 sec - in org.apache.phoenix.rpc.UpdateCacheWithScnIT
Tests run: 46, Failures: 0, Errors: 0, Skipped: 0, Time elapsed: 126.433 sec - in org.apache.phoenix.end2end.RowValueConstructorIT
Running org.apache.phoenix.end2end.salted.SaltedTableIT
Tests run: 8, Failures: 0, Errors: 0, Skipped: 0, Time elapsed: 6.52 sec - in org.apache.phoenix.end2end.salted.SaltedTableIT
Tests run: 50, Failures: 0, Errors: 0, Skipped: 0, Time elapsed: 40.711 sec - in org.apache.phoenix.end2end.VariableLengthPKIT
Tests run: 22, Failures: 0, Errors: 0, Skipped: 0, Time elapsed: 137.75 sec - in org.apache.phoenix.end2end.UpsertSelectIT
Tests run: 25, Failures: 0, Errors: 0, Skipped: 0, Time elapsed: 126.722 sec - in org.apache.phoenix.end2end.UpsertValuesIT
Results :
Tests run: 1418, Failures: 0, Errors: 0, Skipped: 0
[INFO]
[INFO] --- maven-failsafe-plugin:2.19.1:integration-test (HBaseManagedTimeTests) @ phoenix-core ---
-------------------------------------------------------
T E S T S
-------------------------------------------------------
Results :
Tests run: 0, Failures: 0, Errors: 0, Skipped: 0
[INFO]
[INFO] --- maven-failsafe-plugin:2.19.1:integration-test (NeedTheirOwnClusterTests) @ phoenix-core ---
-------------------------------------------------------
T E S T S
-------------------------------------------------------
Running org.apache.hadoop.hbase.regionserver.wal.WALReplayWithIndexWritesAndCompressedWALIT
Running org.apache.phoenix.end2end.ConnectionUtilIT
Tests run: 1, Failures: 0, Errors: 0, Skipped: 0, Time elapsed: 27.492 sec - in org.apache.hadoop.hbase.regionserver.wal.WALReplayWithIndexWritesAndCompressedWALIT
Running org.apache.phoenix.end2end.AutomaticRebuildIT
Running org.apache.phoenix.end2end.CountDistinctCompressionIT
Running org.apache.phoenix.end2end.ContextClassloaderIT
Running org.apache.phoenix.end2end.CsvBulkLoadToolIT
Tests run: 1, Failures: 0, Errors: 0, Skipped: 0, Time elapsed: 28.259 sec - in org.apache.phoenix.end2end.ConnectionUtilIT
Tests run: 3, Failures: 0, Errors: 0, Skipped: 0, Time elapsed: 5.211 sec - in org.apache.phoenix.end2end.ContextClassloaderIT
Tests run: 1, Failures: 0, Errors: 0, Skipped: 0, Time elapsed: 7.527 sec - in org.apache.phoenix.end2end.CountDistinctCompressionIT
Running org.apache.phoenix.end2end.FlappingLocalIndexIT
Running org.apache.phoenix.end2end.IndexExtendedIT
Running org.apache.phoenix.end2end.IndexToolForPartialBuildIT
Running org.apache.phoenix.end2end.IndexToolForPartialBuildWithNamespaceEnabledIT
Tests run: 2, Failures: 0, Errors: 0, Skipped: 0, Time elapsed: 37.937 sec - in org.apache.phoenix.end2end.IndexToolForPartialBuildIT
Tests run: 11, Failures: 0, Errors: 0, Skipped: 0, Time elapsed: 86.901 sec - in org.apache.phoenix.end2end.CsvBulkLoadToolIT
Tests run: 2, Failures: 0, Errors: 0, Skipped: 0, Time elapsed: 55.091 sec - in org.apache.phoenix.end2end.IndexToolForPartialBuildWithNamespaceEnabledIT
Tests run: 8, Failures: 0, Errors: 0, Skipped: 0, Time elapsed: 87.994 sec - in org.apache.phoenix.end2end.FlappingLocalIndexIT
Running org.apache.phoenix.end2end.QueryTimeoutIT
Running org.apache.phoenix.end2end.QueryWithLimitIT
Running org.apache.phoenix.end2end.RegexBulkLoadToolIT
Tests run: 2, Failures: 0, Errors: 0, Skipped: 0, Time elapsed: 8.393 sec - in org.apache.phoenix.end2end.QueryWithLimitIT
Tests run: 2, Failures: 0, Errors: 0, Skipped: 0, Time elapsed: 17.841 sec - in org.apache.phoenix.end2end.QueryTimeoutIT
Running org.apache.phoenix.end2end.RenewLeaseIT
Tests run: 2, Failures: 0, Errors: 0, Skipped: 0, Time elapsed: 167.941 sec - in org.apache.phoenix.end2end.AutomaticRebuildIT
Tests run: 1, Failures: 0, Errors: 1, Skipped: 0, Time elapsed: 8.505 sec <<< FAILURE! - in org.apache.phoenix.end2end.RenewLeaseIT
testLeaseDoesNotTimeout(org.apache.phoenix.end2end.RenewLeaseIT) Time elapsed: 6.63 sec <<< ERROR!
org.apache.phoenix.exception.PhoenixIOException: org.apache.phoenix.exception.PhoenixIOException: Failed after retry of OutOfOrderScannerNextException: was there a rpc timeout?
at org.apache.phoenix.end2end.RenewLeaseIT.testLeaseDoesNotTimeout(RenewLeaseIT.java:68)
Caused by: java.util.concurrent.ExecutionException: org.apache.phoenix.exception.PhoenixIOException: Failed after retry of OutOfOrderScannerNextException: was there a rpc timeout?
at org.apache.phoenix.end2end.RenewLeaseIT.testLeaseDoesNotTimeout(RenewLeaseIT.java:68)
Caused by: org.apache.phoenix.exception.PhoenixIOException: Failed after retry of OutOfOrderScannerNextException: was there a rpc timeout?
Caused by: org.apache.phoenix.exception.PhoenixIOException: Failed after retry of OutOfOrderScannerNextException: was there a rpc timeout?
Caused by: org.apache.hadoop.hbase.DoNotRetryIOException: Failed after retry of OutOfOrderScannerNextException: was there a rpc timeout?
Caused by: org.apache.hadoop.hbase.exceptions.OutOfOrderScannerNextException:
org.apache.hadoop.hbase.exceptions.OutOfOrderScannerNextException: Expected nextCallSeq: 1 But the nextCallSeq got from client: 0; request=scanner_id: 39 number_of_rows: 2147483647 close_scanner: false next_call_seq: 0 client_handles_partials: true client_handles_heartbeats: true renew: false
at org.apache.hadoop.hbase.regionserver.RSRpcServices.scan(RSRpcServices.java:2351)
at org.apache.hadoop.hbase.protobuf.generated.ClientProtos$ClientService$2.callBlockingMethod(ClientProtos.java:32385)
at org.apache.hadoop.hbase.ipc.RpcServer.call(RpcServer.java:2137)
at org.apache.hadoop.hbase.ipc.CallRunner.run(CallRunner.java:107)
at org.apache.hadoop.hbase.ipc.RpcExecutor.consumerLoop(RpcExecutor.java:133)
at org.apache.hadoop.hbase.ipc.RpcExecutor$1.run(RpcExecutor.java:108)
at java.lang.Thread.run(Thread.java:745)
Caused by: org.apache.hadoop.hbase.ipc.RemoteWithExtrasException:
org.apache.hadoop.hbase.exceptions.OutOfOrderScannerNextException: Expected nextCallSeq: 1 But the nextCallSeq got from client: 0; request=scanner_id: 39 number_of_rows: 2147483647 close_scanner: false next_call_seq: 0 client_handles_partials: true client_handles_heartbeats: true renew: false
at org.apache.hadoop.hbase.regionserver.RSRpcServices.scan(RSRpcServices.java:2351)
at org.apache.hadoop.hbase.protobuf.generated.ClientProtos$ClientService$2.callBlockingMethod(ClientProtos.java:32385)
at org.apache.hadoop.hbase.ipc.RpcServer.call(RpcServer.java:2137)
at org.apache.hadoop.hbase.ipc.CallRunner.run(CallRunner.java:107)
at org.apache.hadoop.hbase.ipc.RpcExecutor.consumerLoop(RpcExecutor.java:133)
at org.apache.hadoop.hbase.ipc.RpcExecutor$1.run(RpcExecutor.java:108)
at java.lang.Thread.run(Thread.java:745)
Running org.apache.phoenix.end2end.SpillableGroupByIT
Running org.apache.phoenix.end2end.StatsCollectorIT
Running org.apache.phoenix.end2end.SysTableNamespaceMappedStatsCollectorIT
Tests run: 2, Failures: 0, Errors: 0, Skipped: 0, Time elapsed: 12.762 sec - in org.apache.phoenix.end2end.SpillableGroupByIT
Tests run: 10, Failures: 0, Errors: 0, Skipped: 0, Time elapsed: 79.429 sec - in org.apache.phoenix.end2end.RegexBulkLoadToolIT
Running org.apache.phoenix.end2end.UserDefinedFunctionsIT
Running org.apache.phoenix.end2end.index.ImmutableIndexIT
Running org.apache.phoenix.end2end.index.LocalIndexIT
Tests run: 14, Failures: 0, Errors: 0, Skipped: 0, Time elapsed: 135.644 sec - in org.apache.phoenix.end2end.UserDefinedFunctionsIT
Tests run: 80, Failures: 0, Errors: 0, Skipped: 0, Time elapsed: 344.892 sec - in org.apache.phoenix.end2end.IndexExtendedIT
Running org.apache.phoenix.end2end.index.MutableIndexFailureIT
Running org.apache.phoenix.end2end.index.MutableIndexReplicationIT
Tests run: 1, Failures: 0, Errors: 0, Skipped: 0, Time elapsed: 37.546 sec - in org.apache.phoenix.end2end.index.MutableIndexReplicationIT
Running org.apache.phoenix.end2end.index.ReadOnlyIndexFailureIT
Tests run: 2, Failures: 0, Errors: 0, Skipped: 0, Time elapsed: 32.541 sec - in org.apache.phoenix.end2end.index.ReadOnlyIndexFailureIT
Running org.apache.phoenix.end2end.index.txn.TxWriteFailureIT
Tests run: 120, Failures: 0, Errors: 0, Skipped: 24, Time elapsed: 441.331 sec - in org.apache.phoenix.end2end.StatsCollectorIT
Tests run: 28, Failures: 0, Errors: 0, Skipped: 0, Time elapsed: 419.451 sec - in org.apache.phoenix.end2end.index.LocalIndexIT
Running org.apache.phoenix.hbase.index.FailForUnsupportedHBaseVersionsIT
Tests run: 24, Failures: 0, Errors: 0, Skipped: 0, Time elapsed: 477.859 sec - in org.apache.phoenix.end2end.index.ImmutableIndexIT
Running org.apache.phoenix.execute.PartialCommitIT
Tests run: 12, Failures: 0, Errors: 0, Skipped: 0, Time elapsed: 5.971 sec - in org.apache.phoenix.execute.PartialCommitIT
Tests run: 2, Failures: 0, Errors: 0, Skipped: 0, Time elapsed: 18.591 sec - in org.apache.phoenix.hbase.index.FailForUnsupportedHBaseVersionsIT
Running org.apache.phoenix.hbase.index.covered.EndToEndCoveredColumnsIndexBuilderIT
Tests run: 8, Failures: 0, Errors: 0, Skipped: 0, Time elapsed: 308.918 sec - in org.apache.phoenix.end2end.index.MutableIndexFailureIT
Tests run: 120, Failures: 0, Errors: 0, Skipped: 24, Time elapsed: 533.911 sec - in org.apache.phoenix.end2end.SysTableNamespaceMappedStatsCollectorIT
Tests run: 8, Failures: 0, Errors: 0, Skipped: 0, Time elapsed: 145.117 sec - in org.apache.phoenix.end2end.index.txn.TxWriteFailureIT
Running org.apache.phoenix.hbase.index.covered.example.FailWithoutRetriesIT
Tests run: 2, Failures: 0, Errors: 0, Skipped: 0, Time elapsed: 18.017 sec - in org.apache.phoenix.hbase.index.covered.EndToEndCoveredColumnsIndexBuilderIT
Tests run: 1, Failures: 0, Errors: 0, Skipped: 0, Time elapsed: 8.052 sec - in org.apache.phoenix.hbase.index.covered.example.FailWithoutRetriesIT
Running org.apache.phoenix.hbase.index.covered.example.EndtoEndIndexingWithCompressionIT
Running org.apache.phoenix.hbase.index.covered.example.EndToEndCoveredIndexingIT
Running org.apache.phoenix.iterate.RoundRobinResultIteratorWithStatsIT
Running org.apache.phoenix.iterate.ScannerLeaseRenewalIT
Running org.apache.phoenix.monitoring.PhoenixMetricsIT
Running org.apache.phoenix.rpc.PhoenixClientRpcIT
Tests run: 1, Failures: 0, Errors: 0, Skipped: 0, Time elapsed: 15.968 sec - in org.apache.phoenix.iterate.RoundRobinResultIteratorWithStatsIT
Tests run: 2, Failures: 0, Errors: 0, Skipped: 0, Time elapsed: 12.076 sec - in org.apache.phoenix.rpc.PhoenixClientRpcIT
Running org.apache.phoenix.rpc.PhoenixServerRpcIT
Tests run: 1, Failures: 0, Errors: 0, Skipped: 0, Time elapsed: 11.937 sec - in org.apache.phoenix.rpc.PhoenixServerRpcIT
Tests run: 20, Failures: 0, Errors: 0, Skipped: 0, Time elapsed: 73.921 sec - in org.apache.phoenix.monitoring.PhoenixMetricsIT
Tests run: 11, Failures: 0, Errors: 0, Skipped: 0, Time elapsed: 137.39 sec - in org.apache.phoenix.hbase.index.covered.example.EndtoEndIndexingWithCompressionIT
Tests run: 11, Failures: 0, Errors: 0, Skipped: 0, Time elapsed: 137.356 sec - in org.apache.phoenix.hbase.index.covered.example.EndToEndCoveredIndexingIT
Tests run: 2, Failures: 0, Errors: 0, Skipped: 0, Time elapsed: 166.934 sec - in org.apache.phoenix.iterate.ScannerLeaseRenewalIT
Results :
Tests in error:
RenewLeaseIT.testLeaseDoesNotTimeout:68 » PhoenixIO org.apache.phoenix.excepti...
Tests run: 518, Failures: 0, Errors: 1, Skipped: 48
[INFO]
[INFO] --- maven-failsafe-plugin:2.19.1:verify (ParallelStatsEnabledTest) @ phoenix-core ---
[INFO] ------------------------------------------------------------------------
[INFO] Reactor Summary:
[INFO]
[INFO] Apache Phoenix ..................................... SUCCESS [ 1.894 s]
[INFO] Phoenix Core ....................................... FAILURE [ 01:28 h]
[INFO] Phoenix - Flume .................................... SKIPPED
[INFO] Phoenix - Kafka .................................... SKIPPED
[INFO] Phoenix - Pig ...................................... SKIPPED
[INFO] Phoenix Query Server Client ........................ SKIPPED
[INFO] Phoenix Query Server ............................... SKIPPED
[INFO] Phoenix - Pherf .................................... SKIPPED
[INFO] Phoenix - Spark .................................... SKIPPED
[INFO] Phoenix - Hive ..................................... SKIPPED
[INFO] Phoenix Client ..................................... SKIPPED
[INFO] Phoenix Server ..................................... SKIPPED
[INFO] Phoenix Assembly ................................... SKIPPED
[INFO] Phoenix - Tracing Web Application .................. SKIPPED
[INFO] ------------------------------------------------------------------------
[INFO] BUILD FAILURE
[INFO] ------------------------------------------------------------------------
[INFO] Total time: 01:28 h
[INFO] Finished at: 2017-03-01T03:57:44+00:00
[INFO] Final Memory: 63M/1497M
[INFO] ------------------------------------------------------------------------
[ERROR] Failed to execute goal org.apache.maven.plugins:maven-failsafe-plugin:2.19.1:verify (ParallelStatsEnabledTest) on project phoenix-core: There are test failures.
[ERROR]
[ERROR] Please refer to <https://builds.apache.org/job/Phoenix-4.x-HBase-1.1/ws/phoenix-core/target/failsafe-reports> for the individual test results.
[ERROR] -> [Help 1]
[ERROR]
[ERROR] To see the full stack trace of the errors, re-run Maven with the -e switch.
[ERROR] Re-run Maven using the -X switch to enable full debug logging.
[ERROR]
[ERROR] For more information about the errors and possible solutions, please read the following articles:
[ERROR] [Help 1] http://cwiki.apache.org/confluence/display/MAVEN/MojoFailureException
[ERROR]
[ERROR] After correcting the problems, you can resume the build with the command
[ERROR] mvn <goals> -rf :phoenix-core
Build step 'Invoke top-level Maven targets' marked build as failure
Archiving artifacts
Recording test results
Build failed in Jenkins: Phoenix-4.x-HBase-1.1 #348
Posted by Apache Jenkins Server <je...@builds.apache.org>.
See <https://builds.apache.org/job/Phoenix-4.x-HBase-1.1/348/display/redirect?page=changes>
Changes:
[elserj] PHOENIX-3698 No-args constructor for IndexedWALEditCodec
------------------------------------------
[...truncated 74.15 KB...]
Tests run: 7, Failures: 0, Errors: 0, Skipped: 0, Time elapsed: 40.209 sec - in org.apache.phoenix.tx.TransactionIT
Tests run: 102, Failures: 0, Errors: 0, Skipped: 0, Time elapsed: 851.449 sec - in org.apache.phoenix.end2end.SortMergeJoinIT
Tests run: 52, Failures: 0, Errors: 0, Skipped: 4, Time elapsed: 174.739 sec - in org.apache.phoenix.tx.ParameterizedTransactionIT
Tests run: 40, Failures: 0, Errors: 0, Skipped: 0, Time elapsed: 236.574 sec - in org.apache.phoenix.tx.TxCheckpointIT
Tests run: 304, Failures: 0, Errors: 0, Skipped: 0, Time elapsed: 1,646.474 sec - in org.apache.phoenix.end2end.index.IndexIT
Results :
Tests run: 2024, Failures: 0, Errors: 0, Skipped: 28
[INFO]
[INFO] --- maven-failsafe-plugin:2.19.1:integration-test (ClientManagedTimeTests) @ phoenix-core ---
-------------------------------------------------------
T E S T S
-------------------------------------------------------
Running org.apache.phoenix.end2end.ArrayIT
Running org.apache.phoenix.end2end.ColumnProjectionOptimizationIT
Running org.apache.phoenix.end2end.AggregateQueryIT
Running org.apache.phoenix.end2end.ClientTimeArithmeticQueryIT
Running org.apache.phoenix.end2end.CastAndCoerceIT
Running org.apache.phoenix.end2end.CaseStatementIT
Tests run: 3, Failures: 0, Errors: 0, Skipped: 0, Time elapsed: 29.515 sec - in org.apache.phoenix.end2end.ColumnProjectionOptimizationIT
Running org.apache.phoenix.end2end.CreateSchemaIT
Tests run: 1, Failures: 0, Errors: 0, Skipped: 0, Time elapsed: 0.3 sec - in org.apache.phoenix.end2end.CreateSchemaIT
Running org.apache.phoenix.end2end.CreateTableIT
Tests run: 80, Failures: 0, Errors: 0, Skipped: 0, Time elapsed: 96.278 sec - in org.apache.phoenix.end2end.ArrayIT
Running org.apache.phoenix.end2end.CustomEntityDataIT
Tests run: 49, Failures: 0, Errors: 0, Skipped: 0, Time elapsed: 94.116 sec - in org.apache.phoenix.end2end.CastAndCoerceIT
Running org.apache.phoenix.end2end.DerivedTableIT
Tests run: 56, Failures: 0, Errors: 0, Skipped: 0, Time elapsed: 94.901 sec - in org.apache.phoenix.end2end.CaseStatementIT
Tests run: 3, Failures: 0, Errors: 0, Skipped: 0, Time elapsed: 5.502 sec - in org.apache.phoenix.end2end.CustomEntityDataIT
Running org.apache.phoenix.end2end.DistinctCountIT
Running org.apache.phoenix.end2end.DropSchemaIT
Tests run: 42, Failures: 0, Errors: 0, Skipped: 0, Time elapsed: 105.653 sec - in org.apache.phoenix.end2end.AggregateQueryIT
Running org.apache.phoenix.end2end.ExtendedQueryExecIT
Tests run: 2, Failures: 0, Errors: 0, Skipped: 0, Time elapsed: 11.2 sec - in org.apache.phoenix.end2end.DropSchemaIT
Running org.apache.phoenix.end2end.FunkyNamesIT
Tests run: 4, Failures: 0, Errors: 0, Skipped: 0, Time elapsed: 7.088 sec - in org.apache.phoenix.end2end.ExtendedQueryExecIT
Running org.apache.phoenix.end2end.GroupByIT
Tests run: 18, Failures: 0, Errors: 0, Skipped: 0, Time elapsed: 18.821 sec - in org.apache.phoenix.end2end.DerivedTableIT
Tests run: 10, Failures: 0, Errors: 0, Skipped: 0, Time elapsed: 18.457 sec - in org.apache.phoenix.end2end.DistinctCountIT
Tests run: 3, Failures: 0, Errors: 0, Skipped: 0, Time elapsed: 6.243 sec - in org.apache.phoenix.end2end.FunkyNamesIT
Running org.apache.phoenix.end2end.MutableQueryIT
Running org.apache.phoenix.end2end.NotQueryIT
Running org.apache.phoenix.end2end.NativeHBaseTypesIT
Tests run: 7, Failures: 0, Errors: 0, Skipped: 0, Time elapsed: 4.975 sec - in org.apache.phoenix.end2end.NativeHBaseTypesIT
Tests run: 16, Failures: 0, Errors: 0, Skipped: 0, Time elapsed: 99.226 sec - in org.apache.phoenix.end2end.CreateTableIT
Running org.apache.phoenix.end2end.ProductMetricsIT
Running org.apache.phoenix.end2end.PointInTimeQueryIT
Tests run: 245, Failures: 0, Errors: 0, Skipped: 0, Time elapsed: 155.805 sec - in org.apache.phoenix.end2end.ClientTimeArithmeticQueryIT
Tests run: 61, Failures: 0, Errors: 0, Skipped: 0, Time elapsed: 31.028 sec - in org.apache.phoenix.end2end.ProductMetricsIT
Running org.apache.phoenix.end2end.QueryIT
Tests run: 7, Failures: 0, Errors: 0, Skipped: 0, Time elapsed: 41.343 sec - in org.apache.phoenix.end2end.PointInTimeQueryIT
Running org.apache.phoenix.end2end.ReadIsolationLevelIT
Tests run: 2, Failures: 0, Errors: 0, Skipped: 0, Time elapsed: 6.189 sec - in org.apache.phoenix.end2end.ReadIsolationLevelIT
Running org.apache.phoenix.end2end.QueryDatabaseMetaDataIT
Running org.apache.phoenix.end2end.RowValueConstructorIT
Tests run: 91, Failures: 0, Errors: 0, Skipped: 0, Time elapsed: 72.828 sec - in org.apache.phoenix.end2end.GroupByIT
Running org.apache.phoenix.end2end.ScanQueryIT
Tests run: 77, Failures: 0, Errors: 0, Skipped: 0, Time elapsed: 92.902 sec - in org.apache.phoenix.end2end.NotQueryIT
Running org.apache.phoenix.end2end.SequenceBulkAllocationIT
Tests run: 112, Failures: 0, Errors: 0, Skipped: 0, Time elapsed: 69.567 sec - in org.apache.phoenix.end2end.ScanQueryIT
Tests run: 56, Failures: 0, Errors: 0, Skipped: 0, Time elapsed: 22.581 sec - in org.apache.phoenix.end2end.SequenceBulkAllocationIT
Running org.apache.phoenix.end2end.SequenceIT
Tests run: 112, Failures: 0, Errors: 0, Skipped: 0, Time elapsed: 99.272 sec - in org.apache.phoenix.end2end.QueryIT
Running org.apache.phoenix.end2end.ToNumberFunctionIT
Running org.apache.phoenix.end2end.TopNIT
Tests run: 18, Failures: 0, Errors: 0, Skipped: 0, Time elapsed: 6.612 sec - in org.apache.phoenix.end2end.ToNumberFunctionIT
Running org.apache.phoenix.end2end.TruncateFunctionIT
Tests run: 46, Failures: 0, Errors: 0, Skipped: 0, Time elapsed: 113.117 sec - in org.apache.phoenix.end2end.RowValueConstructorIT
Running org.apache.phoenix.end2end.UpsertSelectIT
Tests run: 4, Failures: 0, Errors: 0, Skipped: 0, Time elapsed: 6.431 sec - in org.apache.phoenix.end2end.TopNIT
Running org.apache.phoenix.end2end.UpsertValuesIT
Tests run: 1, Failures: 0, Errors: 0, Skipped: 0, Time elapsed: 4.833 sec - in org.apache.phoenix.end2end.TruncateFunctionIT
Tests run: 19, Failures: 0, Errors: 0, Skipped: 0, Time elapsed: 116.973 sec - in org.apache.phoenix.end2end.QueryDatabaseMetaDataIT
Running org.apache.phoenix.end2end.VariableLengthPKIT
Running org.apache.phoenix.end2end.salted.SaltedTableIT
Tests run: 54, Failures: 0, Errors: 0, Skipped: 0, Time elapsed: 43.887 sec - in org.apache.phoenix.end2end.SequenceIT
Running org.apache.phoenix.rpc.UpdateCacheWithScnIT
Tests run: 8, Failures: 0, Errors: 0, Skipped: 0, Time elapsed: 7.16 sec - in org.apache.phoenix.end2end.salted.SaltedTableIT
Tests run: 1, Failures: 0, Errors: 0, Skipped: 0, Time elapsed: 5.251 sec - in org.apache.phoenix.rpc.UpdateCacheWithScnIT
Tests run: 112, Failures: 0, Errors: 0, Skipped: 0, Time elapsed: 193.082 sec - in org.apache.phoenix.end2end.MutableQueryIT
Tests run: 50, Failures: 0, Errors: 0, Skipped: 0, Time elapsed: 38.837 sec - in org.apache.phoenix.end2end.VariableLengthPKIT
Tests run: 25, Failures: 0, Errors: 0, Skipped: 0, Time elapsed: 107.644 sec - in org.apache.phoenix.end2end.UpsertValuesIT
Tests run: 22, Failures: 0, Errors: 0, Skipped: 0, Time elapsed: 128.038 sec - in org.apache.phoenix.end2end.UpsertSelectIT
Results :
Tests run: 1417, Failures: 0, Errors: 0, Skipped: 0
[INFO]
[INFO] --- maven-failsafe-plugin:2.19.1:integration-test (HBaseManagedTimeTests) @ phoenix-core ---
-------------------------------------------------------
T E S T S
-------------------------------------------------------
Results :
Tests run: 0, Failures: 0, Errors: 0, Skipped: 0
[INFO]
[INFO] --- maven-failsafe-plugin:2.19.1:integration-test (NeedTheirOwnClusterTests) @ phoenix-core ---
-------------------------------------------------------
T E S T S
-------------------------------------------------------
Running org.apache.hadoop.hbase.regionserver.wal.WALReplayWithIndexWritesAndCompressedWALIT
Running org.apache.phoenix.end2end.ConnectionUtilIT
Tests run: 1, Failures: 0, Errors: 0, Skipped: 0, Time elapsed: 38.623 sec - in org.apache.hadoop.hbase.regionserver.wal.WALReplayWithIndexWritesAndCompressedWALIT
Running org.apache.phoenix.end2end.AutomaticRebuildIT
Running org.apache.phoenix.end2end.CountDistinctCompressionIT
Running org.apache.phoenix.end2end.ContextClassloaderIT
Running org.apache.phoenix.end2end.CsvBulkLoadToolIT
Tests run: 1, Failures: 0, Errors: 0, Skipped: 0, Time elapsed: 10.002 sec - in org.apache.phoenix.end2end.CountDistinctCompressionIT
Tests run: 3, Failures: 0, Errors: 0, Skipped: 0, Time elapsed: 8.755 sec - in org.apache.phoenix.end2end.ContextClassloaderIT
Tests run: 1, Failures: 0, Errors: 0, Skipped: 0, Time elapsed: 28.439 sec - in org.apache.phoenix.end2end.ConnectionUtilIT
Running org.apache.phoenix.end2end.IndexExtendedIT
Running org.apache.phoenix.end2end.FlappingLocalIndexIT
Running org.apache.phoenix.end2end.IndexToolForPartialBuildWithNamespaceEnabledIT
Running org.apache.phoenix.end2end.IndexToolForPartialBuildIT
Tests run: 10, Failures: 0, Errors: 0, Skipped: 0, Time elapsed: 68.172 sec - in org.apache.phoenix.end2end.CsvBulkLoadToolIT
Tests run: 2, Failures: 0, Errors: 0, Skipped: 0, Time elapsed: 42.085 sec - in org.apache.phoenix.end2end.IndexToolForPartialBuildIT
Tests run: 2, Failures: 0, Errors: 0, Skipped: 0, Time elapsed: 59.785 sec - in org.apache.phoenix.end2end.IndexToolForPartialBuildWithNamespaceEnabledIT
Tests run: 8, Failures: 0, Errors: 0, Skipped: 0, Time elapsed: 70.342 sec - in org.apache.phoenix.end2end.FlappingLocalIndexIT
Running org.apache.phoenix.end2end.QueryTimeoutIT
Running org.apache.phoenix.end2end.QueryWithLimitIT
Tests run: 2, Failures: 0, Errors: 0, Skipped: 0, Time elapsed: 10.775 sec - in org.apache.phoenix.end2end.QueryTimeoutIT
Tests run: 2, Failures: 0, Errors: 0, Skipped: 0, Time elapsed: 11.26 sec - in org.apache.phoenix.end2end.QueryWithLimitIT
Running org.apache.phoenix.end2end.RegexBulkLoadToolIT
Running org.apache.phoenix.end2end.RenewLeaseIT
Tests run: 1, Failures: 0, Errors: 1, Skipped: 0, Time elapsed: 11.647 sec <<< FAILURE! - in org.apache.phoenix.end2end.RenewLeaseIT
testLeaseDoesNotTimeout(org.apache.phoenix.end2end.RenewLeaseIT) Time elapsed: 6.692 sec <<< ERROR!
org.apache.phoenix.exception.PhoenixIOException: org.apache.phoenix.exception.PhoenixIOException: Failed after retry of OutOfOrderScannerNextException: was there a rpc timeout?
at org.apache.phoenix.end2end.RenewLeaseIT.testLeaseDoesNotTimeout(RenewLeaseIT.java:68)
Caused by: java.util.concurrent.ExecutionException: org.apache.phoenix.exception.PhoenixIOException: Failed after retry of OutOfOrderScannerNextException: was there a rpc timeout?
at org.apache.phoenix.end2end.RenewLeaseIT.testLeaseDoesNotTimeout(RenewLeaseIT.java:68)
Caused by: org.apache.phoenix.exception.PhoenixIOException: Failed after retry of OutOfOrderScannerNextException: was there a rpc timeout?
Caused by: org.apache.phoenix.exception.PhoenixIOException: Failed after retry of OutOfOrderScannerNextException: was there a rpc timeout?
Caused by: org.apache.hadoop.hbase.DoNotRetryIOException: Failed after retry of OutOfOrderScannerNextException: was there a rpc timeout?
Caused by: org.apache.hadoop.hbase.exceptions.OutOfOrderScannerNextException:
org.apache.hadoop.hbase.exceptions.OutOfOrderScannerNextException: Expected nextCallSeq: 1 But the nextCallSeq got from client: 0; request=scanner_id: 37 number_of_rows: 2147483647 close_scanner: false next_call_seq: 0 client_handles_partials: true client_handles_heartbeats: true renew: false
at org.apache.hadoop.hbase.regionserver.RSRpcServices.scan(RSRpcServices.java:2351)
at org.apache.hadoop.hbase.protobuf.generated.ClientProtos$ClientService$2.callBlockingMethod(ClientProtos.java:32385)
at org.apache.hadoop.hbase.ipc.RpcServer.call(RpcServer.java:2137)
at org.apache.hadoop.hbase.ipc.CallRunner.run(CallRunner.java:107)
at org.apache.hadoop.hbase.ipc.RpcExecutor.consumerLoop(RpcExecutor.java:133)
at org.apache.hadoop.hbase.ipc.RpcExecutor$1.run(RpcExecutor.java:108)
at java.lang.Thread.run(Thread.java:745)
Caused by: org.apache.hadoop.hbase.ipc.RemoteWithExtrasException:
org.apache.hadoop.hbase.exceptions.OutOfOrderScannerNextException: Expected nextCallSeq: 1 But the nextCallSeq got from client: 0; request=scanner_id: 37 number_of_rows: 2147483647 close_scanner: false next_call_seq: 0 client_handles_partials: true client_handles_heartbeats: true renew: false
at org.apache.hadoop.hbase.regionserver.RSRpcServices.scan(RSRpcServices.java:2351)
at org.apache.hadoop.hbase.protobuf.generated.ClientProtos$ClientService$2.callBlockingMethod(ClientProtos.java:32385)
at org.apache.hadoop.hbase.ipc.RpcServer.call(RpcServer.java:2137)
at org.apache.hadoop.hbase.ipc.CallRunner.run(CallRunner.java:107)
at org.apache.hadoop.hbase.ipc.RpcExecutor.consumerLoop(RpcExecutor.java:133)
at org.apache.hadoop.hbase.ipc.RpcExecutor$1.run(RpcExecutor.java:108)
at java.lang.Thread.run(Thread.java:745)
Tests run: 2, Failures: 0, Errors: 0, Skipped: 0, Time elapsed: 170.726 sec - in org.apache.phoenix.end2end.AutomaticRebuildIT
#
# A fatal error has been detected by the Java Runtime Environment:
#
# Internal Error (sharedRuntime.cpp:814), pid=17274, tid=139849407600384
# guarantee(cb->is_adapter_blob() || cb->is_method_handles_adapter_blob()) failed: exception happened outside interpreter, nmethods and vtable stubs (1)
#
# JRE version: Java(TM) SE Runtime Environment (7.0_80-b15) (build 1.7.0_80-b15)
# Java VM: Java HotSpot(TM) 64-Bit Server VM (24.80-b11 mixed mode linux-amd64 compressed oops)
# Failed to write core dump. Core dumps have been disabled. To enable core dumping, try "ulimit -c unlimited" before starting Java again
#
# An error report file with more information is saved as:
# <https://builds.apache.org/job/Phoenix-4.x-HBase-1.1/ws/phoenix-core/hs_err_pid17274.log>
#
# If you would like to submit a bug report, please visit:
# http://bugreport.java.com/bugreport/crash.jsp
#
Aborted
Running org.apache.phoenix.end2end.SpillableGroupByIT
Running org.apache.phoenix.end2end.StatsCollectorIT
Tests run: 2, Failures: 0, Errors: 0, Skipped: 0, Time elapsed: 11.095 sec - in org.apache.phoenix.end2end.SpillableGroupByIT
Running org.apache.phoenix.end2end.SysTableNamespaceMappedStatsCollectorIT
Tests run: 10, Failures: 0, Errors: 0, Skipped: 0, Time elapsed: 69.996 sec - in org.apache.phoenix.end2end.RegexBulkLoadToolIT
Running org.apache.phoenix.end2end.UserDefinedFunctionsIT
Running org.apache.phoenix.end2end.index.ImmutableIndexIT
Running org.apache.phoenix.end2end.index.LocalIndexIT
Tests run: 14, Failures: 0, Errors: 0, Skipped: 0, Time elapsed: 40.458 sec - in org.apache.phoenix.end2end.UserDefinedFunctionsIT
Tests run: 80, Failures: 0, Errors: 0, Skipped: 0, Time elapsed: 242.869 sec - in org.apache.phoenix.end2end.IndexExtendedIT
Running org.apache.phoenix.end2end.index.MutableIndexFailureIT
Running org.apache.phoenix.end2end.index.MutableIndexReplicationIT
Tests run: 1, Failures: 0, Errors: 0, Skipped: 0, Time elapsed: 26.961 sec - in org.apache.phoenix.end2end.index.MutableIndexReplicationIT
Running org.apache.phoenix.end2end.index.ReadOnlyIndexFailureIT
Tests run: 120, Failures: 0, Errors: 0, Skipped: 24, Time elapsed: 227.55 sec - in org.apache.phoenix.end2end.StatsCollectorIT
Tests run: 120, Failures: 0, Errors: 0, Skipped: 24, Time elapsed: 215.197 sec - in org.apache.phoenix.end2end.SysTableNamespaceMappedStatsCollectorIT
Tests run: 2, Failures: 0, Errors: 0, Skipped: 0, Time elapsed: 32.306 sec - in org.apache.phoenix.end2end.index.ReadOnlyIndexFailureIT
Running org.apache.phoenix.hbase.index.FailForUnsupportedHBaseVersionsIT
Tests run: 2, Failures: 0, Errors: 0, Skipped: 0, Time elapsed: 19.249 sec - in org.apache.phoenix.hbase.index.FailForUnsupportedHBaseVersionsIT
Running org.apache.phoenix.hbase.index.covered.EndToEndCoveredColumnsIndexBuilderIT
Running org.apache.phoenix.hbase.index.covered.example.FailWithoutRetriesIT
Results :
Tests in error:
RenewLeaseIT.testLeaseDoesNotTimeout:68 » PhoenixIO org.apache.phoenix.excepti...
Tests run: 386, Failures: 0, Errors: 1, Skipped: 48
[INFO]
[INFO] --- maven-failsafe-plugin:2.19.1:verify (ParallelStatsEnabledTest) @ phoenix-core ---
[INFO] ------------------------------------------------------------------------
[INFO] Reactor Summary:
[INFO]
[INFO] Apache Phoenix ..................................... SUCCESS [ 3.711 s]
[INFO] Phoenix Core ....................................... FAILURE [ 01:07 h]
[INFO] Phoenix - Flume .................................... SKIPPED
[INFO] Phoenix - Kafka .................................... SKIPPED
[INFO] Phoenix - Pig ...................................... SKIPPED
[INFO] Phoenix Query Server Client ........................ SKIPPED
[INFO] Phoenix Query Server ............................... SKIPPED
[INFO] Phoenix - Pherf .................................... SKIPPED
[INFO] Phoenix - Spark .................................... SKIPPED
[INFO] Phoenix - Hive ..................................... SKIPPED
[INFO] Phoenix Client ..................................... SKIPPED
[INFO] Phoenix Server ..................................... SKIPPED
[INFO] Phoenix Assembly ................................... SKIPPED
[INFO] Phoenix - Tracing Web Application .................. SKIPPED
[INFO] ------------------------------------------------------------------------
[INFO] BUILD FAILURE
[INFO] ------------------------------------------------------------------------
[INFO] Total time: 01:07 h
[INFO] Finished at: 2017-03-01T02:15:51+00:00
[INFO] Final Memory: 62M/1227M
[INFO] ------------------------------------------------------------------------
[ERROR] Failed to execute goal org.apache.maven.plugins:maven-failsafe-plugin:2.19.1:verify (ParallelStatsEnabledTest) on project phoenix-core: There was a timeout or other error in the fork -> [Help 1]
[ERROR]
[ERROR] To see the full stack trace of the errors, re-run Maven with the -e switch.
[ERROR] Re-run Maven using the -X switch to enable full debug logging.
[ERROR]
[ERROR] For more information about the errors and possible solutions, please read the following articles:
[ERROR] [Help 1] http://cwiki.apache.org/confluence/display/MAVEN/MojoExecutionException
[ERROR]
[ERROR] After correcting the problems, you can resume the build with the command
[ERROR] mvn <goals> -rf :phoenix-core
Build step 'Invoke top-level Maven targets' marked build as failure
Archiving artifacts
Compressed 1.67 GB of artifacts by 70.1% relative to #336
Recording test results