You are viewing a plain text version of this content. The canonical link for it is here.
Posted to commits@phoenix.apache.org by Apache Jenkins Server <je...@builds.apache.org> on 2019/05/28 20:15:53 UTC
Build failed in Jenkins: Phoenix-4.x-HBase-1.4 #150
See <https://builds.apache.org/job/Phoenix-4.x-HBase-1.4/150/display/redirect?page=changes>
Changes:
[larsh] PHOENIX-5303 Fix index failures with some versions of HBase.
------------------------------------------
[...truncated 556.29 KB...]
[INFO] Running org.apache.phoenix.trace.PhoenixTableMetricsWriterIT
[INFO] Tests run: 34, Failures: 0, Errors: 0, Skipped: 0, Time elapsed: 589.154 s - in org.apache.phoenix.end2end.join.HashJoinLocalIndexIT
[INFO] Running org.apache.phoenix.trace.PhoenixTracingEndToEndIT
[WARNING] Tests run: 1, Failures: 0, Errors: 0, Skipped: 1, Time elapsed: 0.001 s - in org.apache.phoenix.trace.PhoenixTracingEndToEndIT
[INFO] Running org.apache.phoenix.replication.SystemCatalogWALEntryFilterIT
[INFO] Tests run: 2, Failures: 0, Errors: 0, Skipped: 0, Time elapsed: 0.036 s - in org.apache.phoenix.replication.SystemCatalogWALEntryFilterIT
[INFO] Running org.apache.phoenix.tx.ParameterizedTransactionIT
[INFO] Tests run: 2, Failures: 0, Errors: 0, Skipped: 0, Time elapsed: 12.385 s - in org.apache.phoenix.trace.PhoenixTableMetricsWriterIT
[INFO] Running org.apache.phoenix.tx.TransactionIT
[INFO] Tests run: 8, Failures: 0, Errors: 0, Skipped: 0, Time elapsed: 41.877 s - in org.apache.phoenix.rpc.UpdateCacheIT
[INFO] Running org.apache.phoenix.tx.TxCheckpointIT
[INFO] Tests run: 15, Failures: 0, Errors: 0, Skipped: 0, Time elapsed: 163.021 s - in org.apache.phoenix.end2end.join.SubqueryUsingSortMergeJoinIT
[INFO] Running org.apache.phoenix.tx.FlappingTransactionIT
[INFO] Running org.apache.phoenix.util.IndexScrutinyIT
[INFO] Tests run: 8, Failures: 0, Errors: 0, Skipped: 0, Time elapsed: 20.643 s - in org.apache.phoenix.tx.FlappingTransactionIT
[INFO] Tests run: 3, Failures: 0, Errors: 0, Skipped: 0, Time elapsed: 15.838 s - in org.apache.phoenix.util.IndexScrutinyIT
[INFO] Tests run: 34, Failures: 0, Errors: 0, Skipped: 0, Time elapsed: 581.464 s - in org.apache.phoenix.end2end.join.SortMergeJoinLocalIndexIT
[INFO] Tests run: 28, Failures: 0, Errors: 0, Skipped: 0, Time elapsed: 165.243 s - in org.apache.phoenix.tx.TransactionIT
[INFO] Tests run: 117, Failures: 0, Errors: 0, Skipped: 0, Time elapsed: 950.819 s - in org.apache.phoenix.end2end.index.MutableIndexIT
[INFO] Tests run: 50, Failures: 0, Errors: 0, Skipped: 0, Time elapsed: 336.061 s - in org.apache.phoenix.tx.TxCheckpointIT
[INFO] Tests run: 78, Failures: 0, Errors: 0, Skipped: 0, Time elapsed: 614.66 s - in org.apache.phoenix.tx.ParameterizedTransactionIT
[INFO]
[INFO] Results:
[INFO]
[ERROR] Failures:
[ERROR] UpgradeIT.testMapTableToNamespaceDuringUpgrade:189->BaseTest.verifySequenceValue:1769->BaseTest.verifySequence:1791 expected:<-9223372036854775805> but was:<-9223372036854774707>
[ERROR] HashJoinMoreIT.testBug2961:908
[INFO]
[ERROR] Tests run: 3723, Failures: 2, Errors: 0, Skipped: 2
[INFO]
[INFO]
[INFO] --- maven-failsafe-plugin:2.20:integration-test (HBaseManagedTimeTests) @ phoenix-core ---
[INFO]
[INFO] -------------------------------------------------------
[INFO] T E S T S
[INFO] -------------------------------------------------------
[INFO]
[INFO] Results:
[INFO]
[INFO] Tests run: 0, Failures: 0, Errors: 0, Skipped: 0
[INFO]
[INFO]
[INFO] --- maven-failsafe-plugin:2.20:integration-test (NeedTheirOwnClusterTests) @ phoenix-core ---
[INFO]
[INFO] -------------------------------------------------------
[INFO] T E S T S
[INFO] -------------------------------------------------------
[INFO] Running org.apache.hadoop.hbase.regionserver.wal.WALReplayWithIndexWritesAndCompressedWALIT
[INFO] Running org.apache.phoenix.end2end.ConnectionUtilIT
[INFO] Tests run: 1, Failures: 0, Errors: 0, Skipped: 0, Time elapsed: 32.557 s - in org.apache.hadoop.hbase.regionserver.wal.WALReplayWithIndexWritesAndCompressedWALIT
[INFO] Running org.apache.hadoop.hbase.regionserver.wal.WALRecoveryRegionPostOpenIT
[INFO] Tests run: 1, Failures: 0, Errors: 0, Skipped: 0, Time elapsed: 6.357 s - in org.apache.hadoop.hbase.regionserver.wal.WALRecoveryRegionPostOpenIT
[INFO] Running org.apache.phoenix.end2end.CsvBulkLoadToolIT
[INFO] Running org.apache.phoenix.end2end.CountDistinctCompressionIT
[INFO] Running org.apache.phoenix.end2end.ContextClassloaderIT
[INFO] Tests run: 1, Failures: 0, Errors: 0, Skipped: 0, Time elapsed: 2.495 s - in org.apache.phoenix.end2end.CountDistinctCompressionIT
[INFO] Tests run: 1, Failures: 0, Errors: 0, Skipped: 0, Time elapsed: 30.44 s - in org.apache.phoenix.end2end.ConnectionUtilIT
[INFO] Tests run: 3, Failures: 0, Errors: 0, Skipped: 0, Time elapsed: 2.529 s - in org.apache.phoenix.end2end.ContextClassloaderIT
[INFO] Running org.apache.phoenix.end2end.CostBasedDecisionIT
[INFO] Running org.apache.phoenix.end2end.DropSchemaIT
[INFO] Running org.apache.phoenix.end2end.FlappingLocalIndexIT
[INFO] Tests run: 2, Failures: 0, Errors: 0, Skipped: 0, Time elapsed: 18.828 s - in org.apache.phoenix.end2end.DropSchemaIT
[INFO] Running org.apache.phoenix.end2end.IndexExtendedIT
[INFO] Running org.apache.phoenix.end2end.IndexRebuildTaskIT
[INFO] Running org.apache.phoenix.end2end.IndexBuildTimestampIT
[INFO] Tests run: 1, Failures: 0, Errors: 0, Skipped: 0, Time elapsed: 30.27 s - in org.apache.phoenix.end2end.IndexRebuildTaskIT
[INFO] Tests run: 14, Failures: 0, Errors: 0, Skipped: 0, Time elapsed: 96.584 s - in org.apache.phoenix.end2end.CsvBulkLoadToolIT
[INFO] Running org.apache.phoenix.end2end.IndexToolForPartialBuildIT
[INFO] Tests run: 1, Failures: 0, Errors: 0, Skipped: 0, Time elapsed: 10.984 s - in org.apache.phoenix.end2end.IndexToolForPartialBuildIT
[INFO] Running org.apache.phoenix.end2end.IndexToolIT
[INFO] Running org.apache.phoenix.end2end.IndexToolForPartialBuildWithNamespaceEnabledIT
[INFO] Tests run: 2, Failures: 0, Errors: 0, Skipped: 0, Time elapsed: 19.535 s - in org.apache.phoenix.end2end.IndexToolForPartialBuildWithNamespaceEnabledIT
[INFO] Running org.apache.phoenix.end2end.LocalIndexSplitMergeIT
[INFO] Running org.apache.phoenix.end2end.MigrateSystemTablesToSystemNamespaceIT
[INFO] Tests run: 12, Failures: 0, Errors: 0, Skipped: 0, Time elapsed: 142.424 s - in org.apache.phoenix.end2end.FlappingLocalIndexIT
[INFO] Tests run: 16, Failures: 0, Errors: 0, Skipped: 0, Time elapsed: 135.137 s - in org.apache.phoenix.end2end.IndexBuildTimestampIT
[INFO] Tests run: 32, Failures: 0, Errors: 0, Skipped: 0, Time elapsed: 142.764 s - in org.apache.phoenix.end2end.IndexExtendedIT
[INFO] Running org.apache.phoenix.end2end.PartialResultServerConfigurationIT
[INFO] Running org.apache.phoenix.end2end.PermissionNSEnabledIT
[INFO] Running org.apache.phoenix.end2end.PermissionNSDisabledIT
[INFO] Tests run: 1, Failures: 0, Errors: 0, Skipped: 0, Time elapsed: 35.583 s - in org.apache.phoenix.end2end.PartialResultServerConfigurationIT
[INFO] Running org.apache.phoenix.end2end.PermissionsCacheIT
[ERROR] Tests run: 1, Failures: 0, Errors: 1, Skipped: 0, Time elapsed: 0.008 s <<< FAILURE! - in org.apache.phoenix.end2end.PermissionsCacheIT
[ERROR] initializationError(org.apache.phoenix.end2end.PermissionsCacheIT) Time elapsed: 0.008 s <<< ERROR!
java.lang.Exception: Test class should have exactly one public zero-argument constructor
[INFO] Running org.apache.phoenix.end2end.PhoenixDriverIT
[INFO] Tests run: 4, Failures: 0, Errors: 0, Skipped: 0, Time elapsed: 56.886 s - in org.apache.phoenix.end2end.PhoenixDriverIT
[INFO] Tests run: 20, Failures: 0, Errors: 0, Skipped: 0, Time elapsed: 378.305 s - in org.apache.phoenix.end2end.CostBasedDecisionIT
[INFO] Running org.apache.phoenix.end2end.QueryLoggerIT
[INFO] Tests run: 9, Failures: 0, Errors: 0, Skipped: 0, Time elapsed: 174.225 s - in org.apache.phoenix.end2end.PermissionNSEnabledIT
[INFO] Tests run: 8, Failures: 0, Errors: 0, Skipped: 0, Time elapsed: 172.297 s - in org.apache.phoenix.end2end.PermissionNSDisabledIT
[INFO] Running org.apache.phoenix.end2end.QueryTimeoutIT
[INFO] Tests run: 2, Failures: 0, Errors: 0, Skipped: 0, Time elapsed: 7.004 s - in org.apache.phoenix.end2end.QueryTimeoutIT
[INFO] Tests run: 7, Failures: 0, Errors: 0, Skipped: 0, Time elapsed: 50.274 s - in org.apache.phoenix.end2end.QueryLoggerIT
[INFO] Running org.apache.phoenix.end2end.QueryWithLimitIT
[INFO] Tests run: 2, Failures: 0, Errors: 0, Skipped: 0, Time elapsed: 5.014 s - in org.apache.phoenix.end2end.QueryWithLimitIT
[INFO] Running org.apache.phoenix.end2end.RebuildIndexConnectionPropsIT
[INFO] Tests run: 1, Failures: 0, Errors: 0, Skipped: 0, Time elapsed: 0.424 s - in org.apache.phoenix.end2end.RebuildIndexConnectionPropsIT
[INFO] Tests run: 4, Failures: 0, Errors: 0, Skipped: 0, Time elapsed: 288.912 s - in org.apache.phoenix.end2end.MigrateSystemTablesToSystemNamespaceIT
[INFO] Running org.apache.phoenix.end2end.RenewLeaseIT
[INFO] Running org.apache.phoenix.end2end.RegexBulkLoadToolIT
[INFO] Running org.apache.phoenix.end2end.SequencePointInTimeIT
[INFO] Tests run: 1, Failures: 0, Errors: 0, Skipped: 0, Time elapsed: 0.114 s - in org.apache.phoenix.end2end.SequencePointInTimeIT
[INFO] Running org.apache.phoenix.end2end.StatsEnabledSplitSystemCatalogIT
[INFO] Running org.apache.phoenix.end2end.SpillableGroupByIT
[INFO] Running org.apache.phoenix.end2end.SystemCatalogCreationOnConnectionIT
[INFO] Tests run: 1, Failures: 0, Errors: 0, Skipped: 0, Time elapsed: 26.413 s - in org.apache.phoenix.end2end.RenewLeaseIT
[INFO] Tests run: 3, Failures: 0, Errors: 0, Skipped: 0, Time elapsed: 10.278 s - in org.apache.phoenix.end2end.SpillableGroupByIT
[INFO] Tests run: 10, Failures: 0, Errors: 0, Skipped: 0, Time elapsed: 69.911 s - in org.apache.phoenix.end2end.RegexBulkLoadToolIT
[INFO] Running org.apache.phoenix.end2end.SystemCatalogIT
[INFO] Running org.apache.phoenix.end2end.TableSnapshotReadsMapReduceIT
[INFO] Tests run: 18, Failures: 0, Errors: 0, Skipped: 0, Time elapsed: 88.392 s - in org.apache.phoenix.end2end.StatsEnabledSplitSystemCatalogIT
[INFO] Tests run: 4, Failures: 0, Errors: 0, Skipped: 0, Time elapsed: 29.302 s - in org.apache.phoenix.end2end.TableSnapshotReadsMapReduceIT
[INFO] Running org.apache.phoenix.end2end.UpdateCacheAcrossDifferentClientsIT
[INFO] Tests run: 2, Failures: 0, Errors: 0, Skipped: 0, Time elapsed: 60.929 s - in org.apache.phoenix.end2end.SystemCatalogIT
[INFO] Tests run: 3, Failures: 0, Errors: 0, Skipped: 0, Time elapsed: 454.872 s - in org.apache.phoenix.end2end.LocalIndexSplitMergeIT
[INFO] Running org.apache.phoenix.end2end.UserDefinedFunctionsIT
[INFO] Running org.apache.phoenix.end2end.index.ImmutableIndexIT
[INFO] Tests run: 6, Failures: 0, Errors: 0, Skipped: 0, Time elapsed: 70.999 s - in org.apache.phoenix.end2end.UpdateCacheAcrossDifferentClientsIT
[INFO] Running org.apache.phoenix.end2end.index.IndexRebuildIncrementDisableCountIT
[INFO] Running org.apache.phoenix.end2end.index.LocalIndexIT
[INFO] Tests run: 2, Failures: 0, Errors: 0, Skipped: 0, Time elapsed: 11.23 s - in org.apache.phoenix.end2end.index.IndexRebuildIncrementDisableCountIT
[INFO] Running org.apache.phoenix.end2end.index.MutableIndexFailureIT
[INFO] Running org.apache.phoenix.end2end.index.MutableIndexFailureWithNamespaceIT
[INFO] Tests run: 16, Failures: 0, Errors: 0, Skipped: 0, Time elapsed: 119.414 s - in org.apache.phoenix.end2end.UserDefinedFunctionsIT
[INFO] Running org.apache.phoenix.end2end.index.MutableIndexRebuilderIT
[INFO] Tests run: 1, Failures: 0, Errors: 0, Skipped: 0, Time elapsed: 66.272 s - in org.apache.phoenix.end2end.index.MutableIndexRebuilderIT
[INFO] Tests run: 8, Failures: 0, Errors: 0, Skipped: 0, Time elapsed: 142.599 s - in org.apache.phoenix.end2end.index.MutableIndexFailureWithNamespaceIT
[INFO] Running org.apache.phoenix.end2end.index.MutableIndexReplicationIT
[INFO] Tests run: 14, Failures: 0, Errors: 0, Skipped: 0, Time elapsed: 231.574 s - in org.apache.phoenix.end2end.index.MutableIndexFailureIT
[INFO] Running org.apache.phoenix.end2end.index.PartialIndexRebuilderIT
[INFO] Tests run: 1, Failures: 0, Errors: 0, Skipped: 0, Time elapsed: 29.714 s - in org.apache.phoenix.end2end.index.MutableIndexReplicationIT
[INFO] Running org.apache.phoenix.end2end.index.PhoenixMRJobSubmitterIT
[INFO] Tests run: 1, Failures: 0, Errors: 0, Skipped: 0, Time elapsed: 7.521 s - in org.apache.phoenix.end2end.index.PhoenixMRJobSubmitterIT
[INFO] Running org.apache.phoenix.end2end.index.txn.TxWriteFailureIT
[WARNING] Tests run: 45, Failures: 0, Errors: 0, Skipped: 18, Time elapsed: 371.079 s - in org.apache.phoenix.end2end.index.ImmutableIndexIT
[INFO] Tests run: 12, Failures: 0, Errors: 0, Skipped: 0, Time elapsed: 61.512 s - in org.apache.phoenix.end2end.index.txn.TxWriteFailureIT
[INFO] Running org.apache.phoenix.execute.PartialCommitIT
[INFO] Running org.apache.phoenix.hbase.index.FailForUnsupportedHBaseVersionsIT
[INFO] Running org.apache.phoenix.execute.UpsertSelectOverlappingBatchesIT
[INFO] Tests run: 2, Failures: 0, Errors: 0, Skipped: 0, Time elapsed: 21.588 s - in org.apache.phoenix.hbase.index.FailForUnsupportedHBaseVersionsIT
[INFO] Running org.apache.phoenix.iterate.RoundRobinResultIteratorWithStatsIT
[INFO] Tests run: 3, Failures: 0, Errors: 0, Skipped: 0, Time elapsed: 66.7 s - in org.apache.phoenix.execute.UpsertSelectOverlappingBatchesIT
[INFO] Tests run: 1, Failures: 0, Errors: 0, Skipped: 0, Time elapsed: 7.133 s - in org.apache.phoenix.iterate.RoundRobinResultIteratorWithStatsIT
[INFO] Tests run: 50, Failures: 0, Errors: 0, Skipped: 0, Time elapsed: 505.044 s - in org.apache.phoenix.end2end.index.LocalIndexIT
[INFO] Tests run: 12, Failures: 0, Errors: 0, Skipped: 0, Time elapsed: 87.23 s - in org.apache.phoenix.execute.PartialCommitIT
[INFO] Running org.apache.phoenix.jdbc.SecureUserConnectionsIT
[INFO] Tests run: 8, Failures: 0, Errors: 0, Skipped: 0, Time elapsed: 1.162 s - in org.apache.phoenix.jdbc.SecureUserConnectionsIT
[INFO] Running org.apache.phoenix.iterate.ScannerLeaseRenewalIT
[INFO] Tests run: 15, Failures: 0, Errors: 0, Skipped: 0, Time elapsed: 723.466 s - in org.apache.phoenix.end2end.SystemCatalogCreationOnConnectionIT
[INFO] Running org.apache.phoenix.monitoring.PhoenixLoggingMetricsIT
[INFO] Running org.apache.phoenix.monitoring.PhoenixMetricsIT
[INFO] Running org.apache.phoenix.monitoring.PhoenixMetricsDisabledIT
[INFO] Tests run: 1, Failures: 0, Errors: 0, Skipped: 0, Time elapsed: 0.005 s - in org.apache.phoenix.monitoring.PhoenixMetricsDisabledIT
[INFO] Tests run: 4, Failures: 0, Errors: 0, Skipped: 0, Time elapsed: 23.996 s - in org.apache.phoenix.monitoring.PhoenixLoggingMetricsIT
[INFO] Running org.apache.phoenix.rpc.PhoenixClientRpcIT
[INFO] Tests run: 2, Failures: 0, Errors: 0, Skipped: 0, Time elapsed: 5.285 s - in org.apache.phoenix.rpc.PhoenixClientRpcIT
[INFO] Running org.apache.phoenix.rpc.PhoenixServerRpcIT
[INFO] Tests run: 2, Failures: 0, Errors: 0, Skipped: 0, Time elapsed: 15.136 s - in org.apache.phoenix.rpc.PhoenixServerRpcIT
[INFO] Running org.apache.phoenix.schema.stats.NamespaceDisabledStatsCollectorIT
[INFO] Tests run: 22, Failures: 0, Errors: 0, Skipped: 0, Time elapsed: 72.711 s - in org.apache.phoenix.monitoring.PhoenixMetricsIT
[INFO] Tests run: 31, Failures: 0, Errors: 0, Skipped: 0, Time elapsed: 381.662 s - in org.apache.phoenix.end2end.index.PartialIndexRebuilderIT
[INFO] Running org.apache.phoenix.schema.stats.NamespaceEnabledStatsCollectorIT
[INFO] Running org.apache.phoenix.schema.stats.NoOpStatsCollectorIT
[INFO] Running org.apache.phoenix.schema.stats.NonTxStatsCollectorIT
[INFO] Tests run: 2, Failures: 0, Errors: 0, Skipped: 0, Time elapsed: 11.698 s - in org.apache.phoenix.schema.stats.NoOpStatsCollectorIT
[INFO] Running org.apache.phoenix.schema.stats.TxStatsCollectorIT
[INFO] Tests run: 2, Failures: 0, Errors: 0, Skipped: 0, Time elapsed: 162.156 s - in org.apache.phoenix.iterate.ScannerLeaseRenewalIT
[INFO] Running org.apache.phoenix.tool.ParameterizedPhoenixCanaryToolIT
[INFO] Tests run: 8, Failures: 0, Errors: 0, Skipped: 0, Time elapsed: 77.085 s - in org.apache.phoenix.tool.ParameterizedPhoenixCanaryToolIT
[WARNING] Tests run: 26, Failures: 0, Errors: 0, Skipped: 4, Time elapsed: 186.636 s - in org.apache.phoenix.schema.stats.NamespaceDisabledStatsCollectorIT
[WARNING] Tests run: 39, Failures: 0, Errors: 0, Skipped: 6, Time elapsed: 135.758 s - in org.apache.phoenix.schema.stats.NonTxStatsCollectorIT
[WARNING] Tests run: 26, Failures: 0, Errors: 0, Skipped: 4, Time elapsed: 200.356 s - in org.apache.phoenix.schema.stats.NamespaceEnabledStatsCollectorIT
[WARNING] Tests run: 78, Failures: 0, Errors: 0, Skipped: 12, Time elapsed: 253.441 s - in org.apache.phoenix.schema.stats.TxStatsCollectorIT
[INFO] Tests run: 164, Failures: 0, Errors: 0, Skipped: 0, Time elapsed: 1,627.906 s - in org.apache.phoenix.end2end.IndexToolIT
[INFO]
[INFO] Results:
[INFO]
[ERROR] Errors:
[ERROR] PermissionsCacheIT.initializationError ยป Test class should have exactly one p...
[INFO]
[ERROR] Tests run: 792, Failures: 0, Errors: 1, Skipped: 44
[INFO]
[INFO]
[INFO] --- maven-failsafe-plugin:2.20:integration-test (SplitSystemCatalogTests) @ phoenix-core ---
[INFO]
[INFO] -------------------------------------------------------
[INFO] T E S T S
[INFO] -------------------------------------------------------
[INFO] Running org.apache.phoenix.end2end.AlterTableWithViewsIT
[INFO] Running org.apache.phoenix.end2end.AlterMultiTenantTableWithViewsIT
[INFO] Running org.apache.phoenix.end2end.DropTableWithViewsIT
[INFO] Tests run: 4, Failures: 0, Errors: 0, Skipped: 0, Time elapsed: 23.493 s - in org.apache.phoenix.end2end.DropTableWithViewsIT
[INFO] Running org.apache.phoenix.end2end.TenantSpecificViewIndexSaltedIT
[INFO] Running org.apache.phoenix.end2end.TenantSpecificViewIndexIT
[INFO] Running org.apache.phoenix.end2end.ViewIT
[INFO] Tests run: 4, Failures: 0, Errors: 0, Skipped: 0, Time elapsed: 39.614 s - in org.apache.phoenix.end2end.TenantSpecificViewIndexSaltedIT
[INFO] Tests run: 9, Failures: 0, Errors: 0, Skipped: 0, Time elapsed: 84.81 s - in org.apache.phoenix.end2end.AlterMultiTenantTableWithViewsIT
[INFO] Running org.apache.phoenix.end2end.index.ViewIndexIT
[INFO] Tests run: 10, Failures: 0, Errors: 0, Skipped: 0, Time elapsed: 84.695 s - in org.apache.phoenix.end2end.TenantSpecificViewIndexIT
[WARNING] Tests run: 16, Failures: 0, Errors: 0, Skipped: 2, Time elapsed: 118.958 s - in org.apache.phoenix.end2end.index.ViewIndexIT
[INFO] Tests run: 112, Failures: 0, Errors: 0, Skipped: 0, Time elapsed: 821.096 s - in org.apache.phoenix.end2end.AlterTableWithViewsIT
[INFO] Tests run: 165, Failures: 0, Errors: 0, Skipped: 0, Time elapsed: 830.166 s - in org.apache.phoenix.end2end.ViewIT
[INFO]
[INFO] Results:
[INFO]
[WARNING] Tests run: 320, Failures: 0, Errors: 0, Skipped: 2
[INFO]
[INFO]
[INFO] --- maven-failsafe-plugin:2.20:verify (ParallelStatsEnabledTest) @ phoenix-core ---
[INFO] ------------------------------------------------------------------------
[INFO] Reactor Summary for Apache Phoenix 4.15.0-HBase-1.4-SNAPSHOT:
[INFO]
[INFO] Apache Phoenix ..................................... SUCCESS [ 2.539 s]
[INFO] Phoenix Core ....................................... FAILURE [ 01:58 h]
[INFO] Phoenix - Pherf .................................... SKIPPED
[INFO] Phoenix Client ..................................... SKIPPED
[INFO] Phoenix Server ..................................... SKIPPED
[INFO] Phoenix Assembly ................................... SKIPPED
[INFO] Phoenix - Tracing Web Application .................. SKIPPED
[INFO] ------------------------------------------------------------------------
[INFO] BUILD FAILURE
[INFO] ------------------------------------------------------------------------
[INFO] Total time: 01:58 h
[INFO] Finished at: 2019-05-28T20:10:23Z
[INFO] ------------------------------------------------------------------------
[ERROR] Failed to execute goal org.apache.maven.plugins:maven-failsafe-plugin:2.20:verify (ParallelStatsEnabledTest) on project phoenix-core: There are test failures.
[ERROR]
[ERROR] Please refer to <https://builds.apache.org/job/Phoenix-4.x-HBase-1.4/ws/phoenix-core/target/failsafe-reports> for the individual test results.
[ERROR] Please refer to dump files (if any exist) [date]-jvmRun[N].dump, [date].dumpstream and [date]-jvmRun[N].dumpstream.
[ERROR] -> [Help 1]
[ERROR]
[ERROR] To see the full stack trace of the errors, re-run Maven with the -e switch.
[ERROR] Re-run Maven using the -X switch to enable full debug logging.
[ERROR]
[ERROR] For more information about the errors and possible solutions, please read the following articles:
[ERROR] [Help 1] http://cwiki.apache.org/confluence/display/MAVEN/MojoFailureException
[ERROR]
[ERROR] After correcting the problems, you can resume the build with the command
[ERROR] mvn <goals> -rf :phoenix-core
Build step 'Invoke top-level Maven targets' marked build as failure
Archiving artifacts
[JIRA] Updating issue PHOENIX-5303
Recording test results
Not sending mail to unregistered user monani.mihir@gmail.com
Not sending mail to unregistered user jinqian.zy@alibaba-inc.com
Not sending mail to unregistered user mmonani@salesforce.com
Not sending mail to unregistered user k.mehta@salesforce.com