You are viewing a plain text version of this content. The canonical link for it is here.
Posted to dev@hbase.apache.org by Apache Jenkins Server <je...@builds.apache.org> on 2012/04/05 21:44:30 UTC

Build failed in Jenkins: HBase-0.94 #89

See <https://builds.apache.org/job/HBase-0.94/89/changes>

Changes:

[stack] HBASE-5715 Revert 'Instant schema alter' for now, HBASE-4213

------------------------------------------
[...truncated 20934 lines...]
Running org.apache.hadoop.hbase.TestInfoServers
Tests run: 2, Failures: 0, Errors: 0, Skipped: 0, Time elapsed: 11.019 sec
Forking command line: /bin/sh -c cd <https://builds.apache.org/job/HBase-0.94/ws/trunk> && /home/jenkins/tools/java/jdk1.6.0_27-32/jre/bin/java -enableassertions -Xmx1900m -Djava.security.egd=file:/dev/./urandom -jar <https://builds.apache.org/job/HBase-0.94/ws/trunk/target/surefire/surefirebooter3697983487150275124.jar> <https://builds.apache.org/job/HBase-0.94/ws/trunk/target/surefire/surefire3213155505242627105tmp> <https://builds.apache.org/job/HBase-0.94/ws/trunk/target/surefire/surefire_582237492101373860325tmp>
Running org.apache.hadoop.hbase.monitoring.TestTaskMonitor
Tests run: 3, Failures: 0, Errors: 0, Skipped: 0, Time elapsed: 0.3 sec
Forking command line: /bin/sh -c cd <https://builds.apache.org/job/HBase-0.94/ws/trunk> && /home/jenkins/tools/java/jdk1.6.0_27-32/jre/bin/java -enableassertions -Xmx1900m -Djava.security.egd=file:/dev/./urandom -jar <https://builds.apache.org/job/HBase-0.94/ws/trunk/target/surefire/surefirebooter1889775656894859333.jar> <https://builds.apache.org/job/HBase-0.94/ws/trunk/target/surefire/surefire3501004030940533811tmp> <https://builds.apache.org/job/HBase-0.94/ws/trunk/target/surefire/surefire_594906889360039242021tmp>
Running org.apache.hadoop.hbase.monitoring.TestMemoryBoundedLogMessageBuffer
Tests run: 2, Failures: 0, Errors: 0, Skipped: 0, Time elapsed: 0.248 sec
Forking command line: /bin/sh -c cd <https://builds.apache.org/job/HBase-0.94/ws/trunk> && /home/jenkins/tools/java/jdk1.6.0_27-32/jre/bin/java -enableassertions -Xmx1900m -Djava.security.egd=file:/dev/./urandom -jar <https://builds.apache.org/job/HBase-0.94/ws/trunk/target/surefire/surefirebooter8475639284523889026.jar> <https://builds.apache.org/job/HBase-0.94/ws/trunk/target/surefire/surefire6152780936185999942tmp> <https://builds.apache.org/job/HBase-0.94/ws/trunk/target/surefire/surefire_60833873665103522650tmp>
Running org.apache.hadoop.hbase.rest.TestScannersWithFilters
Tests run: 10, Failures: 0, Errors: 0, Skipped: 0, Time elapsed: 16.894 sec
Forking command line: /bin/sh -c cd <https://builds.apache.org/job/HBase-0.94/ws/trunk> && /home/jenkins/tools/java/jdk1.6.0_27-32/jre/bin/java -enableassertions -Xmx1900m -Djava.security.egd=file:/dev/./urandom -jar <https://builds.apache.org/job/HBase-0.94/ws/trunk/target/surefire/surefirebooter8970019980806707384.jar> <https://builds.apache.org/job/HBase-0.94/ws/trunk/target/surefire/surefire475385465185437559tmp> <https://builds.apache.org/job/HBase-0.94/ws/trunk/target/surefire/surefire_611835293021953281068tmp>
Running org.apache.hadoop.hbase.metrics.TestMetricsMBeanBase
Tests run: 2, Failures: 0, Errors: 0, Skipped: 0, Time elapsed: 1.121 sec
Forking command line: /bin/sh -c cd <https://builds.apache.org/job/HBase-0.94/ws/trunk> && /home/jenkins/tools/java/jdk1.6.0_27-32/jre/bin/java -enableassertions -Xmx1900m -Djava.security.egd=file:/dev/./urandom -jar <https://builds.apache.org/job/HBase-0.94/ws/trunk/target/surefire/surefirebooter1368707714907998251.jar> <https://builds.apache.org/job/HBase-0.94/ws/trunk/target/surefire/surefire6734181522099639248tmp> <https://builds.apache.org/job/HBase-0.94/ws/trunk/target/surefire/surefire_625902187116700223672tmp>
Running org.apache.hadoop.hbase.regionserver.TestServerCustomProtocol
Tests run: 7, Failures: 0, Errors: 0, Skipped: 0, Time elapsed: 14.602 sec
Forking command line: /bin/sh -c cd <https://builds.apache.org/job/HBase-0.94/ws/trunk> && /home/jenkins/tools/java/jdk1.6.0_27-32/jre/bin/java -enableassertions -Xmx1900m -Djava.security.egd=file:/dev/./urandom -jar <https://builds.apache.org/job/HBase-0.94/ws/trunk/target/surefire/surefirebooter5271163311045477934.jar> <https://builds.apache.org/job/HBase-0.94/ws/trunk/target/surefire/surefire1430716388920358433tmp> <https://builds.apache.org/job/HBase-0.94/ws/trunk/target/surefire/surefire_633591859907370075964tmp>
Running org.apache.hadoop.hbase.regionserver.TestAtomicOperation
Tests run: 5, Failures: 0, Errors: 0, Skipped: 0, Time elapsed: 31.505 sec
Forking command line: /bin/sh -c cd <https://builds.apache.org/job/HBase-0.94/ws/trunk> && /home/jenkins/tools/java/jdk1.6.0_27-32/jre/bin/java -enableassertions -Xmx1900m -Djava.security.egd=file:/dev/./urandom -jar <https://builds.apache.org/job/HBase-0.94/ws/trunk/target/surefire/surefirebooter4139690473984199352.jar> <https://builds.apache.org/job/HBase-0.94/ws/trunk/target/surefire/surefire4211593037577616808tmp> <https://builds.apache.org/job/HBase-0.94/ws/trunk/target/surefire/surefire_647442096061224087955tmp>
Running org.apache.hadoop.hbase.regionserver.TestHRegion
Tests run: 61, Failures: 0, Errors: 0, Skipped: 0, Time elapsed: 36.987 sec
Forking command line: /bin/sh -c cd <https://builds.apache.org/job/HBase-0.94/ws/trunk> && /home/jenkins/tools/java/jdk1.6.0_27-32/jre/bin/java -enableassertions -Xmx1900m -Djava.security.egd=file:/dev/./urandom -jar <https://builds.apache.org/job/HBase-0.94/ws/trunk/target/surefire/surefirebooter3196722676784580099.jar> <https://builds.apache.org/job/HBase-0.94/ws/trunk/target/surefire/surefire1928575350765205531tmp> <https://builds.apache.org/job/HBase-0.94/ws/trunk/target/surefire/surefire_659062277664530399351tmp>
Running org.apache.hadoop.hbase.regionserver.wal.TestWALReplayCompressed
Tests run: 5, Failures: 0, Errors: 0, Skipped: 0, Time elapsed: 29.782 sec
Running org.apache.hadoop.hbase.regionserver.wal.TestLogRollAbort
Tests run: 1, Failures: 0, Errors: 0, Skipped: 0, Time elapsed: 17.586 sec
Forking command line: /bin/sh -c cd <https://builds.apache.org/job/HBase-0.94/ws/trunk> && /home/jenkins/tools/java/jdk1.6.0_27-32/jre/bin/java -enableassertions -Xmx1900m -Djava.security.egd=file:/dev/./urandom -jar <https://builds.apache.org/job/HBase-0.94/ws/trunk/target/surefire/surefirebooter2233281348812867263.jar> <https://builds.apache.org/job/HBase-0.94/ws/trunk/target/surefire/surefire9086496738146290152tmp> <https://builds.apache.org/job/HBase-0.94/ws/trunk/target/surefire/surefire_663559091300488698072tmp>
Running org.apache.hadoop.hbase.regionserver.wal.TestWALReplay
Tests run: 5, Failures: 0, Errors: 0, Skipped: 0, Time elapsed: 28.772 sec
Forking command line: /bin/sh -c cd <https://builds.apache.org/job/HBase-0.94/ws/trunk> && /home/jenkins/tools/java/jdk1.6.0_27-32/jre/bin/java -enableassertions -Xmx1900m -Djava.security.egd=file:/dev/./urandom -jar <https://builds.apache.org/job/HBase-0.94/ws/trunk/target/surefire/surefirebooter8153813804630793322.jar> <https://builds.apache.org/job/HBase-0.94/ws/trunk/target/surefire/surefire341181187480406864tmp> <https://builds.apache.org/job/HBase-0.94/ws/trunk/target/surefire/surefire_672483563244435348309tmp>
Running org.apache.hadoop.hbase.regionserver.wal.TestLogRollingNoCluster
Tests run: 1, Failures: 0, Errors: 0, Skipped: 0, Time elapsed: 2.283 sec
Forking command line: /bin/sh -c cd <https://builds.apache.org/job/HBase-0.94/ws/trunk> && /home/jenkins/tools/java/jdk1.6.0_27-32/jre/bin/java -enableassertions -Xmx1900m -Djava.security.egd=file:/dev/./urandom -jar <https://builds.apache.org/job/HBase-0.94/ws/trunk/target/surefire/surefirebooter3286805202487393507.jar> <https://builds.apache.org/job/HBase-0.94/ws/trunk/target/surefire/surefire5763330613306778950tmp> <https://builds.apache.org/job/HBase-0.94/ws/trunk/target/surefire/surefire_68565242325140121938tmp>
Running org.apache.hadoop.hbase.regionserver.wal.TestHLogBench
Tests run: 1, Failures: 0, Errors: 0, Skipped: 0, Time elapsed: 1.438 sec
Forking command line: /bin/sh -c cd <https://builds.apache.org/job/HBase-0.94/ws/trunk> && /home/jenkins/tools/java/jdk1.6.0_27-32/jre/bin/java -enableassertions -Xmx1900m -Djava.security.egd=file:/dev/./urandom -jar <https://builds.apache.org/job/HBase-0.94/ws/trunk/target/surefire/surefirebooter6508403263597161848.jar> <https://builds.apache.org/job/HBase-0.94/ws/trunk/target/surefire/surefire2507339651170869012tmp> <https://builds.apache.org/job/HBase-0.94/ws/trunk/target/surefire/surefire_698278686396085492839tmp>
Running org.apache.hadoop.hbase.regionserver.TestStore
Tests run: 12, Failures: 0, Errors: 0, Skipped: 0, Time elapsed: 9.369 sec
Forking command line: /bin/sh -c cd <https://builds.apache.org/job/HBase-0.94/ws/trunk> && /home/jenkins/tools/java/jdk1.6.0_27-32/jre/bin/java -enableassertions -Xmx1900m -Djava.security.egd=file:/dev/./urandom -jar <https://builds.apache.org/job/HBase-0.94/ws/trunk/target/surefire/surefirebooter6032202267992374493.jar> <https://builds.apache.org/job/HBase-0.94/ws/trunk/target/surefire/surefire5689001546114206560tmp> <https://builds.apache.org/job/HBase-0.94/ws/trunk/target/surefire/surefire_705583358442237076683tmp>
Running org.apache.hadoop.hbase.regionserver.TestRpcMetrics
Tests run: 1, Failures: 0, Errors: 0, Skipped: 0, Time elapsed: 2.187 sec
Forking command line: /bin/sh -c cd <https://builds.apache.org/job/HBase-0.94/ws/trunk> && /home/jenkins/tools/java/jdk1.6.0_27-32/jre/bin/java -enableassertions -Xmx1900m -Djava.security.egd=file:/dev/./urandom -jar <https://builds.apache.org/job/HBase-0.94/ws/trunk/target/surefire/surefirebooter3709953206720437995.jar> <https://builds.apache.org/job/HBase-0.94/ws/trunk/target/surefire/surefire5305150048951158457tmp> <https://builds.apache.org/job/HBase-0.94/ws/trunk/target/surefire/surefire_711512991262886193309tmp>
Running org.apache.hadoop.hbase.regionserver.TestBlocksRead
Tests run: 4, Failures: 0, Errors: 0, Skipped: 0, Time elapsed: 0.972 sec
Forking command line: /bin/sh -c cd <https://builds.apache.org/job/HBase-0.94/ws/trunk> && /home/jenkins/tools/java/jdk1.6.0_27-32/jre/bin/java -enableassertions -Xmx1900m -Djava.security.egd=file:/dev/./urandom -jar <https://builds.apache.org/job/HBase-0.94/ws/trunk/target/surefire/surefirebooter7171760388461270175.jar> <https://builds.apache.org/job/HBase-0.94/ws/trunk/target/surefire/surefire2162472618837858914tmp> <https://builds.apache.org/job/HBase-0.94/ws/trunk/target/surefire/surefire_72127842468682289160tmp>
Forking command line: /bin/sh -c cd <https://builds.apache.org/job/HBase-0.94/ws/trunk> && /home/jenkins/tools/java/jdk1.6.0_27-32/jre/bin/java -enableassertions -Xmx1900m -Djava.security.egd=file:/dev/./urandom -jar <https://builds.apache.org/job/HBase-0.94/ws/trunk/target/surefire/surefirebooter416908992903647249.jar> <https://builds.apache.org/job/HBase-0.94/ws/trunk/target/surefire/surefire5675279223494300232tmp> <https://builds.apache.org/job/HBase-0.94/ws/trunk/target/surefire/surefire_735174917387874262918tmp>
Running org.apache.hadoop.hbase.regionserver.TestRegionServerMetrics
Tests run: 1, Failures: 0, Errors: 0, Skipped: 0, Time elapsed: 30.608 sec
Forking command line: /bin/sh -c cd <https://builds.apache.org/job/HBase-0.94/ws/trunk> && /home/jenkins/tools/java/jdk1.6.0_27-32/jre/bin/java -enableassertions -Xmx1900m -Djava.security.egd=file:/dev/./urandom -jar <https://builds.apache.org/job/HBase-0.94/ws/trunk/target/surefire/surefirebooter4149283255768334617.jar> <https://builds.apache.org/job/HBase-0.94/ws/trunk/target/surefire/surefire8810900867196177452tmp> <https://builds.apache.org/job/HBase-0.94/ws/trunk/target/surefire/surefire_743912733914491283052tmp>
Running org.apache.hadoop.hbase.regionserver.metrics.TestSchemaMetrics
Running org.apache.hadoop.hbase.regionserver.TestParallelPut
Tests run: 2, Failures: 0, Errors: 0, Skipped: 0, Time elapsed: 5.356 sec
Forking command line: /bin/sh -c cd <https://builds.apache.org/job/HBase-0.94/ws/trunk> && /home/jenkins/tools/java/jdk1.6.0_27-32/jre/bin/java -enableassertions -Xmx1900m -Djava.security.egd=file:/dev/./urandom -jar <https://builds.apache.org/job/HBase-0.94/ws/trunk/target/surefire/surefirebooter9074519569148592781.jar> <https://builds.apache.org/job/HBase-0.94/ws/trunk/target/surefire/surefire959192754043046575tmp> <https://builds.apache.org/job/HBase-0.94/ws/trunk/target/surefire/surefire_755986372132100436406tmp>
Tests run: 6, Failures: 0, Errors: 0, Skipped: 0, Time elapsed: 15.391 sec
Forking command line: /bin/sh -c cd <https://builds.apache.org/job/HBase-0.94/ws/trunk> && /home/jenkins/tools/java/jdk1.6.0_27-32/jre/bin/java -enableassertions -Xmx1900m -Djava.security.egd=file:/dev/./urandom -jar <https://builds.apache.org/job/HBase-0.94/ws/trunk/target/surefire/surefirebooter8831434041629183218.jar> <https://builds.apache.org/job/HBase-0.94/ws/trunk/target/surefire/surefire9193424240361347566tmp> <https://builds.apache.org/job/HBase-0.94/ws/trunk/target/surefire/surefire_761994843888789597830tmp>
Running org.apache.hadoop.hbase.regionserver.TestStoreScanner
Tests run: 16, Failures: 0, Errors: 0, Skipped: 0, Time elapsed: 0.067 sec
Forking command line: /bin/sh -c cd <https://builds.apache.org/job/HBase-0.94/ws/trunk> && /home/jenkins/tools/java/jdk1.6.0_27-32/jre/bin/java -enableassertions -Xmx1900m -Djava.security.egd=file:/dev/./urandom -jar <https://builds.apache.org/job/HBase-0.94/ws/trunk/target/surefire/surefirebooter7978278136184747076.jar> <https://builds.apache.org/job/HBase-0.94/ws/trunk/target/surefire/surefire6689802180439295835tmp> <https://builds.apache.org/job/HBase-0.94/ws/trunk/target/surefire/surefire_777758871724381623143tmp>
Running org.apache.hadoop.hbase.regionserver.TestStoreFileBlockCacheSummary
Tests run: 1, Failures: 0, Errors: 0, Skipped: 0, Time elapsed: 14.693 sec
Forking command line: /bin/sh -c cd <https://builds.apache.org/job/HBase-0.94/ws/trunk> && /home/jenkins/tools/java/jdk1.6.0_27-32/jre/bin/java -enableassertions -Xmx1900m -Djava.security.egd=file:/dev/./urandom -jar <https://builds.apache.org/job/HBase-0.94/ws/trunk/target/surefire/surefirebooter2061058968972021134.jar> <https://builds.apache.org/job/HBase-0.94/ws/trunk/target/surefire/surefire2317061035421673388tmp> <https://builds.apache.org/job/HBase-0.94/ws/trunk/target/surefire/surefire_785565031943874713300tmp>
Running org.apache.hadoop.hbase.regionserver.handler.TestCloseRegionHandler
Tests run: 3, Failures: 0, Errors: 0, Skipped: 0, Time elapsed: 1.395 sec
Forking command line: /bin/sh -c cd <https://builds.apache.org/job/HBase-0.94/ws/trunk> && /home/jenkins/tools/java/jdk1.6.0_27-32/jre/bin/java -enableassertions -Xmx1900m -Djava.security.egd=file:/dev/./urandom -jar <https://builds.apache.org/job/HBase-0.94/ws/trunk/target/surefire/surefirebooter2741029489088319401.jar> <https://builds.apache.org/job/HBase-0.94/ws/trunk/target/surefire/surefire5393793462588246451tmp> <https://builds.apache.org/job/HBase-0.94/ws/trunk/target/surefire/surefire_795451105559426678934tmp>
Running org.apache.hadoop.hbase.regionserver.handler.TestOpenRegionHandler
Tests run: 3, Failures: 0, Errors: 0, Skipped: 0, Time elapsed: 1.095 sec
Forking command line: /bin/sh -c cd <https://builds.apache.org/job/HBase-0.94/ws/trunk> && /home/jenkins/tools/java/jdk1.6.0_27-32/jre/bin/java -enableassertions -Xmx1900m -Djava.security.egd=file:/dev/./urandom -jar <https://builds.apache.org/job/HBase-0.94/ws/trunk/target/surefire/surefirebooter351114785413538920.jar> <https://builds.apache.org/job/HBase-0.94/ws/trunk/target/surefire/surefire648686072887556651tmp> <https://builds.apache.org/job/HBase-0.94/ws/trunk/target/surefire/surefire_806499525439734819543tmp>
Running org.apache.hadoop.hbase.regionserver.TestMasterAddressManager
Tests run: 1, Failures: 0, Errors: 0, Skipped: 0, Time elapsed: 0.716 sec
Forking command line: /bin/sh -c cd <https://builds.apache.org/job/HBase-0.94/ws/trunk> && /home/jenkins/tools/java/jdk1.6.0_27-32/jre/bin/java -enableassertions -Xmx1900m -Djava.security.egd=file:/dev/./urandom -jar <https://builds.apache.org/job/HBase-0.94/ws/trunk/target/surefire/surefirebooter6038863241882031249.jar> <https://builds.apache.org/job/HBase-0.94/ws/trunk/target/surefire/surefire8725266265479544116tmp> <https://builds.apache.org/job/HBase-0.94/ws/trunk/target/surefire/surefire_814062556849324858245tmp>
Running org.apache.hadoop.hbase.regionserver.TestSplitLogWorker
Tests run: 5, Failures: 0, Errors: 0, Skipped: 0, Time elapsed: 2.219 sec
Forking command line: /bin/sh -c cd <https://builds.apache.org/job/HBase-0.94/ws/trunk> && /home/jenkins/tools/java/jdk1.6.0_27-32/jre/bin/java -enableassertions -Xmx1900m -Djava.security.egd=file:/dev/./urandom -jar <https://builds.apache.org/job/HBase-0.94/ws/trunk/target/surefire/surefirebooter250187913231007016.jar> <https://builds.apache.org/job/HBase-0.94/ws/trunk/target/surefire/surefire5742175623217325198tmp> <https://builds.apache.org/job/HBase-0.94/ws/trunk/target/surefire/surefire_828464976019582882788tmp>
Running org.apache.hadoop.hbase.regionserver.TestSeekOptimizations
Tests run: 6, Failures: 0, Errors: 0, Skipped: 0, Time elapsed: 2.892 sec
Forking command line: /bin/sh -c cd <https://builds.apache.org/job/HBase-0.94/ws/trunk> && /home/jenkins/tools/java/jdk1.6.0_27-32/jre/bin/java -enableassertions -Xmx1900m -Djava.security.egd=file:/dev/./urandom -jar <https://builds.apache.org/job/HBase-0.94/ws/trunk/target/surefire/surefirebooter2551285732183021467.jar> <https://builds.apache.org/job/HBase-0.94/ws/trunk/target/surefire/surefire651856587275155566tmp> <https://builds.apache.org/job/HBase-0.94/ws/trunk/target/surefire/surefire_837543837900052913021tmp>
Running org.apache.hadoop.hbase.regionserver.TestMultiColumnScanner
Tests run: 12, Failures: 0, Errors: 0, Skipped: 0, Time elapsed: 41.785 sec
Forking command line: /bin/sh -c cd <https://builds.apache.org/job/HBase-0.94/ws/trunk> && /home/jenkins/tools/java/jdk1.6.0_27-32/jre/bin/java -enableassertions -Xmx1900m -Djava.security.egd=file:/dev/./urandom -jar <https://builds.apache.org/job/HBase-0.94/ws/trunk/target/surefire/surefirebooter5659510648118700880.jar> <https://builds.apache.org/job/HBase-0.94/ws/trunk/target/surefire/surefire6032636111337802911tmp> <https://builds.apache.org/job/HBase-0.94/ws/trunk/target/surefire/surefire_845722906051143706757tmp>
Running org.apache.hadoop.hbase.regionserver.TestFSErrorsExposed
Tests run: 3, Failures: 0, Errors: 0, Skipped: 0, Time elapsed: 26.989 sec
Forking command line: /bin/sh -c cd <https://builds.apache.org/job/HBase-0.94/ws/trunk> && /home/jenkins/tools/java/jdk1.6.0_27-32/jre/bin/java -enableassertions -Xmx1900m -Djava.security.egd=file:/dev/./urandom -jar <https://builds.apache.org/job/HBase-0.94/ws/trunk/target/surefire/surefirebooter3708817689084180789.jar> <https://builds.apache.org/job/HBase-0.94/ws/trunk/target/surefire/surefire5488764374647088613tmp> <https://builds.apache.org/job/HBase-0.94/ws/trunk/target/surefire/surefire_856553083441744489082tmp>
Running org.apache.hadoop.hbase.filter.TestColumnRangeFilter
Tests run: 1, Failures: 0, Errors: 0, Skipped: 0, Time elapsed: 16.605 sec
Forking command line: /bin/sh -c cd <https://builds.apache.org/job/HBase-0.94/ws/trunk> && /home/jenkins/tools/java/jdk1.6.0_27-32/jre/bin/java -enableassertions -Xmx1900m -Djava.security.egd=file:/dev/./urandom -jar <https://builds.apache.org/job/HBase-0.94/ws/trunk/target/surefire/surefirebooter8058193127585358401.jar> <https://builds.apache.org/job/HBase-0.94/ws/trunk/target/surefire/surefire4223875904672820011tmp> <https://builds.apache.org/job/HBase-0.94/ws/trunk/target/surefire/surefire_865126625742620296657tmp>
Running org.apache.hadoop.hbase.TestGlobalMemStoreSize
Tests run: 1, Failures: 0, Errors: 0, Skipped: 0, Time elapsed: 15.886 sec
Forking command line: /bin/sh -c cd <https://builds.apache.org/job/HBase-0.94/ws/trunk> && /home/jenkins/tools/java/jdk1.6.0_27-32/jre/bin/java -enableassertions -Xmx1900m -Djava.security.egd=file:/dev/./urandom -jar <https://builds.apache.org/job/HBase-0.94/ws/trunk/target/surefire/surefirebooter6657864016832371932.jar> <https://builds.apache.org/job/HBase-0.94/ws/trunk/target/surefire/surefire7351371807731629952tmp> <https://builds.apache.org/job/HBase-0.94/ws/trunk/target/surefire/surefire_874450263874371803573tmp>
Running org.apache.hadoop.hbase.thrift2.TestThriftHBaseServiceHandler
Tests run: 12, Failures: 0, Errors: 0, Skipped: 0, Time elapsed: 10.754 sec
Forking command line: /bin/sh -c cd <https://builds.apache.org/job/HBase-0.94/ws/trunk> && /home/jenkins/tools/java/jdk1.6.0_27-32/jre/bin/java -enableassertions -Xmx1900m -Djava.security.egd=file:/dev/./urandom -jar <https://builds.apache.org/job/HBase-0.94/ws/trunk/target/surefire/surefirebooter999508381413850632.jar> <https://builds.apache.org/job/HBase-0.94/ws/trunk/target/surefire/surefire5555524903462467781tmp> <https://builds.apache.org/job/HBase-0.94/ws/trunk/target/surefire/surefire_881623394154956008743tmp>
Running org.apache.hadoop.hbase.replication.TestReplicationZookeeper
Tests run: 1, Failures: 0, Errors: 0, Skipped: 0, Time elapsed: 0.681 sec
Forking command line: /bin/sh -c cd <https://builds.apache.org/job/HBase-0.94/ws/trunk> && /home/jenkins/tools/java/jdk1.6.0_27-32/jre/bin/java -enableassertions -Xmx1900m -Djava.security.egd=file:/dev/./urandom -jar <https://builds.apache.org/job/HBase-0.94/ws/trunk/target/surefire/surefirebooter8877162490088404475.jar> <https://builds.apache.org/job/HBase-0.94/ws/trunk/target/surefire/surefire7493845836561770258tmp> <https://builds.apache.org/job/HBase-0.94/ws/trunk/target/surefire/surefire_897392684523643512008tmp>
Running org.apache.hadoop.hbase.TestMultiVersions
Tests run: 3, Failures: 0, Errors: 0, Skipped: 0, Time elapsed: 22.255 sec
Forking command line: /bin/sh -c cd <https://builds.apache.org/job/HBase-0.94/ws/trunk> && /home/jenkins/tools/java/jdk1.6.0_27-32/jre/bin/java -enableassertions -Xmx1900m -Djava.security.egd=file:/dev/./urandom -jar <https://builds.apache.org/job/HBase-0.94/ws/trunk/target/surefire/surefirebooter4495436697427288502.jar> <https://builds.apache.org/job/HBase-0.94/ws/trunk/target/surefire/surefire5377803383939254855tmp> <https://builds.apache.org/job/HBase-0.94/ws/trunk/target/surefire/surefire_907975277724291893284tmp>
Running org.apache.hadoop.hbase.replication.regionserver.TestReplicationSourceManager
Tests run: 1, Failures: 0, Errors: 0, Skipped: 0, Time elapsed: 1.088 sec
Forking command line: /bin/sh -c cd <https://builds.apache.org/job/HBase-0.94/ws/trunk> && /home/jenkins/tools/java/jdk1.6.0_27-32/jre/bin/java -enableassertions -Xmx1900m -Djava.security.egd=file:/dev/./urandom -jar <https://builds.apache.org/job/HBase-0.94/ws/trunk/target/surefire/surefirebooter1789092400229268185.jar> <https://builds.apache.org/job/HBase-0.94/ws/trunk/target/surefire/surefire8539408380702281107tmp> <https://builds.apache.org/job/HBase-0.94/ws/trunk/target/surefire/surefire_911844915333062417650tmp>
Running org.apache.hadoop.hbase.replication.TestReplicationPeer
Tests run: 1, Failures: 0, Errors: 0, Skipped: 0, Time elapsed: 7.71 sec
Forking command line: /bin/sh -c cd <https://builds.apache.org/job/HBase-0.94/ws/trunk> && /home/jenkins/tools/java/jdk1.6.0_27-32/jre/bin/java -enableassertions -Xmx1900m -Djava.security.egd=file:/dev/./urandom -jar <https://builds.apache.org/job/HBase-0.94/ws/trunk/target/surefire/surefirebooter5520059070406411716.jar> <https://builds.apache.org/job/HBase-0.94/ws/trunk/target/surefire/surefire9141453375518471801tmp> <https://builds.apache.org/job/HBase-0.94/ws/trunk/target/surefire/surefire_928378896633910166065tmp>
Running org.apache.hadoop.hbase.replication.TestReplicationSource
Tests run: 1, Failures: 0, Errors: 0, Skipped: 0, Time elapsed: 2.673 sec
Forking command line: /bin/sh -c cd <https://builds.apache.org/job/HBase-0.94/ws/trunk> && /home/jenkins/tools/java/jdk1.6.0_27-32/jre/bin/java -enableassertions -Xmx1900m -Djava.security.egd=file:/dev/./urandom -jar <https://builds.apache.org/job/HBase-0.94/ws/trunk/target/surefire/surefirebooter5570060853252582555.jar> <https://builds.apache.org/job/HBase-0.94/ws/trunk/target/surefire/surefire2747847535782756405tmp> <https://builds.apache.org/job/HBase-0.94/ws/trunk/target/surefire/surefire_933418799110294876046tmp>
Running org.apache.hadoop.hbase.replication.regionserver.TestReplicationSink
Tests run: 5, Failures: 0, Errors: 0, Skipped: 0, Time elapsed: 14.638 sec
Forking command line: /bin/sh -c cd <https://builds.apache.org/job/HBase-0.94/ws/trunk> && /home/jenkins/tools/java/jdk1.6.0_27-32/jre/bin/java -enableassertions -Xmx1900m -Djava.security.egd=file:/dev/./urandom -jar <https://builds.apache.org/job/HBase-0.94/ws/trunk/target/surefire/surefirebooter8920832278100547055.jar> <https://builds.apache.org/job/HBase-0.94/ws/trunk/target/surefire/surefire2086459399137621969tmp> <https://builds.apache.org/job/HBase-0.94/ws/trunk/target/surefire/surefire_942403989036564825205tmp>
Running org.apache.hadoop.hbase.avro.TestAvroServer
Tests run: 3, Failures: 0, Errors: 0, Skipped: 0, Time elapsed: 26.06 sec
Forking command line: /bin/sh -c cd <https://builds.apache.org/job/HBase-0.94/ws/trunk> && /home/jenkins/tools/java/jdk1.6.0_27-32/jre/bin/java -enableassertions -Xmx1900m -Djava.security.egd=file:/dev/./urandom -jar <https://builds.apache.org/job/HBase-0.94/ws/trunk/target/surefire/surefirebooter7535465373547042423.jar> <https://builds.apache.org/job/HBase-0.94/ws/trunk/target/surefire/surefire8294721698115837811tmp> <https://builds.apache.org/job/HBase-0.94/ws/trunk/target/surefire/surefire_955152980245367215485tmp>
Running org.apache.hadoop.hbase.coprocessor.TestRegionServerCoprocessorExceptionWithRemove
Tests run: 1, Failures: 0, Errors: 0, Skipped: 0, Time elapsed: 14.743 sec
Forking command line: /bin/sh -c cd <https://builds.apache.org/job/HBase-0.94/ws/trunk> && /home/jenkins/tools/java/jdk1.6.0_27-32/jre/bin/java -enableassertions -Xmx1900m -Djava.security.egd=file:/dev/./urandom -jar <https://builds.apache.org/job/HBase-0.94/ws/trunk/target/surefire/surefirebooter8605014680998129791.jar> <https://builds.apache.org/job/HBase-0.94/ws/trunk/target/surefire/surefire3414988167467288350tmp> <https://builds.apache.org/job/HBase-0.94/ws/trunk/target/surefire/surefire_96964547260796999150tmp>
Running org.apache.hadoop.hbase.coprocessor.TestRegionObserverInterface
Tests run: 6, Failures: 0, Errors: 0, Skipped: 0, Time elapsed: 30.5 sec
Forking command line: /bin/sh -c cd <https://builds.apache.org/job/HBase-0.94/ws/trunk> && /home/jenkins/tools/java/jdk1.6.0_27-32/jre/bin/java -enableassertions -Xmx1900m -Djava.security.egd=file:/dev/./urandom -jar <https://builds.apache.org/job/HBase-0.94/ws/trunk/target/surefire/surefirebooter4237323029384851091.jar> <https://builds.apache.org/job/HBase-0.94/ws/trunk/target/surefire/surefire4270587378212202075tmp> <https://builds.apache.org/job/HBase-0.94/ws/trunk/target/surefire/surefire_975906787546747924621tmp>
Running org.apache.hadoop.hbase.TestAcidGuarantees
Tests run: 3, Failures: 0, Errors: 0, Skipped: 0, Time elapsed: 94.047 sec
Forking command line: /bin/sh -c cd <https://builds.apache.org/job/HBase-0.94/ws/trunk> && /home/jenkins/tools/java/jdk1.6.0_27-32/jre/bin/java -enableassertions -Xmx1900m -Djava.security.egd=file:/dev/./urandom -jar <https://builds.apache.org/job/HBase-0.94/ws/trunk/target/surefire/surefirebooter5529275614314226536.jar> <https://builds.apache.org/job/HBase-0.94/ws/trunk/target/surefire/surefire4070145147795755278tmp> <https://builds.apache.org/job/HBase-0.94/ws/trunk/target/surefire/surefire_981103001494840414087tmp>
Running org.apache.hadoop.hbase.coprocessor.TestMasterObserver
Tests run: 3, Failures: 0, Errors: 0, Skipped: 0, Time elapsed: 26.527 sec
Forking command line: /bin/sh -c cd <https://builds.apache.org/job/HBase-0.94/ws/trunk> && /home/jenkins/tools/java/jdk1.6.0_27-32/jre/bin/java -enableassertions -Xmx1900m -Djava.security.egd=file:/dev/./urandom -jar <https://builds.apache.org/job/HBase-0.94/ws/trunk/target/surefire/surefirebooter5272944352343356921.jar> <https://builds.apache.org/job/HBase-0.94/ws/trunk/target/surefire/surefire3145849584560913249tmp> <https://builds.apache.org/job/HBase-0.94/ws/trunk/target/surefire/surefire_99898171381308953816tmp>
Running org.apache.hadoop.hbase.coprocessor.TestWALObserver
Tests run: 3, Failures: 0, Errors: 0, Skipped: 0, Time elapsed: 15.057 sec
Running org.apache.hadoop.hbase.coprocessor.TestCoprocessorEndpoint
Tests run: 3, Failures: 0, Errors: 0, Skipped: 1, Time elapsed: 28.706 sec
Forking command line: /bin/sh -c cd <https://builds.apache.org/job/HBase-0.94/ws/trunk> && /home/jenkins/tools/java/jdk1.6.0_27-32/jre/bin/java -enableassertions -Xmx1900m -Djava.security.egd=file:/dev/./urandom -jar <https://builds.apache.org/job/HBase-0.94/ws/trunk/target/surefire/surefirebooter7817601808419584137.jar> <https://builds.apache.org/job/HBase-0.94/ws/trunk/target/surefire/surefire4133493471230597720tmp> <https://builds.apache.org/job/HBase-0.94/ws/trunk/target/surefire/surefire_1008661744564780940345tmp>
Forking command line: /bin/sh -c cd <https://builds.apache.org/job/HBase-0.94/ws/trunk> && /home/jenkins/tools/java/jdk1.6.0_27-32/jre/bin/java -enableassertions -Xmx1900m -Djava.security.egd=file:/dev/./urandom -jar <https://builds.apache.org/job/HBase-0.94/ws/trunk/target/surefire/surefirebooter1943262918344742641.jar> <https://builds.apache.org/job/HBase-0.94/ws/trunk/target/surefire/surefire4401727403507189215tmp> <https://builds.apache.org/job/HBase-0.94/ws/trunk/target/surefire/surefire_1011661869151717561496tmp>
Running org.apache.hadoop.hbase.coprocessor.TestRegionObserverBypass
Tests run: 2, Failures: 0, Errors: 0, Skipped: 0, Time elapsed: 12.652 sec
Forking command line: /bin/sh -c cd <https://builds.apache.org/job/HBase-0.94/ws/trunk> && /home/jenkins/tools/java/jdk1.6.0_27-32/jre/bin/java -enableassertions -Xmx1900m -Djava.security.egd=file:/dev/./urandom -jar <https://builds.apache.org/job/HBase-0.94/ws/trunk/target/surefire/surefirebooter6996424698134551086.jar> <https://builds.apache.org/job/HBase-0.94/ws/trunk/target/surefire/surefire7671502336526485946tmp> <https://builds.apache.org/job/HBase-0.94/ws/trunk/target/surefire/surefire_102800540824745404850tmp>
Running org.apache.hadoop.hbase.coprocessor.TestMasterCoprocessorExceptionWithAbort
Tests run: 1, Failures: 0, Errors: 0, Skipped: 0, Time elapsed: 10.52 sec
Forking command line: /bin/sh -c cd <https://builds.apache.org/job/HBase-0.94/ws/trunk> && /home/jenkins/tools/java/jdk1.6.0_27-32/jre/bin/java -enableassertions -Xmx1900m -Djava.security.egd=file:/dev/./urandom -jar <https://builds.apache.org/job/HBase-0.94/ws/trunk/target/surefire/surefirebooter8947454692982758559.jar> <https://builds.apache.org/job/HBase-0.94/ws/trunk/target/surefire/surefire2402770180209708786tmp> <https://builds.apache.org/job/HBase-0.94/ws/trunk/target/surefire/surefire_1036802596177246976237tmp>
Running org.apache.hadoop.hbase.coprocessor.TestRegionServerCoprocessorExceptionWithAbort
Tests run: 1, Failures: 0, Errors: 0, Skipped: 0, Time elapsed: 13.228 sec
Forking command line: /bin/sh -c cd <https://builds.apache.org/job/HBase-0.94/ws/trunk> && /home/jenkins/tools/java/jdk1.6.0_27-32/jre/bin/java -enableassertions -Xmx1900m -Djava.security.egd=file:/dev/./urandom -jar <https://builds.apache.org/job/HBase-0.94/ws/trunk/target/surefire/surefirebooter1537081322606081042.jar> <https://builds.apache.org/job/HBase-0.94/ws/trunk/target/surefire/surefire22496658225782962tmp> <https://builds.apache.org/job/HBase-0.94/ws/trunk/target/surefire/surefire_1046076519763016493442tmp>
Running org.apache.hadoop.hbase.coprocessor.TestAggregateProtocol
Tests run: 45, Failures: 0, Errors: 0, Skipped: 0, Time elapsed: 16.82 sec
Forking command line: /bin/sh -c cd <https://builds.apache.org/job/HBase-0.94/ws/trunk> && /home/jenkins/tools/java/jdk1.6.0_27-32/jre/bin/java -enableassertions -Xmx1900m -Djava.security.egd=file:/dev/./urandom -jar <https://builds.apache.org/job/HBase-0.94/ws/trunk/target/surefire/surefirebooter263503462998628835.jar> <https://builds.apache.org/job/HBase-0.94/ws/trunk/target/surefire/surefire4519151741178424094tmp> <https://builds.apache.org/job/HBase-0.94/ws/trunk/target/surefire/surefire_1056750885521156199513tmp>
Running org.apache.hadoop.hbase.coprocessor.TestMasterCoprocessorExceptionWithRemove
Tests run: 1, Failures: 0, Errors: 0, Skipped: 0, Time elapsed: 15.048 sec
Forking command line: /bin/sh -c cd <https://builds.apache.org/job/HBase-0.94/ws/trunk> && /home/jenkins/tools/java/jdk1.6.0_27-32/jre/bin/java -enableassertions -Xmx1900m -Djava.security.egd=file:/dev/./urandom -jar <https://builds.apache.org/job/HBase-0.94/ws/trunk/target/surefire/surefirebooter2516927883588349198.jar> <https://builds.apache.org/job/HBase-0.94/ws/trunk/target/surefire/surefire3379700548034922904tmp> <https://builds.apache.org/job/HBase-0.94/ws/trunk/target/surefire/surefire_1066339715396054621112tmp>
Running org.apache.hadoop.hbase.coprocessor.TestClassLoading
Tests run: 5, Failures: 0, Errors: 0, Skipped: 0, Time elapsed: 23.859 sec
Forking command line: /bin/sh -c cd <https://builds.apache.org/job/HBase-0.94/ws/trunk> && /home/jenkins/tools/java/jdk1.6.0_27-32/jre/bin/java -enableassertions -Xmx1900m -Djava.security.egd=file:/dev/./urandom -jar <https://builds.apache.org/job/HBase-0.94/ws/trunk/target/surefire/surefirebooter5148516653155041895.jar> <https://builds.apache.org/job/HBase-0.94/ws/trunk/target/surefire/surefire8034462920740081907tmp> <https://builds.apache.org/job/HBase-0.94/ws/trunk/target/surefire/surefire_1076183107193071070146tmp>
Running org.apache.hadoop.hbase.constraint.TestConstraint
Tests run: 5, Failures: 0, Errors: 0, Skipped: 0, Time elapsed: 26.881 sec
Forking command line: /bin/sh -c cd <https://builds.apache.org/job/HBase-0.94/ws/trunk> && /home/jenkins/tools/java/jdk1.6.0_27-32/jre/bin/java -enableassertions -Xmx1900m -Djava.security.egd=file:/dev/./urandom -jar <https://builds.apache.org/job/HBase-0.94/ws/trunk/target/surefire/surefirebooter6675752426832951526.jar> <https://builds.apache.org/job/HBase-0.94/ws/trunk/target/surefire/surefire1643668595284488675tmp> <https://builds.apache.org/job/HBase-0.94/ws/trunk/target/surefire/surefire_1087730203728915260130tmp>
Running org.apache.hadoop.hbase.master.TestActiveMasterManager
Tests run: 2, Failures: 0, Errors: 0, Skipped: 0, Time elapsed: 0.913 sec
Forking command line: /bin/sh -c cd <https://builds.apache.org/job/HBase-0.94/ws/trunk> && /home/jenkins/tools/java/jdk1.6.0_27-32/jre/bin/java -enableassertions -Xmx1900m -Djava.security.egd=file:/dev/./urandom -jar <https://builds.apache.org/job/HBase-0.94/ws/trunk/target/surefire/surefirebooter2449931775139949808.jar> <https://builds.apache.org/job/HBase-0.94/ws/trunk/target/surefire/surefire5798324642956236564tmp> <https://builds.apache.org/job/HBase-0.94/ws/trunk/target/surefire/surefire_109534209013430340460tmp>
Running org.apache.hadoop.hbase.master.TestMasterStatusServlet
Tests run: 5, Failures: 0, Errors: 0, Skipped: 0, Time elapsed: 0.946 sec
Forking command line: /bin/sh -c cd <https://builds.apache.org/job/HBase-0.94/ws/trunk> && /home/jenkins/tools/java/jdk1.6.0_27-32/jre/bin/java -enableassertions -Xmx1900m -Djava.security.egd=file:/dev/./urandom -jar <https://builds.apache.org/job/HBase-0.94/ws/trunk/target/surefire/surefirebooter137733429183874136.jar> <https://builds.apache.org/job/HBase-0.94/ws/trunk/target/surefire/surefire784687554444748032tmp> <https://builds.apache.org/job/HBase-0.94/ws/trunk/target/surefire/surefire_1107231205416866064860tmp>
Running org.apache.hadoop.hbase.master.TestClockSkewDetection
Tests run: 1, Failures: 0, Errors: 0, Skipped: 0, Time elapsed: 0.251 sec
Forking command line: /bin/sh -c cd <https://builds.apache.org/job/HBase-0.94/ws/trunk> && /home/jenkins/tools/java/jdk1.6.0_27-32/jre/bin/java -enableassertions -Xmx1900m -Djava.security.egd=file:/dev/./urandom -jar <https://builds.apache.org/job/HBase-0.94/ws/trunk/target/surefire/surefirebooter7526909301433537840.jar> <https://builds.apache.org/job/HBase-0.94/ws/trunk/target/surefire/surefire5257345426973159347tmp> <https://builds.apache.org/job/HBase-0.94/ws/trunk/target/surefire/surefire_1113035942817603019573tmp>
Running org.apache.hadoop.hbase.master.TestOpenedRegionHandler
Tests run: 2, Failures: 0, Errors: 0, Skipped: 0, Time elapsed: 12.511 sec
Forking command line: /bin/sh -c cd <https://builds.apache.org/job/HBase-0.94/ws/trunk> && /home/jenkins/tools/java/jdk1.6.0_27-32/jre/bin/java -enableassertions -Xmx1900m -Djava.security.egd=file:/dev/./urandom -jar <https://builds.apache.org/job/HBase-0.94/ws/trunk/target/surefire/surefirebooter5413070192082727178.jar> <https://builds.apache.org/job/HBase-0.94/ws/trunk/target/surefire/surefire3416915783159670224tmp> <https://builds.apache.org/job/HBase-0.94/ws/trunk/target/surefire/surefire_1126851649430984824745tmp>
Running org.apache.hadoop.hbase.master.TestDefaultLoadBalancer
Tests run: 4, Failures: 0, Errors: 0, Skipped: 0, Time elapsed: 1.466 sec
Forking command line: /bin/sh -c cd <https://builds.apache.org/job/HBase-0.94/ws/trunk> && /home/jenkins/tools/java/jdk1.6.0_27-32/jre/bin/java -enableassertions -Xmx1900m -Djava.security.egd=file:/dev/./urandom -jar <https://builds.apache.org/job/HBase-0.94/ws/trunk/target/surefire/surefirebooter7041827659315709190.jar> <https://builds.apache.org/job/HBase-0.94/ws/trunk/target/surefire/surefire8156908627311907096tmp> <https://builds.apache.org/job/HBase-0.94/ws/trunk/target/surefire/surefire_1138161380573470085901tmp>
Running org.apache.hadoop.hbase.master.TestHMasterRPCException
Tests run: 1, Failures: 0, Errors: 0, Skipped: 0, Time elapsed: 1.399 sec
Forking command line: /bin/sh -c cd <https://builds.apache.org/job/HBase-0.94/ws/trunk> && /home/jenkins/tools/java/jdk1.6.0_27-32/jre/bin/java -enableassertions -Xmx1900m -Djava.security.egd=file:/dev/./urandom -jar <https://builds.apache.org/job/HBase-0.94/ws/trunk/target/surefire/surefirebooter4498592751059045749.jar> <https://builds.apache.org/job/HBase-0.94/ws/trunk/target/surefire/surefire4275089410540846525tmp> <https://builds.apache.org/job/HBase-0.94/ws/trunk/target/surefire/surefire_1142614043200850249633tmp>
Running org.apache.hadoop.hbase.master.TestSplitLogManager
Tests run: 12, Failures: 0, Errors: 0, Skipped: 0, Time elapsed: 14.46 sec
Forking command line: /bin/sh -c cd <https://builds.apache.org/job/HBase-0.94/ws/trunk> && /home/jenkins/tools/java/jdk1.6.0_27-32/jre/bin/java -enableassertions -Xmx1900m -Djava.security.egd=file:/dev/./urandom -jar <https://builds.apache.org/job/HBase-0.94/ws/trunk/target/surefire/surefirebooter5154390894967111369.jar> <https://builds.apache.org/job/HBase-0.94/ws/trunk/target/surefire/surefire3474403451100792764tmp> <https://builds.apache.org/job/HBase-0.94/ws/trunk/target/surefire/surefire_1154947391357803361120tmp>
Running org.apache.hadoop.hbase.master.TestMaster
Tests run: 1, Failures: 0, Errors: 0, Skipped: 0, Time elapsed: 16.233 sec
Running org.apache.hadoop.hbase.master.TestDeadServer
Tests run: 1, Failures: 0, Errors: 0, Skipped: 0, Time elapsed: 0.208 sec
Forking command line: /bin/sh -c cd <https://builds.apache.org/job/HBase-0.94/ws/trunk> && /home/jenkins/tools/java/jdk1.6.0_27-32/jre/bin/java -enableassertions -Xmx1900m -Djava.security.egd=file:/dev/./urandom -jar <https://builds.apache.org/job/HBase-0.94/ws/trunk/target/surefire/surefirebooter1743259232637554380.jar> <https://builds.apache.org/job/HBase-0.94/ws/trunk/target/surefire/surefire6951371383003362464tmp> <https://builds.apache.org/job/HBase-0.94/ws/trunk/target/surefire/surefire_1168414315972988016tmp>
Forking command line: /bin/sh -c cd <https://builds.apache.org/job/HBase-0.94/ws/trunk> && /home/jenkins/tools/java/jdk1.6.0_27-32/jre/bin/java -enableassertions -Xmx1900m -Djava.security.egd=file:/dev/./urandom -jar <https://builds.apache.org/job/HBase-0.94/ws/trunk/target/surefire/surefirebooter6768900099124317371.jar> <https://builds.apache.org/job/HBase-0.94/ws/trunk/target/surefire/surefire7749899982483550417tmp> <https://builds.apache.org/job/HBase-0.94/ws/trunk/target/surefire/surefire_11745461412780948111tmp>
Running org.apache.hadoop.hbase.master.TestLogsCleaner
Tests run: 1, Failures: 0, Errors: 0, Skipped: 0, Time elapsed: 3.156 sec
Forking command line: /bin/sh -c cd <https://builds.apache.org/job/HBase-0.94/ws/trunk> && /home/jenkins/tools/java/jdk1.6.0_27-32/jre/bin/java -enableassertions -Xmx1900m -Djava.security.egd=file:/dev/./urandom -jar <https://builds.apache.org/job/HBase-0.94/ws/trunk/target/surefire/surefirebooter7392872780854356442.jar> <https://builds.apache.org/job/HBase-0.94/ws/trunk/target/surefire/surefire7057528011079037999tmp> <https://builds.apache.org/job/HBase-0.94/ws/trunk/target/surefire/surefire_1183828964242421778051tmp>
Running org.apache.hadoop.hbase.master.TestMasterZKSessionRecovery
Tests run: 2, Failures: 0, Errors: 0, Skipped: 0, Time elapsed: 17.915 sec
Running org.apache.hadoop.hbase.master.TestZKBasedOpenCloseRegion
Tests run: 3, Failures: 0, Errors: 0, Skipped: 0, Time elapsed: 18.463 sec

Results :

Tests in error: 
  testCacheBlocks[1](org.apache.hadoop.hbase.io.hfile.TestForceCacheImportantBlocks): region: myTable,,1333654141916.0baa0b75c34b57c30286616819fc15a9.

Tests run: 616, Failures: 0, Errors: 1, Skipped: 2

[INFO] ------------------------------------------------------------------------
[INFO] BUILD FAILURE
[INFO] ------------------------------------------------------------------------
[INFO] Total time: 25:16.767s
[INFO] Finished at: Thu Apr 05 19:43:58 UTC 2012
[INFO] Final Memory: 43M/482M
[INFO] ------------------------------------------------------------------------
[ERROR] Failed to execute goal org.apache.maven.plugins:maven-surefire-plugin:2.12-TRUNK-HBASE-2:test (secondPartTestsExecution) on project hbase: There are test failures.
[ERROR] 
[ERROR] Please refer to <https://builds.apache.org/job/HBase-0.94/ws/trunk/target/surefire-reports> for the individual test results.
[ERROR] -> [Help 1]
org.apache.maven.lifecycle.LifecycleExecutionException: Failed to execute goal org.apache.maven.plugins:maven-surefire-plugin:2.12-TRUNK-HBASE-2:test (secondPartTestsExecution) on project hbase: There are test failures.

Please refer to <https://builds.apache.org/job/HBase-0.94/ws/trunk/target/surefire-reports> for the individual test results.
	at org.apache.maven.lifecycle.internal.MojoExecutor.execute(MojoExecutor.java:213)
	at org.apache.maven.lifecycle.internal.MojoExecutor.execute(MojoExecutor.java:153)
	at org.apache.maven.lifecycle.internal.MojoExecutor.execute(MojoExecutor.java:145)
	at org.apache.maven.lifecycle.internal.LifecycleModuleBuilder.buildProject(LifecycleModuleBuilder.java:84)
	at org.apache.maven.lifecycle.internal.LifecycleModuleBuilder.buildProject(LifecycleModuleBuilder.java:59)
	at org.apache.maven.lifecycle.internal.LifecycleStarter.singleThreadedBuild(LifecycleStarter.java:183)
	at org.apache.maven.lifecycle.internal.LifecycleStarter.execute(LifecycleStarter.java:161)
	at org.apache.maven.DefaultMaven.doExecute(DefaultMaven.java:319)
	at org.apache.maven.DefaultMaven.execute(DefaultMaven.java:156)
	at org.apache.maven.cli.MavenCli.execute(MavenCli.java:537)
	at org.apache.maven.cli.MavenCli.doMain(MavenCli.java:196)
	at org.apache.maven.cli.MavenCli.main(MavenCli.java:141)
	at sun.reflect.NativeMethodAccessorImpl.invoke0(Native Method)
	at sun.reflect.NativeMethodAccessorImpl.invoke(NativeMethodAccessorImpl.java:39)
	at sun.reflect.DelegatingMethodAccessorImpl.invoke(DelegatingMethodAccessorImpl.java:25)
	at java.lang.reflect.Method.invoke(Method.java:597)
	at org.codehaus.plexus.classworlds.launcher.Launcher.launchEnhanced(Launcher.java:290)
	at org.codehaus.plexus.classworlds.launcher.Launcher.launch(Launcher.java:230)
	at org.codehaus.plexus.classworlds.launcher.Launcher.mainWithExitCode(Launcher.java:409)
	at org.codehaus.plexus.classworlds.launcher.Launcher.main(Launcher.java:352)
Caused by: org.apache.maven.plugin.MojoFailureException: There are test failures.

Please refer to <https://builds.apache.org/job/HBase-0.94/ws/trunk/target/surefire-reports> for the individual test results.
	at org.apache.maven.plugin.surefire.SurefireHelper.reportExecution(SurefireHelper.java:87)
	at org.apache.maven.plugin.surefire.SurefirePlugin.writeSummary(SurefirePlugin.java:651)
	at org.apache.maven.plugin.surefire.SurefirePlugin.handleSummary(SurefirePlugin.java:625)
	at org.apache.maven.plugin.surefire.AbstractSurefireMojo.executeAfterPreconditionsChecked(AbstractSurefireMojo.java:137)
	at org.apache.maven.plugin.surefire.AbstractSurefireMojo.execute(AbstractSurefireMojo.java:98)
	at org.apache.maven.plugin.DefaultBuildPluginManager.executeMojo(DefaultBuildPluginManager.java:101)
	at org.apache.maven.lifecycle.internal.MojoExecutor.execute(MojoExecutor.java:209)
	... 19 more
[ERROR] 
[ERROR] 
[ERROR] For more information about the errors and possible solutions, please read the following articles:
[ERROR] [Help 1] http://cwiki.apache.org/confluence/display/MAVEN/MojoFailureException
Build step 'Invoke top-level Maven targets' marked build as failure
Archiving artifacts
Recording test results
Updating HBASE-5715
Updating HBASE-4213

Jenkins build is back to normal : HBase-0.94 #91

Posted by Apache Jenkins Server <je...@builds.apache.org>.
See <https://builds.apache.org/job/HBase-0.94/91/changes>


Build failed in Jenkins: HBase-0.94 #90

Posted by Apache Jenkins Server <je...@builds.apache.org>.
See <https://builds.apache.org/job/HBase-0.94/90/changes>

Changes:

[stack] HBASE-5724 Row cache of KeyValue should be cleared in readFields().

[stack] HBASE-5711 Tests are failing with incorrect data directory permissions.

------------------------------------------
[...truncated 7273 lines...]
Forking command line: /bin/sh -c cd /x1/jenkins/jenkins-slave/workspace/HBase-0.94/trunk && /x1/jenkins/tools/java/jdk1.6.0_27-32/jre/bin/java -enableassertions -Xmx1900m -Djava.security.egd=file:/dev/./urandom -jar /x1/jenkins/jenkins-slave/workspace/HBase-0.94/trunk/target/surefire/surefirebooter5438892342266598193.jar /x1/jenkins/jenkins-slave/workspace/HBase-0.94/trunk/target/surefire/surefire7521769880574422763tmp /x1/jenkins/jenkins-slave/workspace/HBase-0.94/trunk/target/surefire/surefire_828050239894522841906tmp
Running org.apache.hadoop.hbase.rest.TestGzipFilter
Tests run: 1, Failures: 0, Errors: 1, Skipped: 0, Time elapsed: 1.502 sec <<< FAILURE!
Running org.apache.hadoop.hbase.rest.TestRowResource
Tests run: 1, Failures: 0, Errors: 1, Skipped: 0, Time elapsed: 1.501 sec <<< FAILURE!
Forking command line: /bin/sh -c cd /x1/jenkins/jenkins-slave/workspace/HBase-0.94/trunk && /x1/jenkins/tools/java/jdk1.6.0_27-32/jre/bin/java -enableassertions -Xmx1900m -Djava.security.egd=file:/dev/./urandom -jar /x1/jenkins/jenkins-slave/workspace/HBase-0.94/trunk/target/surefire/surefirebooter3462008154106844728.jar /x1/jenkins/jenkins-slave/workspace/HBase-0.94/trunk/target/surefire/surefire8195846692964455041tmp /x1/jenkins/jenkins-slave/workspace/HBase-0.94/trunk/target/surefire/surefire_838653092134435556343tmp
Forking command line: /bin/sh -c cd /x1/jenkins/jenkins-slave/workspace/HBase-0.94/trunk && /x1/jenkins/tools/java/jdk1.6.0_27-32/jre/bin/java -enableassertions -Xmx1900m -Djava.security.egd=file:/dev/./urandom -jar /x1/jenkins/jenkins-slave/workspace/HBase-0.94/trunk/target/surefire/surefirebooter7236388214332279763.jar /x1/jenkins/jenkins-slave/workspace/HBase-0.94/trunk/target/surefire/surefire4577644364930055786tmp /x1/jenkins/jenkins-slave/workspace/HBase-0.94/trunk/target/surefire/surefire_847846361961453593207tmp
Running org.apache.hadoop.hbase.rest.TestScannerResource
Tests run: 1, Failures: 0, Errors: 1, Skipped: 0, Time elapsed: 1.329 sec <<< FAILURE!
Running org.apache.hadoop.hbase.rest.TestVersionResource
Tests run: 1, Failures: 0, Errors: 1, Skipped: 0, Time elapsed: 1.563 sec <<< FAILURE!
Forking command line: /bin/sh -c cd /x1/jenkins/jenkins-slave/workspace/HBase-0.94/trunk && /x1/jenkins/tools/java/jdk1.6.0_27-32/jre/bin/java -enableassertions -Xmx1900m -Djava.security.egd=file:/dev/./urandom -jar /x1/jenkins/jenkins-slave/workspace/HBase-0.94/trunk/target/surefire/surefirebooter6166041353362551748.jar /x1/jenkins/jenkins-slave/workspace/HBase-0.94/trunk/target/surefire/surefire5835862698255315922tmp /x1/jenkins/jenkins-slave/workspace/HBase-0.94/trunk/target/surefire/surefire_851983424622604022634tmp
Forking command line: /bin/sh -c cd /x1/jenkins/jenkins-slave/workspace/HBase-0.94/trunk && /x1/jenkins/tools/java/jdk1.6.0_27-32/jre/bin/java -enableassertions -Xmx1900m -Djava.security.egd=file:/dev/./urandom -jar /x1/jenkins/jenkins-slave/workspace/HBase-0.94/trunk/target/surefire/surefirebooter4902091755585504598.jar /x1/jenkins/jenkins-slave/workspace/HBase-0.94/trunk/target/surefire/surefire1537046899841193939tmp /x1/jenkins/jenkins-slave/workspace/HBase-0.94/trunk/target/surefire/surefire_863986995048741315180tmp
Running org.apache.hadoop.hbase.rest.TestStatusResource
Tests run: 1, Failures: 0, Errors: 1, Skipped: 0, Time elapsed: 1.496 sec <<< FAILURE!
Running org.apache.hadoop.hbase.rest.TestScannersWithFilters
Tests run: 1, Failures: 0, Errors: 1, Skipped: 0, Time elapsed: 1.488 sec <<< FAILURE!
Forking command line: /bin/sh -c cd /x1/jenkins/jenkins-slave/workspace/HBase-0.94/trunk && /x1/jenkins/tools/java/jdk1.6.0_27-32/jre/bin/java -enableassertions -Xmx1900m -Djava.security.egd=file:/dev/./urandom -jar /x1/jenkins/jenkins-slave/workspace/HBase-0.94/trunk/target/surefire/surefirebooter500502608477468447.jar /x1/jenkins/jenkins-slave/workspace/HBase-0.94/trunk/target/surefire/surefire2346467979387767050tmp /x1/jenkins/jenkins-slave/workspace/HBase-0.94/trunk/target/surefire/surefire_878542819517783160276tmp
Forking command line: /bin/sh -c cd /x1/jenkins/jenkins-slave/workspace/HBase-0.94/trunk && /x1/jenkins/tools/java/jdk1.6.0_27-32/jre/bin/java -enableassertions -Xmx1900m -Djava.security.egd=file:/dev/./urandom -jar /x1/jenkins/jenkins-slave/workspace/HBase-0.94/trunk/target/surefire/surefirebooter8267963579540512847.jar /x1/jenkins/jenkins-slave/workspace/HBase-0.94/trunk/target/surefire/surefire8936378666838511152tmp /x1/jenkins/jenkins-slave/workspace/HBase-0.94/trunk/target/surefire/surefire_884986260537642878435tmp
Running org.apache.hadoop.hbase.metrics.TestMetricsMBeanBase
Tests run: 2, Failures: 0, Errors: 0, Skipped: 0, Time elapsed: 1.161 sec
Forking command line: /bin/sh -c cd /x1/jenkins/jenkins-slave/workspace/HBase-0.94/trunk && /x1/jenkins/tools/java/jdk1.6.0_27-32/jre/bin/java -enableassertions -Xmx1900m -Djava.security.egd=file:/dev/./urandom -jar /x1/jenkins/jenkins-slave/workspace/HBase-0.94/trunk/target/surefire/surefirebooter90898550265515790.jar /x1/jenkins/jenkins-slave/workspace/HBase-0.94/trunk/target/surefire/surefire4462696994051150259tmp /x1/jenkins/jenkins-slave/workspace/HBase-0.94/trunk/target/surefire/surefire_894073732694772248368tmp
Running org.apache.hadoop.hbase.io.hfile.TestHFileBlockIndex
Tests run: 10, Failures: 0, Errors: 0, Skipped: 0, Time elapsed: 7.088 sec
Running org.apache.hadoop.hbase.io.hfile.TestHFileSeek
Tests run: 1, Failures: 0, Errors: 0, Skipped: 0, Time elapsed: 6.207 sec
Forking command line: /bin/sh -c cd /x1/jenkins/jenkins-slave/workspace/HBase-0.94/trunk && /x1/jenkins/tools/java/jdk1.6.0_27-32/jre/bin/java -enableassertions -Xmx1900m -Djava.security.egd=file:/dev/./urandom -jar /x1/jenkins/jenkins-slave/workspace/HBase-0.94/trunk/target/surefire/surefirebooter7187985427680025867.jar /x1/jenkins/jenkins-slave/workspace/HBase-0.94/trunk/target/surefire/surefire5848547977156646121tmp /x1/jenkins/jenkins-slave/workspace/HBase-0.94/trunk/target/surefire/surefire_90729233751115962418tmp
Forking command line: /bin/sh -c cd /x1/jenkins/jenkins-slave/workspace/HBase-0.94/trunk && /x1/jenkins/tools/java/jdk1.6.0_27-32/jre/bin/java -enableassertions -Xmx1900m -Djava.security.egd=file:/dev/./urandom -jar /x1/jenkins/jenkins-slave/workspace/HBase-0.94/trunk/target/surefire/surefirebooter3007732743128859562.jar /x1/jenkins/jenkins-slave/workspace/HBase-0.94/trunk/target/surefire/surefire5576562184756988172tmp /x1/jenkins/jenkins-slave/workspace/HBase-0.94/trunk/target/surefire/surefire_912244322561779449637tmp
Running org.apache.hadoop.hbase.io.hfile.TestLruBlockCache
Tests run: 16, Failures: 0, Errors: 0, Skipped: 0, Time elapsed: 0.681 sec
Forking command line: /bin/sh -c cd /x1/jenkins/jenkins-slave/workspace/HBase-0.94/trunk && /x1/jenkins/tools/java/jdk1.6.0_27-32/jre/bin/java -enableassertions -Xmx1900m -Djava.security.egd=file:/dev/./urandom -jar /x1/jenkins/jenkins-slave/workspace/HBase-0.94/trunk/target/surefire/surefirebooter8845803455761607462.jar /x1/jenkins/jenkins-slave/workspace/HBase-0.94/trunk/target/surefire/surefire8167933554377937242tmp /x1/jenkins/jenkins-slave/workspace/HBase-0.94/trunk/target/surefire/surefire_92881638521323629876tmp
Running org.apache.hadoop.hbase.io.hfile.TestFixedFileTrailer
Tests run: 2, Failures: 0, Errors: 0, Skipped: 0, Time elapsed: 0.507 sec
Forking command line: /bin/sh -c cd /x1/jenkins/jenkins-slave/workspace/HBase-0.94/trunk && /x1/jenkins/tools/java/jdk1.6.0_27-32/jre/bin/java -enableassertions -Xmx1900m -Djava.security.egd=file:/dev/./urandom -jar /x1/jenkins/jenkins-slave/workspace/HBase-0.94/trunk/target/surefire/surefirebooter4747556113003208913.jar /x1/jenkins/jenkins-slave/workspace/HBase-0.94/trunk/target/surefire/surefire3916276443858626852tmp /x1/jenkins/jenkins-slave/workspace/HBase-0.94/trunk/target/surefire/surefire_936894013637481901465tmp
Running org.apache.hadoop.hbase.io.hfile.TestHFilePerformance
Tests run: 1, Failures: 0, Errors: 0, Skipped: 0, Time elapsed: 4.418 sec
Forking command line: /bin/sh -c cd /x1/jenkins/jenkins-slave/workspace/HBase-0.94/trunk && /x1/jenkins/tools/java/jdk1.6.0_27-32/jre/bin/java -enableassertions -Xmx1900m -Djava.security.egd=file:/dev/./urandom -jar /x1/jenkins/jenkins-slave/workspace/HBase-0.94/trunk/target/surefire/surefirebooter7177765550582823061.jar /x1/jenkins/jenkins-slave/workspace/HBase-0.94/trunk/target/surefire/surefire6923805914778831972tmp /x1/jenkins/jenkins-slave/workspace/HBase-0.94/trunk/target/surefire/surefire_945216694055462449587tmp
Running org.apache.hadoop.hbase.io.hfile.TestHFileBlockCompatibility
Tests run: 10, Failures: 0, Errors: 0, Skipped: 0, Time elapsed: 0.946 sec
Forking command line: /bin/sh -c cd /x1/jenkins/jenkins-slave/workspace/HBase-0.94/trunk && /x1/jenkins/tools/java/jdk1.6.0_27-32/jre/bin/java -enableassertions -Xmx1900m -Djava.security.egd=file:/dev/./urandom -jar /x1/jenkins/jenkins-slave/workspace/HBase-0.94/trunk/target/surefire/surefirebooter7713302700294043568.jar /x1/jenkins/jenkins-slave/workspace/HBase-0.94/trunk/target/surefire/surefire2861855150850769320tmp /x1/jenkins/jenkins-slave/workspace/HBase-0.94/trunk/target/surefire/surefire_953162905691348896296tmp
Running org.apache.hadoop.hbase.io.hfile.TestCacheOnWrite
Tests run: 36, Failures: 0, Errors: 0, Skipped: 0, Time elapsed: 24.301 sec
Forking command line: /bin/sh -c cd /x1/jenkins/jenkins-slave/workspace/HBase-0.94/trunk && /x1/jenkins/tools/java/jdk1.6.0_27-32/jre/bin/java -enableassertions -Xmx1900m -Djava.security.egd=file:/dev/./urandom -jar /x1/jenkins/jenkins-slave/workspace/HBase-0.94/trunk/target/surefire/surefirebooter2919336878538853703.jar /x1/jenkins/jenkins-slave/workspace/HBase-0.94/trunk/target/surefire/surefire7546940931093236554tmp /x1/jenkins/jenkins-slave/workspace/HBase-0.94/trunk/target/surefire/surefire_965188811125104947701tmp
Running org.apache.hadoop.hbase.io.hfile.TestChecksum
Tests run: 3, Failures: 0, Errors: 0, Skipped: 0, Time elapsed: 0.785 sec
Forking command line: /bin/sh -c cd /x1/jenkins/jenkins-slave/workspace/HBase-0.94/trunk && /x1/jenkins/tools/java/jdk1.6.0_27-32/jre/bin/java -enableassertions -Xmx1900m -Djava.security.egd=file:/dev/./urandom -jar /x1/jenkins/jenkins-slave/workspace/HBase-0.94/trunk/target/surefire/surefirebooter4606096614993358683.jar /x1/jenkins/jenkins-slave/workspace/HBase-0.94/trunk/target/surefire/surefire8506687007812087724tmp /x1/jenkins/jenkins-slave/workspace/HBase-0.94/trunk/target/surefire/surefire_976867447799105135875tmp
Running org.apache.hadoop.hbase.io.hfile.TestForceCacheImportantBlocks
Tests run: 4, Failures: 0, Errors: 0, Skipped: 0, Time elapsed: 35.16 sec
Forking command line: /bin/sh -c cd /x1/jenkins/jenkins-slave/workspace/HBase-0.94/trunk && /x1/jenkins/tools/java/jdk1.6.0_27-32/jre/bin/java -enableassertions -Xmx1900m -Djava.security.egd=file:/dev/./urandom -jar /x1/jenkins/jenkins-slave/workspace/HBase-0.94/trunk/target/surefire/surefirebooter4483566982051731393.jar /x1/jenkins/jenkins-slave/workspace/HBase-0.94/trunk/target/surefire/surefire2084537342518347474tmp /x1/jenkins/jenkins-slave/workspace/HBase-0.94/trunk/target/surefire/surefire_988550561834155631345tmp
Running org.apache.hadoop.hbase.io.hfile.slab.TestSlabCache
Tests run: 7, Failures: 0, Errors: 0, Skipped: 0, Time elapsed: 11.366 sec
Forking command line: /bin/sh -c cd /x1/jenkins/jenkins-slave/workspace/HBase-0.94/trunk && /x1/jenkins/tools/java/jdk1.6.0_27-32/jre/bin/java -enableassertions -Xmx1900m -Djava.security.egd=file:/dev/./urandom -jar /x1/jenkins/jenkins-slave/workspace/HBase-0.94/trunk/target/surefire/surefirebooter1172963274999433028.jar /x1/jenkins/jenkins-slave/workspace/HBase-0.94/trunk/target/surefire/surefire2503513974375318195tmp /x1/jenkins/jenkins-slave/workspace/HBase-0.94/trunk/target/surefire/surefire_992758381946148665853tmp
Running org.apache.hadoop.hbase.io.hfile.slab.TestSingleSizeCache
Tests run: 5, Failures: 0, Errors: 0, Skipped: 0, Time elapsed: 16.862 sec
Forking command line: /bin/sh -c cd /x1/jenkins/jenkins-slave/workspace/HBase-0.94/trunk && /x1/jenkins/tools/java/jdk1.6.0_27-32/jre/bin/java -enableassertions -Xmx1900m -Djava.security.egd=file:/dev/./urandom -jar /x1/jenkins/jenkins-slave/workspace/HBase-0.94/trunk/target/surefire/surefirebooter5227987691139555563.jar /x1/jenkins/jenkins-slave/workspace/HBase-0.94/trunk/target/surefire/surefire9068337994631551524tmp /x1/jenkins/jenkins-slave/workspace/HBase-0.94/trunk/target/surefire/surefire_1006464350774548405207tmp
Running org.apache.hadoop.hbase.io.encoding.TestLoadAndSwitchEncodeOnDisk
Tests run: 1, Failures: 0, Errors: 1, Skipped: 0, Time elapsed: 1.47 sec <<< FAILURE!
Forking command line: /bin/sh -c cd /x1/jenkins/jenkins-slave/workspace/HBase-0.94/trunk && /x1/jenkins/tools/java/jdk1.6.0_27-32/jre/bin/java -enableassertions -Xmx1900m -Djava.security.egd=file:/dev/./urandom -jar /x1/jenkins/jenkins-slave/workspace/HBase-0.94/trunk/target/surefire/surefirebooter3562265471915911654.jar /x1/jenkins/jenkins-slave/workspace/HBase-0.94/trunk/target/surefire/surefire8821711672696550592tmp /x1/jenkins/jenkins-slave/workspace/HBase-0.94/trunk/target/surefire/surefire_1018137615394340354882tmp
Running org.apache.hadoop.hbase.replication.TestReplicationZookeeper
Tests run: 1, Failures: 0, Errors: 0, Skipped: 0, Time elapsed: 0.649 sec
Forking command line: /bin/sh -c cd /x1/jenkins/jenkins-slave/workspace/HBase-0.94/trunk && /x1/jenkins/tools/java/jdk1.6.0_27-32/jre/bin/java -enableassertions -Xmx1900m -Djava.security.egd=file:/dev/./urandom -jar /x1/jenkins/jenkins-slave/workspace/HBase-0.94/trunk/target/surefire/surefirebooter334592604098020890.jar /x1/jenkins/jenkins-slave/workspace/HBase-0.94/trunk/target/surefire/surefire63528061247438807tmp /x1/jenkins/jenkins-slave/workspace/HBase-0.94/trunk/target/surefire/surefire_1022997600161354023135tmp
Running org.apache.hadoop.hbase.replication.regionserver.TestReplicationSink
Tests run: 1, Failures: 0, Errors: 1, Skipped: 0, Time elapsed: 1.838 sec <<< FAILURE!
Forking command line: /bin/sh -c cd /x1/jenkins/jenkins-slave/workspace/HBase-0.94/trunk && /x1/jenkins/tools/java/jdk1.6.0_27-32/jre/bin/java -enableassertions -Xmx1900m -Djava.security.egd=file:/dev/./urandom -jar /x1/jenkins/jenkins-slave/workspace/HBase-0.94/trunk/target/surefire/surefirebooter4526969605612521611.jar /x1/jenkins/jenkins-slave/workspace/HBase-0.94/trunk/target/surefire/surefire7210077628297162794tmp /x1/jenkins/jenkins-slave/workspace/HBase-0.94/trunk/target/surefire/surefire_1034303736636892960332tmp
Running org.apache.hadoop.hbase.replication.regionserver.TestReplicationSourceManager
Tests run: 1, Failures: 0, Errors: 0, Skipped: 0, Time elapsed: 1.057 sec
Forking command line: /bin/sh -c cd /x1/jenkins/jenkins-slave/workspace/HBase-0.94/trunk && /x1/jenkins/tools/java/jdk1.6.0_27-32/jre/bin/java -enableassertions -Xmx1900m -Djava.security.egd=file:/dev/./urandom -jar /x1/jenkins/jenkins-slave/workspace/HBase-0.94/trunk/target/surefire/surefirebooter7358072065671621673.jar /x1/jenkins/jenkins-slave/workspace/HBase-0.94/trunk/target/surefire/surefire7308938774869499970tmp /x1/jenkins/jenkins-slave/workspace/HBase-0.94/trunk/target/surefire/surefire_104600657549319140320tmp
Running org.apache.hadoop.hbase.replication.TestReplicationSource
Tests run: 1, Failures: 0, Errors: 1, Skipped: 0, Time elapsed: 1.721 sec <<< FAILURE!
Forking command line: /bin/sh -c cd /x1/jenkins/jenkins-slave/workspace/HBase-0.94/trunk && /x1/jenkins/tools/java/jdk1.6.0_27-32/jre/bin/java -enableassertions -Xmx1900m -Djava.security.egd=file:/dev/./urandom -jar /x1/jenkins/jenkins-slave/workspace/HBase-0.94/trunk/target/surefire/surefirebooter7465443390365213587.jar /x1/jenkins/jenkins-slave/workspace/HBase-0.94/trunk/target/surefire/surefire4331656115294371451tmp /x1/jenkins/jenkins-slave/workspace/HBase-0.94/trunk/target/surefire/surefire_1053328103123248039035tmp
Running org.apache.hadoop.hbase.io.hfile.TestHFileBlock
Tests run: 16, Failures: 0, Errors: 0, Skipped: 0, Time elapsed: 45.561 sec
Forking command line: /bin/sh -c cd /x1/jenkins/jenkins-slave/workspace/HBase-0.94/trunk && /x1/jenkins/tools/java/jdk1.6.0_27-32/jre/bin/java -enableassertions -Xmx1900m -Djava.security.egd=file:/dev/./urandom -jar /x1/jenkins/jenkins-slave/workspace/HBase-0.94/trunk/target/surefire/surefirebooter2829225125569284976.jar /x1/jenkins/jenkins-slave/workspace/HBase-0.94/trunk/target/surefire/surefire4965758149428459969tmp /x1/jenkins/jenkins-slave/workspace/HBase-0.94/trunk/target/surefire/surefire_1064732238161074273136tmp
Running org.apache.hadoop.hbase.util.TestFSTableDescriptors
Tests run: 10, Failures: 0, Errors: 0, Skipped: 0, Time elapsed: 0.784 sec
Forking command line: /bin/sh -c cd /x1/jenkins/jenkins-slave/workspace/HBase-0.94/trunk && /x1/jenkins/tools/java/jdk1.6.0_27-32/jre/bin/java -enableassertions -Xmx1900m -Djava.security.egd=file:/dev/./urandom -jar /x1/jenkins/jenkins-slave/workspace/HBase-0.94/trunk/target/surefire/surefirebooter4997566417005174656.jar /x1/jenkins/jenkins-slave/workspace/HBase-0.94/trunk/target/surefire/surefire4608276418687800450tmp /x1/jenkins/jenkins-slave/workspace/HBase-0.94/trunk/target/surefire/surefire_1075376702557572091801tmp
Running org.apache.hadoop.hbase.replication.TestReplicationPeer
Tests run: 1, Failures: 0, Errors: 0, Skipped: 0, Time elapsed: 7.579 sec
Forking command line: /bin/sh -c cd /x1/jenkins/jenkins-slave/workspace/HBase-0.94/trunk && /x1/jenkins/tools/java/jdk1.6.0_27-32/jre/bin/java -enableassertions -Xmx1900m -Djava.security.egd=file:/dev/./urandom -jar /x1/jenkins/jenkins-slave/workspace/HBase-0.94/trunk/target/surefire/surefirebooter4828042932099007872.jar /x1/jenkins/jenkins-slave/workspace/HBase-0.94/trunk/target/surefire/surefire7119588649634195451tmp /x1/jenkins/jenkins-slave/workspace/HBase-0.94/trunk/target/surefire/surefire_1086174507670277015140tmp
Running org.apache.hadoop.hbase.util.TestEnvironmentEdgeManager
Tests run: 2, Failures: 0, Errors: 0, Skipped: 0, Time elapsed: 0.426 sec
Forking command line: /bin/sh -c cd /x1/jenkins/jenkins-slave/workspace/HBase-0.94/trunk && /x1/jenkins/tools/java/jdk1.6.0_27-32/jre/bin/java -enableassertions -Xmx1900m -Djava.security.egd=file:/dev/./urandom -jar /x1/jenkins/jenkins-slave/workspace/HBase-0.94/trunk/target/surefire/surefirebooter1964214733712577462.jar /x1/jenkins/jenkins-slave/workspace/HBase-0.94/trunk/target/surefire/surefire1220756327094614036tmp /x1/jenkins/jenkins-slave/workspace/HBase-0.94/trunk/target/surefire/surefire_1093455879587269007170tmp
Running org.apache.hadoop.hbase.util.TestMergeTable
Tests run: 1, Failures: 0, Errors: 1, Skipped: 0, Time elapsed: 1.739 sec <<< FAILURE!
Forking command line: /bin/sh -c cd /x1/jenkins/jenkins-slave/workspace/HBase-0.94/trunk && /x1/jenkins/tools/java/jdk1.6.0_27-32/jre/bin/java -enableassertions -Xmx1900m -Djava.security.egd=file:/dev/./urandom -jar /x1/jenkins/jenkins-slave/workspace/HBase-0.94/trunk/target/surefire/surefirebooter1991636312127250690.jar /x1/jenkins/jenkins-slave/workspace/HBase-0.94/trunk/target/surefire/surefire5647701705596436394tmp /x1/jenkins/jenkins-slave/workspace/HBase-0.94/trunk/target/surefire/surefire_1102205780837327879923tmp
Running org.apache.hadoop.hbase.util.TestHBaseFsck
Tests run: 1, Failures: 0, Errors: 1, Skipped: 0, Time elapsed: 1.589 sec <<< FAILURE!
Forking command line: /bin/sh -c cd /x1/jenkins/jenkins-slave/workspace/HBase-0.94/trunk && /x1/jenkins/tools/java/jdk1.6.0_27-32/jre/bin/java -enableassertions -Xmx1900m -Djava.security.egd=file:/dev/./urandom -jar /x1/jenkins/jenkins-slave/workspace/HBase-0.94/trunk/target/surefire/surefirebooter4174519168432436967.jar /x1/jenkins/jenkins-slave/workspace/HBase-0.94/trunk/target/surefire/surefire5402689925526110791tmp /x1/jenkins/jenkins-slave/workspace/HBase-0.94/trunk/target/surefire/surefire_1115671791620953506665tmp
Running org.apache.hadoop.hbase.util.TestFSUtils
Tests run: 3, Failures: 0, Errors: 2, Skipped: 0, Time elapsed: 2.01 sec <<< FAILURE!
Forking command line: /bin/sh -c cd /x1/jenkins/jenkins-slave/workspace/HBase-0.94/trunk && /x1/jenkins/tools/java/jdk1.6.0_27-32/jre/bin/java -enableassertions -Xmx1900m -Djava.security.egd=file:/dev/./urandom -jar /x1/jenkins/jenkins-slave/workspace/HBase-0.94/trunk/target/surefire/surefirebooter2367225698672480296.jar /x1/jenkins/jenkins-slave/workspace/HBase-0.94/trunk/target/surefire/surefire3178209982095106028tmp /x1/jenkins/jenkins-slave/workspace/HBase-0.94/trunk/target/surefire/surefire_1127690729686163380715tmp
Running org.apache.hadoop.hbase.util.TestPoolMap$TestRoundRobinPoolType
Tests run: 3, Failures: 0, Errors: 0, Skipped: 0, Time elapsed: 0.01 sec
Running org.apache.hadoop.hbase.util.TestPoolMap$TestThreadLocalPoolType
Tests run: 3, Failures: 0, Errors: 0, Skipped: 0, Time elapsed: 0.009 sec
Running org.apache.hadoop.hbase.util.TestPoolMap$TestReusablePoolType
Tests run: 3, Failures: 0, Errors: 0, Skipped: 0, Time elapsed: 0.042 sec
Forking command line: /bin/sh -c cd /x1/jenkins/jenkins-slave/workspace/HBase-0.94/trunk && /x1/jenkins/tools/java/jdk1.6.0_27-32/jre/bin/java -enableassertions -Xmx1900m -Djava.security.egd=file:/dev/./urandom -jar /x1/jenkins/jenkins-slave/workspace/HBase-0.94/trunk/target/surefire/surefirebooter6297603159828171210.jar /x1/jenkins/jenkins-slave/workspace/HBase-0.94/trunk/target/surefire/surefire5250038299073638795tmp /x1/jenkins/jenkins-slave/workspace/HBase-0.94/trunk/target/surefire/surefire_1135033224379789532199tmp
Running org.apache.hadoop.hbase.util.TestRegionSplitter
Tests run: 1, Failures: 0, Errors: 1, Skipped: 0, Time elapsed: 1.464 sec <<< FAILURE!
Forking command line: /bin/sh -c cd /x1/jenkins/jenkins-slave/workspace/HBase-0.94/trunk && /x1/jenkins/tools/java/jdk1.6.0_27-32/jre/bin/java -enableassertions -Xmx1900m -Djava.security.egd=file:/dev/./urandom -jar /x1/jenkins/jenkins-slave/workspace/HBase-0.94/trunk/target/surefire/surefirebooter1500079493249851737.jar /x1/jenkins/jenkins-slave/workspace/HBase-0.94/trunk/target/surefire/surefire6261933200794302852tmp /x1/jenkins/jenkins-slave/workspace/HBase-0.94/trunk/target/surefire/surefire_1142254221454268281071tmp
Running org.apache.hadoop.hbase.util.hbck.TestOfflineMetaRebuildBase
Tests run: 1, Failures: 0, Errors: 1, Skipped: 0, Time elapsed: 1.672 sec <<< FAILURE!
Forking command line: /bin/sh -c cd /x1/jenkins/jenkins-slave/workspace/HBase-0.94/trunk && /x1/jenkins/tools/java/jdk1.6.0_27-32/jre/bin/java -enableassertions -Xmx1900m -Djava.security.egd=file:/dev/./urandom -jar /x1/jenkins/jenkins-slave/workspace/HBase-0.94/trunk/target/surefire/surefirebooter6191745643682194438.jar /x1/jenkins/jenkins-slave/workspace/HBase-0.94/trunk/target/surefire/surefire1599258742653479468tmp /x1/jenkins/jenkins-slave/workspace/HBase-0.94/trunk/target/surefire/surefire_1155412009354138417845tmp
Running org.apache.hadoop.hbase.util.TestIdLock
Tests run: 1, Failures: 0, Errors: 0, Skipped: 0, Time elapsed: 15.299 sec
Forking command line: /bin/sh -c cd /x1/jenkins/jenkins-slave/workspace/HBase-0.94/trunk && /x1/jenkins/tools/java/jdk1.6.0_27-32/jre/bin/java -enableassertions -Xmx1900m -Djava.security.egd=file:/dev/./urandom -jar /x1/jenkins/jenkins-slave/workspace/HBase-0.94/trunk/target/surefire/surefirebooter7493527764400809691.jar /x1/jenkins/jenkins-slave/workspace/HBase-0.94/trunk/target/surefire/surefire4311825389584001830tmp /x1/jenkins/jenkins-slave/workspace/HBase-0.94/trunk/target/surefire/surefire_1161601246326828619792tmp
Running org.apache.hadoop.hbase.util.hbck.TestOfflineMetaRebuildOverlap
Tests run: 1, Failures: 0, Errors: 1, Skipped: 0, Time elapsed: 1.585 sec <<< FAILURE!
Forking command line: /bin/sh -c cd /x1/jenkins/jenkins-slave/workspace/HBase-0.94/trunk && /x1/jenkins/tools/java/jdk1.6.0_27-32/jre/bin/java -enableassertions -Xmx1900m -Djava.security.egd=file:/dev/./urandom -jar /x1/jenkins/jenkins-slave/workspace/HBase-0.94/trunk/target/surefire/surefirebooter573200773973438879.jar /x1/jenkins/jenkins-slave/workspace/HBase-0.94/trunk/target/surefire/surefire1310753815913755101tmp /x1/jenkins/jenkins-slave/workspace/HBase-0.94/trunk/target/surefire/surefire_1174722810206103538836tmp
Running org.apache.hadoop.hbase.util.TestDefaultEnvironmentEdge
Tests run: 1, Failures: 0, Errors: 0, Skipped: 0, Time elapsed: 0.172 sec
Forking command line: /bin/sh -c cd /x1/jenkins/jenkins-slave/workspace/HBase-0.94/trunk && /x1/jenkins/tools/java/jdk1.6.0_27-32/jre/bin/java -enableassertions -Xmx1900m -Djava.security.egd=file:/dev/./urandom -jar /x1/jenkins/jenkins-slave/workspace/HBase-0.94/trunk/target/surefire/surefirebooter3768231106524606877.jar /x1/jenkins/jenkins-slave/workspace/HBase-0.94/trunk/target/surefire/surefire9013412234736705572tmp /x1/jenkins/jenkins-slave/workspace/HBase-0.94/trunk/target/surefire/surefire_1184336056300994133608tmp
Running org.apache.hadoop.hbase.util.hbck.TestOfflineMetaRebuildHole
Tests run: 1, Failures: 0, Errors: 1, Skipped: 0, Time elapsed: 1.627 sec <<< FAILURE!
Running org.apache.hadoop.hbase.TestInfoServers
Tests run: 1, Failures: 0, Errors: 1, Skipped: 0, Time elapsed: 1.372 sec <<< FAILURE!

Results :

Tests in error: 
  org.apache.hadoop.hbase.client.TestHTableUtil
  org.apache.hadoop.hbase.client.TestMultiParallel
  org.apache.hadoop.hbase.client.TestTimestampsFilter
  org.apache.hadoop.hbase.client.TestMetaMigrationRemovingHTD
  org.apache.hadoop.hbase.client.TestHCM
  org.apache.hadoop.hbase.client.TestMetaScanner
  org.apache.hadoop.hbase.thrift.TestThriftServer
  testGetAtomicity(org.apache.hadoop.hbase.TestAcidGuarantees)
  testScanAtomicity(org.apache.hadoop.hbase.TestAcidGuarantees)
  testMixedAtomicity(org.apache.hadoop.hbase.TestAcidGuarantees)
  org.apache.hadoop.hbase.avro.TestAvroServer
  org.apache.hadoop.hbase.filter.TestColumnRangeFilter
  org.apache.hadoop.hbase.zookeeper.TestZooKeeperACL
  org.apache.hadoop.hbase.TestMultiVersions
  org.apache.hadoop.hbase.coprocessor.TestRegionServerCoprocessorExceptionWithAbort
  org.apache.hadoop.hbase.coprocessor.TestCoprocessorEndpoint
  org.apache.hadoop.hbase.coprocessor.TestRegionObserverBypass
  org.apache.hadoop.hbase.coprocessor.TestMasterObserver
  org.apache.hadoop.hbase.coprocessor.TestMasterCoprocessorExceptionWithAbort
  org.apache.hadoop.hbase.coprocessor.TestClassLoading
  org.apache.hadoop.hbase.coprocessor.TestAggregateProtocol
  org.apache.hadoop.hbase.coprocessor.TestRegionServerCoprocessorExceptionWithRemove
  org.apache.hadoop.hbase.coprocessor.TestWALObserver
  org.apache.hadoop.hbase.coprocessor.TestMasterCoprocessorExceptionWithRemove
  org.apache.hadoop.hbase.coprocessor.TestRegionObserverInterface
  testMasterZKSessionRecoveryFailure(org.apache.hadoop.hbase.master.TestMasterZKSessionRecovery)
  testMasterZKSessionRecoverySuccess(org.apache.hadoop.hbase.master.TestMasterZKSessionRecovery)
  org.apache.hadoop.hbase.master.TestZKBasedOpenCloseRegion
  testOpenedRegionHandlerOnMasterRestart(org.apache.hadoop.hbase.master.TestOpenedRegionHandler)
  org.apache.hadoop.hbase.master.TestMaster
  org.apache.hadoop.hbase.TestDrainingServer
  org.apache.hadoop.hbase.thrift2.TestThriftHBaseServiceHandler
  org.apache.hadoop.hbase.catalog.TestMetaReaderEditor
  org.apache.hadoop.hbase.catalog.TestMetaReaderEditor
  org.apache.hadoop.hbase.mapreduce.TestImportExport
  testMROnTable(org.apache.hadoop.hbase.mapreduce.TestImportTsv)
  testMROnTableWithCustomMapper(org.apache.hadoop.hbase.mapreduce.TestImportTsv)
  testRSAbortWithUnflushedEdits(org.apache.hadoop.hbase.regionserver.wal.TestLogRollAbort)
  org.apache.hadoop.hbase.regionserver.wal.TestWALReplay
  org.apache.hadoop.hbase.regionserver.wal.TestWALReplayCompressed
  testMultipleRegions(org.apache.hadoop.hbase.regionserver.TestRegionServerMetrics)
  testFullSystemBubblesFSErrors(org.apache.hadoop.hbase.regionserver.TestFSErrorsExposed)
  org.apache.hadoop.hbase.regionserver.TestServerCustomProtocol
  org.apache.hadoop.hbase.regionserver.TestStoreFileBlockCacheSummary
  testgetHDFSBlocksDistribution(org.apache.hadoop.hbase.regionserver.TestHRegion)
  testGlobalMemStore(org.apache.hadoop.hbase.TestGlobalMemStoreSize)
  org.apache.hadoop.hbase.constraint.TestConstraint
  org.apache.hadoop.hbase.rest.TestSchemaResource
  org.apache.hadoop.hbase.rest.client.TestRemoteAdmin
  org.apache.hadoop.hbase.rest.client.TestRemoteTable
  org.apache.hadoop.hbase.rest.client.TestRemoteTable
  org.apache.hadoop.hbase.rest.TestTableResource
  org.apache.hadoop.hbase.rest.TestMultiRowResource
  org.apache.hadoop.hbase.rest.TestGzipFilter
  org.apache.hadoop.hbase.rest.TestRowResource
  org.apache.hadoop.hbase.rest.TestScannerResource
  org.apache.hadoop.hbase.rest.TestVersionResource
  org.apache.hadoop.hbase.rest.TestStatusResource
  org.apache.hadoop.hbase.rest.TestScannersWithFilters
  loadTest[0](org.apache.hadoop.hbase.io.encoding.TestLoadAndSwitchEncodeOnDisk)
  org.apache.hadoop.hbase.replication.regionserver.TestReplicationSink
  org.apache.hadoop.hbase.replication.TestReplicationSource
  testMergeTable(org.apache.hadoop.hbase.util.TestMergeTable)
  org.apache.hadoop.hbase.util.TestHBaseFsck
  testIsHDFS(org.apache.hadoop.hbase.util.TestFSUtils)
  testcomputeHDFSBlocksDistribution(org.apache.hadoop.hbase.util.TestFSUtils)
  org.apache.hadoop.hbase.util.TestRegionSplitter
  testMetaRebuild(org.apache.hadoop.hbase.util.hbck.TestOfflineMetaRebuildBase)
  testMetaRebuildOverlapFail(org.apache.hadoop.hbase.util.hbck.TestOfflineMetaRebuildOverlap)
  testMetaRebuildHoleFail(org.apache.hadoop.hbase.util.hbck.TestOfflineMetaRebuildHole)
  org.apache.hadoop.hbase.TestInfoServers

Tests run: 409, Failures: 0, Errors: 71, Skipped: 1

[INFO] ------------------------------------------------------------------------
[INFO] BUILD FAILURE
[INFO] ------------------------------------------------------------------------
[INFO] Total time: 7:20.558s
[INFO] Finished at: Thu Apr 05 21:46:06 UTC 2012
[INFO] Final Memory: 50M/1116M
[INFO] ------------------------------------------------------------------------
[ERROR] Failed to execute goal org.apache.maven.plugins:maven-surefire-plugin:2.12-TRUNK-HBASE-2:test (secondPartTestsExecution) on project hbase: There are test failures.
[ERROR] 
[ERROR] Please refer to /x1/jenkins/jenkins-slave/workspace/HBase-0.94/trunk/target/surefire-reports for the individual test results.
[ERROR] -> [Help 1]
org.apache.maven.lifecycle.LifecycleExecutionException: Failed to execute goal org.apache.maven.plugins:maven-surefire-plugin:2.12-TRUNK-HBASE-2:test (secondPartTestsExecution) on project hbase: There are test failures.

Please refer to /x1/jenkins/jenkins-slave/workspace/HBase-0.94/trunk/target/surefire-reports for the individual test results.
	at org.apache.maven.lifecycle.internal.MojoExecutor.execute(MojoExecutor.java:213)
	at org.apache.maven.lifecycle.internal.MojoExecutor.execute(MojoExecutor.java:153)
	at org.apache.maven.lifecycle.internal.MojoExecutor.execute(MojoExecutor.java:145)
	at org.apache.maven.lifecycle.internal.LifecycleModuleBuilder.buildProject(LifecycleModuleBuilder.java:84)
	at org.apache.maven.lifecycle.internal.LifecycleModuleBuilder.buildProject(LifecycleModuleBuilder.java:59)
	at org.apache.maven.lifecycle.internal.LifecycleStarter.singleThreadedBuild(LifecycleStarter.java:183)
	at org.apache.maven.lifecycle.internal.LifecycleStarter.execute(LifecycleStarter.java:161)
	at org.apache.maven.DefaultMaven.doExecute(DefaultMaven.java:319)
	at org.apache.maven.DefaultMaven.execute(DefaultMaven.java:156)
	at org.apache.maven.cli.MavenCli.execute(MavenCli.java:537)
	at org.apache.maven.cli.MavenCli.doMain(MavenCli.java:196)
	at org.apache.maven.cli.MavenCli.main(MavenCli.java:141)
	at sun.reflect.NativeMethodAccessorImpl.invoke0(Native Method)
	at sun.reflect.NativeMethodAccessorImpl.invoke(NativeMethodAccessorImpl.java:39)
	at sun.reflect.DelegatingMethodAccessorImpl.invoke(DelegatingMethodAccessorImpl.java:25)
	at java.lang.reflect.Method.invoke(Method.java:597)
	at org.codehaus.plexus.classworlds.launcher.Launcher.launchEnhanced(Launcher.java:290)
	at org.codehaus.plexus.classworlds.launcher.Launcher.launch(Launcher.java:230)
	at org.codehaus.plexus.classworlds.launcher.Launcher.mainWithExitCode(Launcher.java:409)
	at org.codehaus.plexus.classworlds.launcher.Launcher.main(Launcher.java:352)
Caused by: org.apache.maven.plugin.MojoFailureException: There are test failures.

Please refer to /x1/jenkins/jenkins-slave/workspace/HBase-0.94/trunk/target/surefire-reports for the individual test results.
	at org.apache.maven.plugin.surefire.SurefireHelper.reportExecution(SurefireHelper.java:87)
	at org.apache.maven.plugin.surefire.SurefirePlugin.writeSummary(SurefirePlugin.java:651)
	at org.apache.maven.plugin.surefire.SurefirePlugin.handleSummary(SurefirePlugin.java:625)
	at org.apache.maven.plugin.surefire.AbstractSurefireMojo.executeAfterPreconditionsChecked(AbstractSurefireMojo.java:137)
	at org.apache.maven.plugin.surefire.AbstractSurefireMojo.execute(AbstractSurefireMojo.java:98)
	at org.apache.maven.plugin.DefaultBuildPluginManager.executeMojo(DefaultBuildPluginManager.java:101)
	at org.apache.maven.lifecycle.internal.MojoExecutor.execute(MojoExecutor.java:209)
	... 19 more
[ERROR] 
[ERROR] 
[ERROR] For more information about the errors and possible solutions, please read the following articles:
[ERROR] [Help 1] http://cwiki.apache.org/confluence/display/MAVEN/MojoFailureException
Build step 'Invoke top-level Maven targets' marked build as failure
Archiving artifacts
Recording test results
Updating HBASE-5711
Updating HBASE-5724