You are viewing a plain text version of this content. The canonical link for it is here.
Posted to commits@flex.apache.org by fl...@gmail.com on 2013/09/18 14:33:08 UTC
Build failed in Jenkins: flex-sdk_mustella #318
See <http://localhost:8080/job/flex-sdk_mustella/318/>
------------------------------------------
[...truncated 1051 lines...]
assets-clean:
clean:
bundles-clean:
clean:
bundles-clean:
assets-clean:
clean:
bundles-clean:
clean:
bundles-clean:
clean:
clean:
clean:
bundles-clean:
pixelbender-clean:
clean:
clean:
clean:
clean:
clean:
bundles-clean:
clean:
bundles-clean:
clean:
clean:
bundles-clean:
clean:
bundles-clean:
clean:
bundles-clean:
clean:
bundles-clean:
clean:
clean:
clean:
[delete] Deleting directory <http://localhost:8080/job/flex-sdk_mustella/ws/frameworks/libs>
local-fonts-snapshot:
[touch] Creating <http://localhost:8080/job/flex-sdk_mustella/ws/frameworks/localFonts.ser>
[touch] Creating <http://localhost:8080/job/flex-sdk_mustella/ws/frameworks/macFonts.ser>
[touch] Creating <http://localhost:8080/job/flex-sdk_mustella/ws/frameworks/winFonts.ser>
thirdparty-downloads:
swfobject-check:
swfobject-download:
swfobject-fabridge-download:
osmf-check:
osmf-download:
ask-osmf:
download-osmf-zip:
[unzip] Expanding: <http://localhost:8080/job/flex-sdk_mustella/ws/in/OSMF_1.0.zip> into <http://localhost:8080/job/flex-sdk_mustella/ws/in>
[unzip] Expanding: <http://localhost:8080/job/flex-sdk_mustella/ws/in/osmf_source_v1-0.zip> into <http://localhost:8080/job/flex-sdk_mustella/ws/frameworks/libs>
blazeds-jar-check:
ask-blazeds:
get-blazeds-jar:
blazeds-jar:
font-jars-check:
ask-font:
get-font-jars:
font-jars:
clean-adobe-flex-sdk:
optional-downloads:
main:
[echo] Use thirdparty-clean or super-clean to remove these.
prepare:
playerglobal-setswfversion:
flex-config:
[copy] Copying 1 file to <http://localhost:8080/job/flex-sdk_mustella/ws/frameworks>
compile:
framework:
bundles-clean:
pixelbender-clean:
assets-clean:
clean:
assets-compile:
[mxmlc] Loading configuration file C:\jenkins_slave\workspace\flex-sdk_mustella\frameworks\flex-config.xml
[mxmlc] C:\jenkins_slave\workspace\flex-sdk_mustella\frameworks\projects\framework\assets\Assets.swf (9036 bytes)
pixelbender-compile:
pixelbender-unzip:
compile:
[echo] Compiling frameworks/libs/framework.swc
[compc] Loading configuration file C:\jenkins_slave\workspace\flex-sdk_mustella\frameworks\flex-config.xml
[compc] Loading configuration file C:\jenkins_slave\workspace\flex-sdk_mustella\frameworks\projects\framework\framework-config.xml
[compc] Loading configuration file C:\jenkins_slave\workspace\flex-sdk_mustella\frameworks\projects\framework\compile-config.xml
[compc] C:\jenkins_slave\workspace\flex-sdk_mustella\frameworks\libs\framework.swc (836278 bytes)
main:
[echo] Compiling frameworks/locale/en_US/framework_rb.swc
[compc] Loading configuration file C:\jenkins_slave\workspace\flex-sdk_mustella\frameworks\projects\framework\bundle-config.xml
[compc] C:\jenkins_slave\workspace\flex-sdk_mustella\frameworks\locale\en_US\framework_rb.swc (16518 bytes)
mx:
bundles-clean:
clean:
compile:
[echo] Compiling frameworks/libs/mx/mx.swc
[compc] Loading configuration file C:\jenkins_slave\workspace\flex-sdk_mustella\frameworks\projects\mx\compile-config.xml
[compc] C:\jenkins_slave\workspace\flex-sdk_mustella\frameworks\projects\mx\src\mx\containers\Accordion.as(2180): col: 22 Error: Incompatible override.
[compc]
[compc] private function removedFromStageHandler(event:Event):void
[compc] ^
[compc]
[compc] C:\jenkins_slave\workspace\flex-sdk_mustella\frameworks\projects\mx\src\mx\containers\Accordion.as(2180): col: 22 Error: Overriding a function that is not marked for override.
[compc]
[compc] private function removedFromStageHandler(event:Event):void
[compc] ^
[compc]
[compc] C:\jenkins_slave\workspace\flex-sdk_mustella\frameworks\projects\mx\src\mx\containers\Accordion.as(1110): col: 56 Error: Ambiguous reference to removedFromStageHandler.
[compc]
[compc] addEventListener(Event.REMOVED_FROM_STAGE, removedFromStageHandler, false, 0, true);
[compc] ^
[compc]
[compc] C:\jenkins_slave\workspace\flex-sdk_mustella\frameworks\projects\mx\src\mx\containers\ViewStack.as(1323): col: 22 Error: Incompatible override.
[compc]
[compc] private function removedFromStageHandler(event:Event):void
[compc] ^
[compc]
[compc] C:\jenkins_slave\workspace\flex-sdk_mustella\frameworks\projects\mx\src\mx\containers\ViewStack.as(1323): col: 22 Error: Overriding a function that is not marked for override.
[compc]
[compc] private function removedFromStageHandler(event:Event):void
[compc] ^
[compc]
[compc] C:\jenkins_slave\workspace\flex-sdk_mustella\frameworks\projects\mx\src\mx\containers\ViewStack.as(793): col: 56 Error: Ambiguous reference to removedFromStageHandler.
[compc]
[compc] addEventListener(Event.REMOVED_FROM_STAGE, removedFromStageHandler, false, 0, true);
[compc] ^
[compc]
[compc] C:\jenkins_slave\workspace\flex-sdk_mustella\frameworks\projects\mx\src\mx\controls\ComboBox.as(2261): col: 22 Error: Incompatible override.
[compc]
[compc] private function removedFromStageHandler(event:Event):void
[compc] ^
[compc]
[compc] C:\jenkins_slave\workspace\flex-sdk_mustella\frameworks\projects\mx\src\mx\controls\ComboBox.as(2261): col: 22 Error: Overriding a function that is not marked for override.
[compc]
[compc] private function removedFromStageHandler(event:Event):void
[compc] ^
[compc]
[compc] C:\jenkins_slave\workspace\flex-sdk_mustella\frameworks\projects\mx\src\mx\controls\ComboBox.as(668): col: 52 Error: Ambiguous reference to removedFromStageHandler.
[compc]
[compc] addEventListener(Event.REMOVED_FROM_STAGE, removedFromStageHandler);
[compc] ^
[compc]
[compc] C:\jenkins_slave\workspace\flex-sdk_mustella\frameworks\projects\mx\src\mx\controls\DateField.as(2740): col: 22 Error: Incompatible override.
[compc]
[compc] private function removedFromStageHandler(event:Event):void
[compc] ^
[compc]
[compc] C:\jenkins_slave\workspace\flex-sdk_mustella\frameworks\projects\mx\src\mx\controls\DateField.as(2740): col: 22 Error: Overriding a function that is not marked for override.
[compc]
[compc] private function removedFromStageHandler(event:Event):void
[compc] ^
[compc]
[compc] C:\jenkins_slave\workspace\flex-sdk_mustella\frameworks\projects\mx\src\mx\controls\DateField.as(715): col: 52 Error: Ambiguous reference to removedFromStageHandler.
[compc]
[compc] addEventListener(Event.REMOVED_FROM_STAGE, removedFromStageHandler);
[compc] ^
[compc]
[compc] C:\jenkins_slave\workspace\flex-sdk_mustella\frameworks\projects\mx\src\mx\controls\PopUpButton.as(1308): col: 22 Error: Incompatible override.
[compc]
[compc] private function removedFromStageHandler(event:Event):void
[compc] ^
[compc]
[compc] C:\jenkins_slave\workspace\flex-sdk_mustella\frameworks\projects\mx\src\mx\controls\PopUpButton.as(1308): col: 22 Error: Overriding a function that is not marked for override.
[compc]
[compc] private function removedFromStageHandler(event:Event):void
[compc] ^
[compc]
[compc] C:\jenkins_slave\workspace\flex-sdk_mustella\frameworks\projects\mx\src\mx\controls\PopUpButton.as(378): col: 52 Error: Ambiguous reference to removedFromStageHandler.
[compc]
[compc] addEventListener(Event.REMOVED_FROM_STAGE, removedFromStageHandler);
[compc] ^
[compc]
BUILD FAILED
<http://localhost:8080/job/flex-sdk_mustella/ws/build.xml>:416: The following error occurred while executing this line:
<http://localhost:8080/job/flex-sdk_mustella/ws/frameworks/build.xml>:113: The following error occurred while executing this line:
<http://localhost:8080/job/flex-sdk_mustella/ws/frameworks/build.xml>:386: The following error occurred while executing this line:
<http://localhost:8080/job/flex-sdk_mustella/ws/frameworks/projects/mx/build.xml>:182: compc task failed.
Total time: 1 minute 48 seconds
Build step 'Invoke Ant' marked build as failure
Jenkins build is back to normal : flex-sdk_mustella #339
Posted by fl...@gmail.com.
See <http://localhost:8080/job/flex-sdk_mustella/339/changes>
Build failed in Jenkins: flex-sdk_mustella #338
Posted by fl...@gmail.com.
See <http://localhost:8080/job/flex-sdk_mustella/338/>
------------------------------------------
[...truncated 1055 lines...]
assets-clean:
clean:
bundles-clean:
clean:
bundles-clean:
assets-clean:
clean:
bundles-clean:
clean:
bundles-clean:
clean:
clean:
clean:
bundles-clean:
pixelbender-clean:
clean:
clean:
clean:
clean:
clean:
bundles-clean:
clean:
bundles-clean:
clean:
clean:
bundles-clean:
clean:
bundles-clean:
clean:
bundles-clean:
clean:
bundles-clean:
clean:
clean:
clean:
[delete] Deleting directory <http://localhost:8080/job/flex-sdk_mustella/ws/frameworks/libs>
local-fonts-snapshot:
[touch] Creating <http://localhost:8080/job/flex-sdk_mustella/ws/frameworks/localFonts.ser>
[touch] Creating <http://localhost:8080/job/flex-sdk_mustella/ws/frameworks/macFonts.ser>
[touch] Creating <http://localhost:8080/job/flex-sdk_mustella/ws/frameworks/winFonts.ser>
thirdparty-downloads:
swfobject-check:
swfobject-download:
swfobject-fabridge-download:
osmf-check:
osmf-download:
ask-osmf:
download-osmf-zip:
[unzip] Expanding: <http://localhost:8080/job/flex-sdk_mustella/ws/in/OSMF_1.0.zip> into <http://localhost:8080/job/flex-sdk_mustella/ws/in>
[unzip] Expanding: <http://localhost:8080/job/flex-sdk_mustella/ws/in/osmf_source_v1-0.zip> into <http://localhost:8080/job/flex-sdk_mustella/ws/frameworks/libs>
blazeds-jar-check:
ask-blazeds:
get-blazeds-jar:
blazeds-jar:
font-jars-check:
ask-font:
get-font-jars:
font-jars:
clean-adobe-flex-sdk:
optional-downloads:
main:
[echo] Use thirdparty-clean or super-clean to remove these.
prepare:
playerglobal-setswfversion:
flex-config:
[copy] Copying 1 file to <http://localhost:8080/job/flex-sdk_mustella/ws/frameworks>
compile:
framework:
bundles-clean:
pixelbender-clean:
assets-clean:
clean:
assets-compile:
[mxmlc] Loading configuration file C:\jenkins_slave\workspace\flex-sdk_mustella\frameworks\flex-config.xml
[mxmlc] C:\jenkins_slave\workspace\flex-sdk_mustella\frameworks\projects\framework\assets\Assets.swf (9035 bytes)
pixelbender-compile:
pixelbender-unzip:
compile:
[echo] Compiling frameworks/libs/framework.swc
[compc] Loading configuration file C:\jenkins_slave\workspace\flex-sdk_mustella\frameworks\flex-config.xml
[compc] Loading configuration file C:\jenkins_slave\workspace\flex-sdk_mustella\frameworks\projects\framework\framework-config.xml
[compc] Loading configuration file C:\jenkins_slave\workspace\flex-sdk_mustella\frameworks\projects\framework\compile-config.xml
[compc] C:\jenkins_slave\workspace\flex-sdk_mustella\frameworks\libs\framework.swc (836285 bytes)
main:
[echo] Compiling frameworks/locale/en_US/framework_rb.swc
[compc] Loading configuration file C:\jenkins_slave\workspace\flex-sdk_mustella\frameworks\projects\framework\bundle-config.xml
[compc] C:\jenkins_slave\workspace\flex-sdk_mustella\frameworks\locale\en_US\framework_rb.swc (16517 bytes)
mx:
bundles-clean:
clean:
compile:
[echo] Compiling frameworks/libs/mx/mx.swc
[compc] Loading configuration file C:\jenkins_slave\workspace\flex-sdk_mustella\frameworks\projects\mx\compile-config.xml
[compc] C:\jenkins_slave\workspace\flex-sdk_mustella\frameworks\projects\mx\src\mx\containers\Accordion.as(2180): col: 22 Error: Incompatible override.
[compc]
[compc] private function removedFromStageHandler(event:Event):void
[compc] ^
[compc]
[compc] C:\jenkins_slave\workspace\flex-sdk_mustella\frameworks\projects\mx\src\mx\containers\Accordion.as(2180): col: 22 Error: Overriding a function that is not marked for override.
[compc]
[compc] private function removedFromStageHandler(event:Event):void
[compc] ^
[compc]
[compc] C:\jenkins_slave\workspace\flex-sdk_mustella\frameworks\projects\mx\src\mx\containers\Accordion.as(1110): col: 56 Error: Ambiguous reference to removedFromStageHandler.
[compc]
[compc] addEventListener(Event.REMOVED_FROM_STAGE, removedFromStageHandler, false, 0, true);
[compc] ^
[compc]
[compc] C:\jenkins_slave\workspace\flex-sdk_mustella\frameworks\projects\mx\src\mx\containers\ViewStack.as(1323): col: 22 Error: Incompatible override.
[compc]
[compc] private function removedFromStageHandler(event:Event):void
[compc] ^
[compc]
[compc] C:\jenkins_slave\workspace\flex-sdk_mustella\frameworks\projects\mx\src\mx\containers\ViewStack.as(1323): col: 22 Error: Overriding a function that is not marked for override.
[compc]
[compc] private function removedFromStageHandler(event:Event):void
[compc] ^
[compc]
[compc] C:\jenkins_slave\workspace\flex-sdk_mustella\frameworks\projects\mx\src\mx\containers\ViewStack.as(793): col: 56 Error: Ambiguous reference to removedFromStageHandler.
[compc]
[compc] addEventListener(Event.REMOVED_FROM_STAGE, removedFromStageHandler, false, 0, true);
[compc] ^
[compc]
[compc] C:\jenkins_slave\workspace\flex-sdk_mustella\frameworks\projects\mx\src\mx\controls\ComboBox.as(2261): col: 22 Error: Incompatible override.
[compc]
[compc] private function removedFromStageHandler(event:Event):void
[compc] ^
[compc]
[compc] C:\jenkins_slave\workspace\flex-sdk_mustella\frameworks\projects\mx\src\mx\controls\ComboBox.as(2261): col: 22 Error: Overriding a function that is not marked for override.
[compc]
[compc] private function removedFromStageHandler(event:Event):void
[compc] ^
[compc]
[compc] C:\jenkins_slave\workspace\flex-sdk_mustella\frameworks\projects\mx\src\mx\controls\ComboBox.as(668): col: 52 Error: Ambiguous reference to removedFromStageHandler.
[compc]
[compc] addEventListener(Event.REMOVED_FROM_STAGE, removedFromStageHandler);
[compc] ^
[compc]
[compc] C:\jenkins_slave\workspace\flex-sdk_mustella\frameworks\projects\mx\src\mx\controls\DateField.as(2740): col: 22 Error: Incompatible override.
[compc]
[compc] private function removedFromStageHandler(event:Event):void
[compc] ^
[compc]
[compc] C:\jenkins_slave\workspace\flex-sdk_mustella\frameworks\projects\mx\src\mx\controls\DateField.as(2740): col: 22 Error: Overriding a function that is not marked for override.
[compc]
[compc] private function removedFromStageHandler(event:Event):void
[compc] ^
[compc]
[compc] C:\jenkins_slave\workspace\flex-sdk_mustella\frameworks\projects\mx\src\mx\controls\DateField.as(715): col: 52 Error: Ambiguous reference to removedFromStageHandler.
[compc]
[compc] addEventListener(Event.REMOVED_FROM_STAGE, removedFromStageHandler);
[compc] ^
[compc]
[compc] C:\jenkins_slave\workspace\flex-sdk_mustella\frameworks\projects\mx\src\mx\controls\PopUpButton.as(1308): col: 22 Error: Incompatible override.
[compc]
[compc] private function removedFromStageHandler(event:Event):void
[compc] ^
[compc]
[compc] C:\jenkins_slave\workspace\flex-sdk_mustella\frameworks\projects\mx\src\mx\controls\PopUpButton.as(1308): col: 22 Error: Overriding a function that is not marked for override.
[compc]
[compc] private function removedFromStageHandler(event:Event):void
[compc] ^
[compc]
[compc] C:\jenkins_slave\workspace\flex-sdk_mustella\frameworks\projects\mx\src\mx\controls\PopUpButton.as(378): col: 52 Error: Ambiguous reference to removedFromStageHandler.
[compc]
[compc] addEventListener(Event.REMOVED_FROM_STAGE, removedFromStageHandler);
[compc] ^
[compc]
BUILD FAILED
<http://localhost:8080/job/flex-sdk_mustella/ws/build.xml>:416: The following error occurred while executing this line:
<http://localhost:8080/job/flex-sdk_mustella/ws/frameworks/build.xml>:113: The following error occurred while executing this line:
<http://localhost:8080/job/flex-sdk_mustella/ws/frameworks/build.xml>:386: The following error occurred while executing this line:
<http://localhost:8080/job/flex-sdk_mustella/ws/frameworks/projects/mx/build.xml>:182: compc task failed.
Total time: 1 minute 47 seconds
Build step 'Invoke Ant' marked build as failure
Build failed in Jenkins: flex-sdk_mustella #337
Posted by fl...@gmail.com.
See <http://localhost:8080/job/flex-sdk_mustella/337/>
------------------------------------------
[...truncated 1055 lines...]
assets-clean:
clean:
bundles-clean:
clean:
bundles-clean:
assets-clean:
clean:
bundles-clean:
clean:
bundles-clean:
clean:
clean:
clean:
bundles-clean:
pixelbender-clean:
clean:
clean:
clean:
clean:
clean:
bundles-clean:
clean:
bundles-clean:
clean:
clean:
bundles-clean:
clean:
bundles-clean:
clean:
bundles-clean:
clean:
bundles-clean:
clean:
clean:
clean:
[delete] Deleting directory <http://localhost:8080/job/flex-sdk_mustella/ws/frameworks/libs>
local-fonts-snapshot:
[touch] Creating <http://localhost:8080/job/flex-sdk_mustella/ws/frameworks/localFonts.ser>
[touch] Creating <http://localhost:8080/job/flex-sdk_mustella/ws/frameworks/macFonts.ser>
[touch] Creating <http://localhost:8080/job/flex-sdk_mustella/ws/frameworks/winFonts.ser>
thirdparty-downloads:
swfobject-check:
swfobject-download:
swfobject-fabridge-download:
osmf-check:
osmf-download:
ask-osmf:
download-osmf-zip:
[unzip] Expanding: <http://localhost:8080/job/flex-sdk_mustella/ws/in/OSMF_1.0.zip> into <http://localhost:8080/job/flex-sdk_mustella/ws/in>
[unzip] Expanding: <http://localhost:8080/job/flex-sdk_mustella/ws/in/osmf_source_v1-0.zip> into <http://localhost:8080/job/flex-sdk_mustella/ws/frameworks/libs>
blazeds-jar-check:
ask-blazeds:
get-blazeds-jar:
blazeds-jar:
font-jars-check:
ask-font:
get-font-jars:
font-jars:
clean-adobe-flex-sdk:
optional-downloads:
main:
[echo] Use thirdparty-clean or super-clean to remove these.
prepare:
playerglobal-setswfversion:
flex-config:
[copy] Copying 1 file to <http://localhost:8080/job/flex-sdk_mustella/ws/frameworks>
compile:
framework:
bundles-clean:
pixelbender-clean:
assets-clean:
clean:
assets-compile:
[mxmlc] Loading configuration file C:\jenkins_slave\workspace\flex-sdk_mustella\frameworks\flex-config.xml
[mxmlc] C:\jenkins_slave\workspace\flex-sdk_mustella\frameworks\projects\framework\assets\Assets.swf (9035 bytes)
pixelbender-compile:
pixelbender-unzip:
compile:
[echo] Compiling frameworks/libs/framework.swc
[compc] Loading configuration file C:\jenkins_slave\workspace\flex-sdk_mustella\frameworks\flex-config.xml
[compc] Loading configuration file C:\jenkins_slave\workspace\flex-sdk_mustella\frameworks\projects\framework\framework-config.xml
[compc] Loading configuration file C:\jenkins_slave\workspace\flex-sdk_mustella\frameworks\projects\framework\compile-config.xml
[compc] C:\jenkins_slave\workspace\flex-sdk_mustella\frameworks\libs\framework.swc (836270 bytes)
main:
[echo] Compiling frameworks/locale/en_US/framework_rb.swc
[compc] Loading configuration file C:\jenkins_slave\workspace\flex-sdk_mustella\frameworks\projects\framework\bundle-config.xml
[compc] C:\jenkins_slave\workspace\flex-sdk_mustella\frameworks\locale\en_US\framework_rb.swc (16519 bytes)
mx:
bundles-clean:
clean:
compile:
[echo] Compiling frameworks/libs/mx/mx.swc
[compc] Loading configuration file C:\jenkins_slave\workspace\flex-sdk_mustella\frameworks\projects\mx\compile-config.xml
[compc] C:\jenkins_slave\workspace\flex-sdk_mustella\frameworks\projects\mx\src\mx\containers\Accordion.as(2180): col: 22 Error: Incompatible override.
[compc]
[compc] private function removedFromStageHandler(event:Event):void
[compc] ^
[compc]
[compc] C:\jenkins_slave\workspace\flex-sdk_mustella\frameworks\projects\mx\src\mx\containers\Accordion.as(2180): col: 22 Error: Overriding a function that is not marked for override.
[compc]
[compc] private function removedFromStageHandler(event:Event):void
[compc] ^
[compc]
[compc] C:\jenkins_slave\workspace\flex-sdk_mustella\frameworks\projects\mx\src\mx\containers\Accordion.as(1110): col: 56 Error: Ambiguous reference to removedFromStageHandler.
[compc]
[compc] addEventListener(Event.REMOVED_FROM_STAGE, removedFromStageHandler, false, 0, true);
[compc] ^
[compc]
[compc] C:\jenkins_slave\workspace\flex-sdk_mustella\frameworks\projects\mx\src\mx\containers\ViewStack.as(1323): col: 22 Error: Incompatible override.
[compc]
[compc] private function removedFromStageHandler(event:Event):void
[compc] ^
[compc]
[compc] C:\jenkins_slave\workspace\flex-sdk_mustella\frameworks\projects\mx\src\mx\containers\ViewStack.as(1323): col: 22 Error: Overriding a function that is not marked for override.
[compc]
[compc] private function removedFromStageHandler(event:Event):void
[compc] ^
[compc]
[compc] C:\jenkins_slave\workspace\flex-sdk_mustella\frameworks\projects\mx\src\mx\containers\ViewStack.as(793): col: 56 Error: Ambiguous reference to removedFromStageHandler.
[compc]
[compc] addEventListener(Event.REMOVED_FROM_STAGE, removedFromStageHandler, false, 0, true);
[compc] ^
[compc]
[compc] C:\jenkins_slave\workspace\flex-sdk_mustella\frameworks\projects\mx\src\mx\controls\ComboBox.as(2261): col: 22 Error: Incompatible override.
[compc]
[compc] private function removedFromStageHandler(event:Event):void
[compc] ^
[compc]
[compc] C:\jenkins_slave\workspace\flex-sdk_mustella\frameworks\projects\mx\src\mx\controls\ComboBox.as(2261): col: 22 Error: Overriding a function that is not marked for override.
[compc]
[compc] private function removedFromStageHandler(event:Event):void
[compc] ^
[compc]
[compc] C:\jenkins_slave\workspace\flex-sdk_mustella\frameworks\projects\mx\src\mx\controls\ComboBox.as(668): col: 52 Error: Ambiguous reference to removedFromStageHandler.
[compc]
[compc] addEventListener(Event.REMOVED_FROM_STAGE, removedFromStageHandler);
[compc] ^
[compc]
[compc] C:\jenkins_slave\workspace\flex-sdk_mustella\frameworks\projects\mx\src\mx\controls\DateField.as(2740): col: 22 Error: Incompatible override.
[compc]
[compc] private function removedFromStageHandler(event:Event):void
[compc] ^
[compc]
[compc] C:\jenkins_slave\workspace\flex-sdk_mustella\frameworks\projects\mx\src\mx\controls\DateField.as(2740): col: 22 Error: Overriding a function that is not marked for override.
[compc]
[compc] private function removedFromStageHandler(event:Event):void
[compc] ^
[compc]
[compc] C:\jenkins_slave\workspace\flex-sdk_mustella\frameworks\projects\mx\src\mx\controls\DateField.as(715): col: 52 Error: Ambiguous reference to removedFromStageHandler.
[compc]
[compc] addEventListener(Event.REMOVED_FROM_STAGE, removedFromStageHandler);
[compc] ^
[compc]
[compc] C:\jenkins_slave\workspace\flex-sdk_mustella\frameworks\projects\mx\src\mx\controls\PopUpButton.as(1308): col: 22 Error: Incompatible override.
[compc]
[compc] private function removedFromStageHandler(event:Event):void
[compc] ^
[compc]
[compc] C:\jenkins_slave\workspace\flex-sdk_mustella\frameworks\projects\mx\src\mx\controls\PopUpButton.as(1308): col: 22 Error: Overriding a function that is not marked for override.
[compc]
[compc] private function removedFromStageHandler(event:Event):void
[compc] ^
[compc]
[compc] C:\jenkins_slave\workspace\flex-sdk_mustella\frameworks\projects\mx\src\mx\controls\PopUpButton.as(378): col: 52 Error: Ambiguous reference to removedFromStageHandler.
[compc]
[compc] addEventListener(Event.REMOVED_FROM_STAGE, removedFromStageHandler);
[compc] ^
[compc]
BUILD FAILED
<http://localhost:8080/job/flex-sdk_mustella/ws/build.xml>:416: The following error occurred while executing this line:
<http://localhost:8080/job/flex-sdk_mustella/ws/frameworks/build.xml>:113: The following error occurred while executing this line:
<http://localhost:8080/job/flex-sdk_mustella/ws/frameworks/build.xml>:386: The following error occurred while executing this line:
<http://localhost:8080/job/flex-sdk_mustella/ws/frameworks/projects/mx/build.xml>:182: compc task failed.
Total time: 1 minute 47 seconds
Build step 'Invoke Ant' marked build as failure
Build failed in Jenkins: flex-sdk_mustella #336
Posted by fl...@gmail.com.
See <http://localhost:8080/job/flex-sdk_mustella/336/>
------------------------------------------
[...truncated 1055 lines...]
assets-clean:
clean:
bundles-clean:
clean:
bundles-clean:
assets-clean:
clean:
bundles-clean:
clean:
bundles-clean:
clean:
clean:
clean:
bundles-clean:
pixelbender-clean:
clean:
clean:
clean:
clean:
clean:
bundles-clean:
clean:
bundles-clean:
clean:
clean:
bundles-clean:
clean:
bundles-clean:
clean:
bundles-clean:
clean:
bundles-clean:
clean:
clean:
clean:
[delete] Deleting directory <http://localhost:8080/job/flex-sdk_mustella/ws/frameworks/libs>
local-fonts-snapshot:
[touch] Creating <http://localhost:8080/job/flex-sdk_mustella/ws/frameworks/localFonts.ser>
[touch] Creating <http://localhost:8080/job/flex-sdk_mustella/ws/frameworks/macFonts.ser>
[touch] Creating <http://localhost:8080/job/flex-sdk_mustella/ws/frameworks/winFonts.ser>
thirdparty-downloads:
swfobject-check:
swfobject-download:
swfobject-fabridge-download:
osmf-check:
osmf-download:
ask-osmf:
download-osmf-zip:
[unzip] Expanding: <http://localhost:8080/job/flex-sdk_mustella/ws/in/OSMF_1.0.zip> into <http://localhost:8080/job/flex-sdk_mustella/ws/in>
[unzip] Expanding: <http://localhost:8080/job/flex-sdk_mustella/ws/in/osmf_source_v1-0.zip> into <http://localhost:8080/job/flex-sdk_mustella/ws/frameworks/libs>
blazeds-jar-check:
ask-blazeds:
get-blazeds-jar:
blazeds-jar:
font-jars-check:
ask-font:
get-font-jars:
font-jars:
clean-adobe-flex-sdk:
optional-downloads:
main:
[echo] Use thirdparty-clean or super-clean to remove these.
prepare:
playerglobal-setswfversion:
flex-config:
[copy] Copying 1 file to <http://localhost:8080/job/flex-sdk_mustella/ws/frameworks>
compile:
framework:
bundles-clean:
pixelbender-clean:
assets-clean:
clean:
assets-compile:
[mxmlc] Loading configuration file C:\jenkins_slave\workspace\flex-sdk_mustella\frameworks\flex-config.xml
[mxmlc] C:\jenkins_slave\workspace\flex-sdk_mustella\frameworks\projects\framework\assets\Assets.swf (9035 bytes)
pixelbender-compile:
pixelbender-unzip:
compile:
[echo] Compiling frameworks/libs/framework.swc
[compc] Loading configuration file C:\jenkins_slave\workspace\flex-sdk_mustella\frameworks\flex-config.xml
[compc] Loading configuration file C:\jenkins_slave\workspace\flex-sdk_mustella\frameworks\projects\framework\framework-config.xml
[compc] Loading configuration file C:\jenkins_slave\workspace\flex-sdk_mustella\frameworks\projects\framework\compile-config.xml
[compc] C:\jenkins_slave\workspace\flex-sdk_mustella\frameworks\libs\framework.swc (836277 bytes)
main:
[echo] Compiling frameworks/locale/en_US/framework_rb.swc
[compc] Loading configuration file C:\jenkins_slave\workspace\flex-sdk_mustella\frameworks\projects\framework\bundle-config.xml
[compc] C:\jenkins_slave\workspace\flex-sdk_mustella\frameworks\locale\en_US\framework_rb.swc (16518 bytes)
mx:
bundles-clean:
clean:
compile:
[echo] Compiling frameworks/libs/mx/mx.swc
[compc] Loading configuration file C:\jenkins_slave\workspace\flex-sdk_mustella\frameworks\projects\mx\compile-config.xml
[compc] C:\jenkins_slave\workspace\flex-sdk_mustella\frameworks\projects\mx\src\mx\containers\Accordion.as(2180): col: 22 Error: Incompatible override.
[compc]
[compc] private function removedFromStageHandler(event:Event):void
[compc] ^
[compc]
[compc] C:\jenkins_slave\workspace\flex-sdk_mustella\frameworks\projects\mx\src\mx\containers\Accordion.as(2180): col: 22 Error: Overriding a function that is not marked for override.
[compc]
[compc] private function removedFromStageHandler(event:Event):void
[compc] ^
[compc]
[compc] C:\jenkins_slave\workspace\flex-sdk_mustella\frameworks\projects\mx\src\mx\containers\Accordion.as(1110): col: 56 Error: Ambiguous reference to removedFromStageHandler.
[compc]
[compc] addEventListener(Event.REMOVED_FROM_STAGE, removedFromStageHandler, false, 0, true);
[compc] ^
[compc]
[compc] C:\jenkins_slave\workspace\flex-sdk_mustella\frameworks\projects\mx\src\mx\containers\ViewStack.as(1323): col: 22 Error: Incompatible override.
[compc]
[compc] private function removedFromStageHandler(event:Event):void
[compc] ^
[compc]
[compc] C:\jenkins_slave\workspace\flex-sdk_mustella\frameworks\projects\mx\src\mx\containers\ViewStack.as(1323): col: 22 Error: Overriding a function that is not marked for override.
[compc]
[compc] private function removedFromStageHandler(event:Event):void
[compc] ^
[compc]
[compc] C:\jenkins_slave\workspace\flex-sdk_mustella\frameworks\projects\mx\src\mx\containers\ViewStack.as(793): col: 56 Error: Ambiguous reference to removedFromStageHandler.
[compc]
[compc] addEventListener(Event.REMOVED_FROM_STAGE, removedFromStageHandler, false, 0, true);
[compc] ^
[compc]
[compc] C:\jenkins_slave\workspace\flex-sdk_mustella\frameworks\projects\mx\src\mx\controls\ComboBox.as(2261): col: 22 Error: Incompatible override.
[compc]
[compc] private function removedFromStageHandler(event:Event):void
[compc] ^
[compc]
[compc] C:\jenkins_slave\workspace\flex-sdk_mustella\frameworks\projects\mx\src\mx\controls\ComboBox.as(2261): col: 22 Error: Overriding a function that is not marked for override.
[compc]
[compc] private function removedFromStageHandler(event:Event):void
[compc] ^
[compc]
[compc] C:\jenkins_slave\workspace\flex-sdk_mustella\frameworks\projects\mx\src\mx\controls\ComboBox.as(668): col: 52 Error: Ambiguous reference to removedFromStageHandler.
[compc]
[compc] addEventListener(Event.REMOVED_FROM_STAGE, removedFromStageHandler);
[compc] ^
[compc]
[compc] C:\jenkins_slave\workspace\flex-sdk_mustella\frameworks\projects\mx\src\mx\controls\DateField.as(2740): col: 22 Error: Incompatible override.
[compc]
[compc] private function removedFromStageHandler(event:Event):void
[compc] ^
[compc]
[compc] C:\jenkins_slave\workspace\flex-sdk_mustella\frameworks\projects\mx\src\mx\controls\DateField.as(2740): col: 22 Error: Overriding a function that is not marked for override.
[compc]
[compc] private function removedFromStageHandler(event:Event):void
[compc] ^
[compc]
[compc] C:\jenkins_slave\workspace\flex-sdk_mustella\frameworks\projects\mx\src\mx\controls\DateField.as(715): col: 52 Error: Ambiguous reference to removedFromStageHandler.
[compc]
[compc] addEventListener(Event.REMOVED_FROM_STAGE, removedFromStageHandler);
[compc] ^
[compc]
[compc] C:\jenkins_slave\workspace\flex-sdk_mustella\frameworks\projects\mx\src\mx\controls\PopUpButton.as(1308): col: 22 Error: Incompatible override.
[compc]
[compc] private function removedFromStageHandler(event:Event):void
[compc] ^
[compc]
[compc] C:\jenkins_slave\workspace\flex-sdk_mustella\frameworks\projects\mx\src\mx\controls\PopUpButton.as(1308): col: 22 Error: Overriding a function that is not marked for override.
[compc]
[compc] private function removedFromStageHandler(event:Event):void
[compc] ^
[compc]
[compc] C:\jenkins_slave\workspace\flex-sdk_mustella\frameworks\projects\mx\src\mx\controls\PopUpButton.as(378): col: 52 Error: Ambiguous reference to removedFromStageHandler.
[compc]
[compc] addEventListener(Event.REMOVED_FROM_STAGE, removedFromStageHandler);
[compc] ^
[compc]
BUILD FAILED
<http://localhost:8080/job/flex-sdk_mustella/ws/build.xml>:416: The following error occurred while executing this line:
<http://localhost:8080/job/flex-sdk_mustella/ws/frameworks/build.xml>:113: The following error occurred while executing this line:
<http://localhost:8080/job/flex-sdk_mustella/ws/frameworks/build.xml>:386: The following error occurred while executing this line:
<http://localhost:8080/job/flex-sdk_mustella/ws/frameworks/projects/mx/build.xml>:182: compc task failed.
Total time: 1 minute 48 seconds
Build step 'Invoke Ant' marked build as failure
Build failed in Jenkins: flex-sdk_mustella #335
Posted by fl...@gmail.com.
See <http://localhost:8080/job/flex-sdk_mustella/335/>
------------------------------------------
[...truncated 1055 lines...]
assets-clean:
clean:
bundles-clean:
clean:
bundles-clean:
assets-clean:
clean:
bundles-clean:
clean:
bundles-clean:
clean:
clean:
clean:
bundles-clean:
pixelbender-clean:
clean:
clean:
clean:
clean:
clean:
bundles-clean:
clean:
bundles-clean:
clean:
clean:
bundles-clean:
clean:
bundles-clean:
clean:
bundles-clean:
clean:
bundles-clean:
clean:
clean:
clean:
[delete] Deleting directory <http://localhost:8080/job/flex-sdk_mustella/ws/frameworks/libs>
local-fonts-snapshot:
[touch] Creating <http://localhost:8080/job/flex-sdk_mustella/ws/frameworks/localFonts.ser>
[touch] Creating <http://localhost:8080/job/flex-sdk_mustella/ws/frameworks/macFonts.ser>
[touch] Creating <http://localhost:8080/job/flex-sdk_mustella/ws/frameworks/winFonts.ser>
thirdparty-downloads:
swfobject-check:
swfobject-download:
swfobject-fabridge-download:
osmf-check:
osmf-download:
ask-osmf:
download-osmf-zip:
[unzip] Expanding: <http://localhost:8080/job/flex-sdk_mustella/ws/in/OSMF_1.0.zip> into <http://localhost:8080/job/flex-sdk_mustella/ws/in>
[unzip] Expanding: <http://localhost:8080/job/flex-sdk_mustella/ws/in/osmf_source_v1-0.zip> into <http://localhost:8080/job/flex-sdk_mustella/ws/frameworks/libs>
blazeds-jar-check:
ask-blazeds:
get-blazeds-jar:
blazeds-jar:
font-jars-check:
ask-font:
get-font-jars:
font-jars:
clean-adobe-flex-sdk:
optional-downloads:
main:
[echo] Use thirdparty-clean or super-clean to remove these.
prepare:
playerglobal-setswfversion:
flex-config:
[copy] Copying 1 file to <http://localhost:8080/job/flex-sdk_mustella/ws/frameworks>
compile:
framework:
bundles-clean:
pixelbender-clean:
assets-clean:
clean:
assets-compile:
[mxmlc] Loading configuration file C:\jenkins_slave\workspace\flex-sdk_mustella\frameworks\flex-config.xml
[mxmlc] C:\jenkins_slave\workspace\flex-sdk_mustella\frameworks\projects\framework\assets\Assets.swf (9035 bytes)
pixelbender-compile:
pixelbender-unzip:
compile:
[echo] Compiling frameworks/libs/framework.swc
[compc] Loading configuration file C:\jenkins_slave\workspace\flex-sdk_mustella\frameworks\flex-config.xml
[compc] Loading configuration file C:\jenkins_slave\workspace\flex-sdk_mustella\frameworks\projects\framework\framework-config.xml
[compc] Loading configuration file C:\jenkins_slave\workspace\flex-sdk_mustella\frameworks\projects\framework\compile-config.xml
[compc] C:\jenkins_slave\workspace\flex-sdk_mustella\frameworks\libs\framework.swc (836304 bytes)
main:
[echo] Compiling frameworks/locale/en_US/framework_rb.swc
[compc] Loading configuration file C:\jenkins_slave\workspace\flex-sdk_mustella\frameworks\projects\framework\bundle-config.xml
[compc] C:\jenkins_slave\workspace\flex-sdk_mustella\frameworks\locale\en_US\framework_rb.swc (16519 bytes)
mx:
bundles-clean:
clean:
compile:
[echo] Compiling frameworks/libs/mx/mx.swc
[compc] Loading configuration file C:\jenkins_slave\workspace\flex-sdk_mustella\frameworks\projects\mx\compile-config.xml
[compc] C:\jenkins_slave\workspace\flex-sdk_mustella\frameworks\projects\mx\src\mx\containers\Accordion.as(2180): col: 22 Error: Incompatible override.
[compc]
[compc] private function removedFromStageHandler(event:Event):void
[compc] ^
[compc]
[compc] C:\jenkins_slave\workspace\flex-sdk_mustella\frameworks\projects\mx\src\mx\containers\Accordion.as(2180): col: 22 Error: Overriding a function that is not marked for override.
[compc]
[compc] private function removedFromStageHandler(event:Event):void
[compc] ^
[compc]
[compc] C:\jenkins_slave\workspace\flex-sdk_mustella\frameworks\projects\mx\src\mx\containers\Accordion.as(1110): col: 56 Error: Ambiguous reference to removedFromStageHandler.
[compc]
[compc] addEventListener(Event.REMOVED_FROM_STAGE, removedFromStageHandler, false, 0, true);
[compc] ^
[compc]
[compc] C:\jenkins_slave\workspace\flex-sdk_mustella\frameworks\projects\mx\src\mx\containers\ViewStack.as(1323): col: 22 Error: Incompatible override.
[compc]
[compc] private function removedFromStageHandler(event:Event):void
[compc] ^
[compc]
[compc] C:\jenkins_slave\workspace\flex-sdk_mustella\frameworks\projects\mx\src\mx\containers\ViewStack.as(1323): col: 22 Error: Overriding a function that is not marked for override.
[compc]
[compc] private function removedFromStageHandler(event:Event):void
[compc] ^
[compc]
[compc] C:\jenkins_slave\workspace\flex-sdk_mustella\frameworks\projects\mx\src\mx\containers\ViewStack.as(793): col: 56 Error: Ambiguous reference to removedFromStageHandler.
[compc]
[compc] addEventListener(Event.REMOVED_FROM_STAGE, removedFromStageHandler, false, 0, true);
[compc] ^
[compc]
[compc] C:\jenkins_slave\workspace\flex-sdk_mustella\frameworks\projects\mx\src\mx\controls\ComboBox.as(2261): col: 22 Error: Incompatible override.
[compc]
[compc] private function removedFromStageHandler(event:Event):void
[compc] ^
[compc]
[compc] C:\jenkins_slave\workspace\flex-sdk_mustella\frameworks\projects\mx\src\mx\controls\ComboBox.as(2261): col: 22 Error: Overriding a function that is not marked for override.
[compc]
[compc] private function removedFromStageHandler(event:Event):void
[compc] ^
[compc]
[compc] C:\jenkins_slave\workspace\flex-sdk_mustella\frameworks\projects\mx\src\mx\controls\ComboBox.as(668): col: 52 Error: Ambiguous reference to removedFromStageHandler.
[compc]
[compc] addEventListener(Event.REMOVED_FROM_STAGE, removedFromStageHandler);
[compc] ^
[compc]
[compc] C:\jenkins_slave\workspace\flex-sdk_mustella\frameworks\projects\mx\src\mx\controls\DateField.as(2740): col: 22 Error: Incompatible override.
[compc]
[compc] private function removedFromStageHandler(event:Event):void
[compc] ^
[compc]
[compc] C:\jenkins_slave\workspace\flex-sdk_mustella\frameworks\projects\mx\src\mx\controls\DateField.as(2740): col: 22 Error: Overriding a function that is not marked for override.
[compc]
[compc] private function removedFromStageHandler(event:Event):void
[compc] ^
[compc]
[compc] C:\jenkins_slave\workspace\flex-sdk_mustella\frameworks\projects\mx\src\mx\controls\DateField.as(715): col: 52 Error: Ambiguous reference to removedFromStageHandler.
[compc]
[compc] addEventListener(Event.REMOVED_FROM_STAGE, removedFromStageHandler);
[compc] ^
[compc]
[compc] C:\jenkins_slave\workspace\flex-sdk_mustella\frameworks\projects\mx\src\mx\controls\PopUpButton.as(1308): col: 22 Error: Incompatible override.
[compc]
[compc] private function removedFromStageHandler(event:Event):void
[compc] ^
[compc]
[compc] C:\jenkins_slave\workspace\flex-sdk_mustella\frameworks\projects\mx\src\mx\controls\PopUpButton.as(1308): col: 22 Error: Overriding a function that is not marked for override.
[compc]
[compc] private function removedFromStageHandler(event:Event):void
[compc] ^
[compc]
[compc] C:\jenkins_slave\workspace\flex-sdk_mustella\frameworks\projects\mx\src\mx\controls\PopUpButton.as(378): col: 52 Error: Ambiguous reference to removedFromStageHandler.
[compc]
[compc] addEventListener(Event.REMOVED_FROM_STAGE, removedFromStageHandler);
[compc] ^
[compc]
BUILD FAILED
<http://localhost:8080/job/flex-sdk_mustella/ws/build.xml>:416: The following error occurred while executing this line:
<http://localhost:8080/job/flex-sdk_mustella/ws/frameworks/build.xml>:113: The following error occurred while executing this line:
<http://localhost:8080/job/flex-sdk_mustella/ws/frameworks/build.xml>:386: The following error occurred while executing this line:
<http://localhost:8080/job/flex-sdk_mustella/ws/frameworks/projects/mx/build.xml>:182: compc task failed.
Total time: 1 minute 48 seconds
Build step 'Invoke Ant' marked build as failure
Build failed in Jenkins: flex-sdk_mustella #334
Posted by fl...@gmail.com.
See <http://localhost:8080/job/flex-sdk_mustella/334/>
------------------------------------------
[...truncated 1055 lines...]
assets-clean:
clean:
bundles-clean:
clean:
bundles-clean:
assets-clean:
clean:
bundles-clean:
clean:
bundles-clean:
clean:
clean:
clean:
bundles-clean:
pixelbender-clean:
clean:
clean:
clean:
clean:
clean:
bundles-clean:
clean:
bundles-clean:
clean:
clean:
bundles-clean:
clean:
bundles-clean:
clean:
bundles-clean:
clean:
bundles-clean:
clean:
clean:
clean:
[delete] Deleting directory <http://localhost:8080/job/flex-sdk_mustella/ws/frameworks/libs>
local-fonts-snapshot:
[touch] Creating <http://localhost:8080/job/flex-sdk_mustella/ws/frameworks/localFonts.ser>
[touch] Creating <http://localhost:8080/job/flex-sdk_mustella/ws/frameworks/macFonts.ser>
[touch] Creating <http://localhost:8080/job/flex-sdk_mustella/ws/frameworks/winFonts.ser>
thirdparty-downloads:
swfobject-check:
swfobject-download:
swfobject-fabridge-download:
osmf-check:
osmf-download:
ask-osmf:
download-osmf-zip:
[unzip] Expanding: <http://localhost:8080/job/flex-sdk_mustella/ws/in/OSMF_1.0.zip> into <http://localhost:8080/job/flex-sdk_mustella/ws/in>
[unzip] Expanding: <http://localhost:8080/job/flex-sdk_mustella/ws/in/osmf_source_v1-0.zip> into <http://localhost:8080/job/flex-sdk_mustella/ws/frameworks/libs>
blazeds-jar-check:
ask-blazeds:
get-blazeds-jar:
blazeds-jar:
font-jars-check:
ask-font:
get-font-jars:
font-jars:
clean-adobe-flex-sdk:
optional-downloads:
main:
[echo] Use thirdparty-clean or super-clean to remove these.
prepare:
playerglobal-setswfversion:
flex-config:
[copy] Copying 1 file to <http://localhost:8080/job/flex-sdk_mustella/ws/frameworks>
compile:
framework:
bundles-clean:
pixelbender-clean:
assets-clean:
clean:
assets-compile:
[mxmlc] Loading configuration file C:\jenkins_slave\workspace\flex-sdk_mustella\frameworks\flex-config.xml
[mxmlc] C:\jenkins_slave\workspace\flex-sdk_mustella\frameworks\projects\framework\assets\Assets.swf (9035 bytes)
pixelbender-compile:
pixelbender-unzip:
compile:
[echo] Compiling frameworks/libs/framework.swc
[compc] Loading configuration file C:\jenkins_slave\workspace\flex-sdk_mustella\frameworks\flex-config.xml
[compc] Loading configuration file C:\jenkins_slave\workspace\flex-sdk_mustella\frameworks\projects\framework\framework-config.xml
[compc] Loading configuration file C:\jenkins_slave\workspace\flex-sdk_mustella\frameworks\projects\framework\compile-config.xml
[compc] C:\jenkins_slave\workspace\flex-sdk_mustella\frameworks\libs\framework.swc (836299 bytes)
main:
[echo] Compiling frameworks/locale/en_US/framework_rb.swc
[compc] Loading configuration file C:\jenkins_slave\workspace\flex-sdk_mustella\frameworks\projects\framework\bundle-config.xml
[compc] C:\jenkins_slave\workspace\flex-sdk_mustella\frameworks\locale\en_US\framework_rb.swc (16518 bytes)
mx:
bundles-clean:
clean:
compile:
[echo] Compiling frameworks/libs/mx/mx.swc
[compc] Loading configuration file C:\jenkins_slave\workspace\flex-sdk_mustella\frameworks\projects\mx\compile-config.xml
[compc] C:\jenkins_slave\workspace\flex-sdk_mustella\frameworks\projects\mx\src\mx\containers\Accordion.as(2180): col: 22 Error: Incompatible override.
[compc]
[compc] private function removedFromStageHandler(event:Event):void
[compc] ^
[compc]
[compc] C:\jenkins_slave\workspace\flex-sdk_mustella\frameworks\projects\mx\src\mx\containers\Accordion.as(2180): col: 22 Error: Overriding a function that is not marked for override.
[compc]
[compc] private function removedFromStageHandler(event:Event):void
[compc] ^
[compc]
[compc] C:\jenkins_slave\workspace\flex-sdk_mustella\frameworks\projects\mx\src\mx\containers\Accordion.as(1110): col: 56 Error: Ambiguous reference to removedFromStageHandler.
[compc]
[compc] addEventListener(Event.REMOVED_FROM_STAGE, removedFromStageHandler, false, 0, true);
[compc] ^
[compc]
[compc] C:\jenkins_slave\workspace\flex-sdk_mustella\frameworks\projects\mx\src\mx\containers\ViewStack.as(1323): col: 22 Error: Incompatible override.
[compc]
[compc] private function removedFromStageHandler(event:Event):void
[compc] ^
[compc]
[compc] C:\jenkins_slave\workspace\flex-sdk_mustella\frameworks\projects\mx\src\mx\containers\ViewStack.as(1323): col: 22 Error: Overriding a function that is not marked for override.
[compc]
[compc] private function removedFromStageHandler(event:Event):void
[compc] ^
[compc]
[compc] C:\jenkins_slave\workspace\flex-sdk_mustella\frameworks\projects\mx\src\mx\containers\ViewStack.as(793): col: 56 Error: Ambiguous reference to removedFromStageHandler.
[compc]
[compc] addEventListener(Event.REMOVED_FROM_STAGE, removedFromStageHandler, false, 0, true);
[compc] ^
[compc]
[compc] C:\jenkins_slave\workspace\flex-sdk_mustella\frameworks\projects\mx\src\mx\controls\ComboBox.as(2261): col: 22 Error: Incompatible override.
[compc]
[compc] private function removedFromStageHandler(event:Event):void
[compc] ^
[compc]
[compc] C:\jenkins_slave\workspace\flex-sdk_mustella\frameworks\projects\mx\src\mx\controls\ComboBox.as(2261): col: 22 Error: Overriding a function that is not marked for override.
[compc]
[compc] private function removedFromStageHandler(event:Event):void
[compc] ^
[compc]
[compc] C:\jenkins_slave\workspace\flex-sdk_mustella\frameworks\projects\mx\src\mx\controls\ComboBox.as(668): col: 52 Error: Ambiguous reference to removedFromStageHandler.
[compc]
[compc] addEventListener(Event.REMOVED_FROM_STAGE, removedFromStageHandler);
[compc] ^
[compc]
[compc] C:\jenkins_slave\workspace\flex-sdk_mustella\frameworks\projects\mx\src\mx\controls\DateField.as(2740): col: 22 Error: Incompatible override.
[compc]
[compc] private function removedFromStageHandler(event:Event):void
[compc] ^
[compc]
[compc] C:\jenkins_slave\workspace\flex-sdk_mustella\frameworks\projects\mx\src\mx\controls\DateField.as(2740): col: 22 Error: Overriding a function that is not marked for override.
[compc]
[compc] private function removedFromStageHandler(event:Event):void
[compc] ^
[compc]
[compc] C:\jenkins_slave\workspace\flex-sdk_mustella\frameworks\projects\mx\src\mx\controls\DateField.as(715): col: 52 Error: Ambiguous reference to removedFromStageHandler.
[compc]
[compc] addEventListener(Event.REMOVED_FROM_STAGE, removedFromStageHandler);
[compc] ^
[compc]
[compc] C:\jenkins_slave\workspace\flex-sdk_mustella\frameworks\projects\mx\src\mx\controls\PopUpButton.as(1308): col: 22 Error: Incompatible override.
[compc]
[compc] private function removedFromStageHandler(event:Event):void
[compc] ^
[compc]
[compc] C:\jenkins_slave\workspace\flex-sdk_mustella\frameworks\projects\mx\src\mx\controls\PopUpButton.as(1308): col: 22 Error: Overriding a function that is not marked for override.
[compc]
[compc] private function removedFromStageHandler(event:Event):void
[compc] ^
[compc]
[compc] C:\jenkins_slave\workspace\flex-sdk_mustella\frameworks\projects\mx\src\mx\controls\PopUpButton.as(378): col: 52 Error: Ambiguous reference to removedFromStageHandler.
[compc]
[compc] addEventListener(Event.REMOVED_FROM_STAGE, removedFromStageHandler);
[compc] ^
[compc]
BUILD FAILED
<http://localhost:8080/job/flex-sdk_mustella/ws/build.xml>:416: The following error occurred while executing this line:
<http://localhost:8080/job/flex-sdk_mustella/ws/frameworks/build.xml>:113: The following error occurred while executing this line:
<http://localhost:8080/job/flex-sdk_mustella/ws/frameworks/build.xml>:386: The following error occurred while executing this line:
<http://localhost:8080/job/flex-sdk_mustella/ws/frameworks/projects/mx/build.xml>:182: compc task failed.
Total time: 1 minute 45 seconds
Build step 'Invoke Ant' marked build as failure
Build failed in Jenkins: flex-sdk_mustella #333
Posted by fl...@gmail.com.
See <http://localhost:8080/job/flex-sdk_mustella/333/>
------------------------------------------
[...truncated 1055 lines...]
assets-clean:
clean:
bundles-clean:
clean:
bundles-clean:
assets-clean:
clean:
bundles-clean:
clean:
bundles-clean:
clean:
clean:
clean:
bundles-clean:
pixelbender-clean:
clean:
clean:
clean:
clean:
clean:
bundles-clean:
clean:
bundles-clean:
clean:
clean:
bundles-clean:
clean:
bundles-clean:
clean:
bundles-clean:
clean:
bundles-clean:
clean:
clean:
clean:
[delete] Deleting directory <http://localhost:8080/job/flex-sdk_mustella/ws/frameworks/libs>
local-fonts-snapshot:
[touch] Creating <http://localhost:8080/job/flex-sdk_mustella/ws/frameworks/localFonts.ser>
[touch] Creating <http://localhost:8080/job/flex-sdk_mustella/ws/frameworks/macFonts.ser>
[touch] Creating <http://localhost:8080/job/flex-sdk_mustella/ws/frameworks/winFonts.ser>
thirdparty-downloads:
swfobject-check:
swfobject-download:
swfobject-fabridge-download:
osmf-check:
osmf-download:
ask-osmf:
download-osmf-zip:
[unzip] Expanding: <http://localhost:8080/job/flex-sdk_mustella/ws/in/OSMF_1.0.zip> into <http://localhost:8080/job/flex-sdk_mustella/ws/in>
[unzip] Expanding: <http://localhost:8080/job/flex-sdk_mustella/ws/in/osmf_source_v1-0.zip> into <http://localhost:8080/job/flex-sdk_mustella/ws/frameworks/libs>
blazeds-jar-check:
ask-blazeds:
get-blazeds-jar:
blazeds-jar:
font-jars-check:
ask-font:
get-font-jars:
font-jars:
clean-adobe-flex-sdk:
optional-downloads:
main:
[echo] Use thirdparty-clean or super-clean to remove these.
prepare:
playerglobal-setswfversion:
flex-config:
[copy] Copying 1 file to <http://localhost:8080/job/flex-sdk_mustella/ws/frameworks>
compile:
framework:
bundles-clean:
pixelbender-clean:
assets-clean:
clean:
assets-compile:
[mxmlc] Loading configuration file C:\jenkins_slave\workspace\flex-sdk_mustella\frameworks\flex-config.xml
[mxmlc] C:\jenkins_slave\workspace\flex-sdk_mustella\frameworks\projects\framework\assets\Assets.swf (9036 bytes)
pixelbender-compile:
pixelbender-unzip:
compile:
[echo] Compiling frameworks/libs/framework.swc
[compc] Loading configuration file C:\jenkins_slave\workspace\flex-sdk_mustella\frameworks\flex-config.xml
[compc] Loading configuration file C:\jenkins_slave\workspace\flex-sdk_mustella\frameworks\projects\framework\framework-config.xml
[compc] Loading configuration file C:\jenkins_slave\workspace\flex-sdk_mustella\frameworks\projects\framework\compile-config.xml
[compc] C:\jenkins_slave\workspace\flex-sdk_mustella\frameworks\libs\framework.swc (836296 bytes)
main:
[echo] Compiling frameworks/locale/en_US/framework_rb.swc
[compc] Loading configuration file C:\jenkins_slave\workspace\flex-sdk_mustella\frameworks\projects\framework\bundle-config.xml
[compc] C:\jenkins_slave\workspace\flex-sdk_mustella\frameworks\locale\en_US\framework_rb.swc (16519 bytes)
mx:
bundles-clean:
clean:
compile:
[echo] Compiling frameworks/libs/mx/mx.swc
[compc] Loading configuration file C:\jenkins_slave\workspace\flex-sdk_mustella\frameworks\projects\mx\compile-config.xml
[compc] C:\jenkins_slave\workspace\flex-sdk_mustella\frameworks\projects\mx\src\mx\containers\Accordion.as(2180): col: 22 Error: Incompatible override.
[compc]
[compc] private function removedFromStageHandler(event:Event):void
[compc] ^
[compc]
[compc] C:\jenkins_slave\workspace\flex-sdk_mustella\frameworks\projects\mx\src\mx\containers\Accordion.as(2180): col: 22 Error: Overriding a function that is not marked for override.
[compc]
[compc] private function removedFromStageHandler(event:Event):void
[compc] ^
[compc]
[compc] C:\jenkins_slave\workspace\flex-sdk_mustella\frameworks\projects\mx\src\mx\containers\Accordion.as(1110): col: 56 Error: Ambiguous reference to removedFromStageHandler.
[compc]
[compc] addEventListener(Event.REMOVED_FROM_STAGE, removedFromStageHandler, false, 0, true);
[compc] ^
[compc]
[compc] C:\jenkins_slave\workspace\flex-sdk_mustella\frameworks\projects\mx\src\mx\containers\ViewStack.as(1323): col: 22 Error: Incompatible override.
[compc]
[compc] private function removedFromStageHandler(event:Event):void
[compc] ^
[compc]
[compc] C:\jenkins_slave\workspace\flex-sdk_mustella\frameworks\projects\mx\src\mx\containers\ViewStack.as(1323): col: 22 Error: Overriding a function that is not marked for override.
[compc]
[compc] private function removedFromStageHandler(event:Event):void
[compc] ^
[compc]
[compc] C:\jenkins_slave\workspace\flex-sdk_mustella\frameworks\projects\mx\src\mx\containers\ViewStack.as(793): col: 56 Error: Ambiguous reference to removedFromStageHandler.
[compc]
[compc] addEventListener(Event.REMOVED_FROM_STAGE, removedFromStageHandler, false, 0, true);
[compc] ^
[compc]
[compc] C:\jenkins_slave\workspace\flex-sdk_mustella\frameworks\projects\mx\src\mx\controls\ComboBox.as(2261): col: 22 Error: Incompatible override.
[compc]
[compc] private function removedFromStageHandler(event:Event):void
[compc] ^
[compc]
[compc] C:\jenkins_slave\workspace\flex-sdk_mustella\frameworks\projects\mx\src\mx\controls\ComboBox.as(2261): col: 22 Error: Overriding a function that is not marked for override.
[compc]
[compc] private function removedFromStageHandler(event:Event):void
[compc] ^
[compc]
[compc] C:\jenkins_slave\workspace\flex-sdk_mustella\frameworks\projects\mx\src\mx\controls\ComboBox.as(668): col: 52 Error: Ambiguous reference to removedFromStageHandler.
[compc]
[compc] addEventListener(Event.REMOVED_FROM_STAGE, removedFromStageHandler);
[compc] ^
[compc]
[compc] C:\jenkins_slave\workspace\flex-sdk_mustella\frameworks\projects\mx\src\mx\controls\DateField.as(2740): col: 22 Error: Incompatible override.
[compc]
[compc] private function removedFromStageHandler(event:Event):void
[compc] ^
[compc]
[compc] C:\jenkins_slave\workspace\flex-sdk_mustella\frameworks\projects\mx\src\mx\controls\DateField.as(2740): col: 22 Error: Overriding a function that is not marked for override.
[compc]
[compc] private function removedFromStageHandler(event:Event):void
[compc] ^
[compc]
[compc] C:\jenkins_slave\workspace\flex-sdk_mustella\frameworks\projects\mx\src\mx\controls\DateField.as(715): col: 52 Error: Ambiguous reference to removedFromStageHandler.
[compc]
[compc] addEventListener(Event.REMOVED_FROM_STAGE, removedFromStageHandler);
[compc] ^
[compc]
[compc] C:\jenkins_slave\workspace\flex-sdk_mustella\frameworks\projects\mx\src\mx\controls\PopUpButton.as(1308): col: 22 Error: Incompatible override.
[compc]
[compc] private function removedFromStageHandler(event:Event):void
[compc] ^
[compc]
[compc] C:\jenkins_slave\workspace\flex-sdk_mustella\frameworks\projects\mx\src\mx\controls\PopUpButton.as(1308): col: 22 Error: Overriding a function that is not marked for override.
[compc]
[compc] private function removedFromStageHandler(event:Event):void
[compc] ^
[compc]
[compc] C:\jenkins_slave\workspace\flex-sdk_mustella\frameworks\projects\mx\src\mx\controls\PopUpButton.as(378): col: 52 Error: Ambiguous reference to removedFromStageHandler.
[compc]
[compc] addEventListener(Event.REMOVED_FROM_STAGE, removedFromStageHandler);
[compc] ^
[compc]
BUILD FAILED
<http://localhost:8080/job/flex-sdk_mustella/ws/build.xml>:416: The following error occurred while executing this line:
<http://localhost:8080/job/flex-sdk_mustella/ws/frameworks/build.xml>:113: The following error occurred while executing this line:
<http://localhost:8080/job/flex-sdk_mustella/ws/frameworks/build.xml>:386: The following error occurred while executing this line:
<http://localhost:8080/job/flex-sdk_mustella/ws/frameworks/projects/mx/build.xml>:182: compc task failed.
Total time: 1 minute 48 seconds
Build step 'Invoke Ant' marked build as failure
Build failed in Jenkins: flex-sdk_mustella #332
Posted by fl...@gmail.com.
See <http://localhost:8080/job/flex-sdk_mustella/332/>
------------------------------------------
[...truncated 1055 lines...]
assets-clean:
clean:
bundles-clean:
clean:
bundles-clean:
assets-clean:
clean:
bundles-clean:
clean:
bundles-clean:
clean:
clean:
clean:
bundles-clean:
pixelbender-clean:
clean:
clean:
clean:
clean:
clean:
bundles-clean:
clean:
bundles-clean:
clean:
clean:
bundles-clean:
clean:
bundles-clean:
clean:
bundles-clean:
clean:
bundles-clean:
clean:
clean:
clean:
[delete] Deleting directory <http://localhost:8080/job/flex-sdk_mustella/ws/frameworks/libs>
local-fonts-snapshot:
[touch] Creating <http://localhost:8080/job/flex-sdk_mustella/ws/frameworks/localFonts.ser>
[touch] Creating <http://localhost:8080/job/flex-sdk_mustella/ws/frameworks/macFonts.ser>
[touch] Creating <http://localhost:8080/job/flex-sdk_mustella/ws/frameworks/winFonts.ser>
thirdparty-downloads:
swfobject-check:
swfobject-download:
swfobject-fabridge-download:
osmf-check:
osmf-download:
ask-osmf:
download-osmf-zip:
[unzip] Expanding: <http://localhost:8080/job/flex-sdk_mustella/ws/in/OSMF_1.0.zip> into <http://localhost:8080/job/flex-sdk_mustella/ws/in>
[unzip] Expanding: <http://localhost:8080/job/flex-sdk_mustella/ws/in/osmf_source_v1-0.zip> into <http://localhost:8080/job/flex-sdk_mustella/ws/frameworks/libs>
blazeds-jar-check:
ask-blazeds:
get-blazeds-jar:
blazeds-jar:
font-jars-check:
ask-font:
get-font-jars:
font-jars:
clean-adobe-flex-sdk:
optional-downloads:
main:
[echo] Use thirdparty-clean or super-clean to remove these.
prepare:
playerglobal-setswfversion:
flex-config:
[copy] Copying 1 file to <http://localhost:8080/job/flex-sdk_mustella/ws/frameworks>
compile:
framework:
bundles-clean:
pixelbender-clean:
assets-clean:
clean:
assets-compile:
[mxmlc] Loading configuration file C:\jenkins_slave\workspace\flex-sdk_mustella\frameworks\flex-config.xml
[mxmlc] C:\jenkins_slave\workspace\flex-sdk_mustella\frameworks\projects\framework\assets\Assets.swf (9035 bytes)
pixelbender-compile:
pixelbender-unzip:
compile:
[echo] Compiling frameworks/libs/framework.swc
[compc] Loading configuration file C:\jenkins_slave\workspace\flex-sdk_mustella\frameworks\flex-config.xml
[compc] Loading configuration file C:\jenkins_slave\workspace\flex-sdk_mustella\frameworks\projects\framework\framework-config.xml
[compc] Loading configuration file C:\jenkins_slave\workspace\flex-sdk_mustella\frameworks\projects\framework\compile-config.xml
[compc] C:\jenkins_slave\workspace\flex-sdk_mustella\frameworks\libs\framework.swc (836299 bytes)
main:
[echo] Compiling frameworks/locale/en_US/framework_rb.swc
[compc] Loading configuration file C:\jenkins_slave\workspace\flex-sdk_mustella\frameworks\projects\framework\bundle-config.xml
[compc] C:\jenkins_slave\workspace\flex-sdk_mustella\frameworks\locale\en_US\framework_rb.swc (16518 bytes)
mx:
bundles-clean:
clean:
compile:
[echo] Compiling frameworks/libs/mx/mx.swc
[compc] Loading configuration file C:\jenkins_slave\workspace\flex-sdk_mustella\frameworks\projects\mx\compile-config.xml
[compc] C:\jenkins_slave\workspace\flex-sdk_mustella\frameworks\projects\mx\src\mx\containers\Accordion.as(2180): col: 22 Error: Incompatible override.
[compc]
[compc] private function removedFromStageHandler(event:Event):void
[compc] ^
[compc]
[compc] C:\jenkins_slave\workspace\flex-sdk_mustella\frameworks\projects\mx\src\mx\containers\Accordion.as(2180): col: 22 Error: Overriding a function that is not marked for override.
[compc]
[compc] private function removedFromStageHandler(event:Event):void
[compc] ^
[compc]
[compc] C:\jenkins_slave\workspace\flex-sdk_mustella\frameworks\projects\mx\src\mx\containers\Accordion.as(1110): col: 56 Error: Ambiguous reference to removedFromStageHandler.
[compc]
[compc] addEventListener(Event.REMOVED_FROM_STAGE, removedFromStageHandler, false, 0, true);
[compc] ^
[compc]
[compc] C:\jenkins_slave\workspace\flex-sdk_mustella\frameworks\projects\mx\src\mx\containers\ViewStack.as(1323): col: 22 Error: Incompatible override.
[compc]
[compc] private function removedFromStageHandler(event:Event):void
[compc] ^
[compc]
[compc] C:\jenkins_slave\workspace\flex-sdk_mustella\frameworks\projects\mx\src\mx\containers\ViewStack.as(1323): col: 22 Error: Overriding a function that is not marked for override.
[compc]
[compc] private function removedFromStageHandler(event:Event):void
[compc] ^
[compc]
[compc] C:\jenkins_slave\workspace\flex-sdk_mustella\frameworks\projects\mx\src\mx\containers\ViewStack.as(793): col: 56 Error: Ambiguous reference to removedFromStageHandler.
[compc]
[compc] addEventListener(Event.REMOVED_FROM_STAGE, removedFromStageHandler, false, 0, true);
[compc] ^
[compc]
[compc] C:\jenkins_slave\workspace\flex-sdk_mustella\frameworks\projects\mx\src\mx\controls\ComboBox.as(2261): col: 22 Error: Incompatible override.
[compc]
[compc] private function removedFromStageHandler(event:Event):void
[compc] ^
[compc]
[compc] C:\jenkins_slave\workspace\flex-sdk_mustella\frameworks\projects\mx\src\mx\controls\ComboBox.as(2261): col: 22 Error: Overriding a function that is not marked for override.
[compc]
[compc] private function removedFromStageHandler(event:Event):void
[compc] ^
[compc]
[compc] C:\jenkins_slave\workspace\flex-sdk_mustella\frameworks\projects\mx\src\mx\controls\ComboBox.as(668): col: 52 Error: Ambiguous reference to removedFromStageHandler.
[compc]
[compc] addEventListener(Event.REMOVED_FROM_STAGE, removedFromStageHandler);
[compc] ^
[compc]
[compc] C:\jenkins_slave\workspace\flex-sdk_mustella\frameworks\projects\mx\src\mx\controls\DateField.as(2740): col: 22 Error: Incompatible override.
[compc]
[compc] private function removedFromStageHandler(event:Event):void
[compc] ^
[compc]
[compc] C:\jenkins_slave\workspace\flex-sdk_mustella\frameworks\projects\mx\src\mx\controls\DateField.as(2740): col: 22 Error: Overriding a function that is not marked for override.
[compc]
[compc] private function removedFromStageHandler(event:Event):void
[compc] ^
[compc]
[compc] C:\jenkins_slave\workspace\flex-sdk_mustella\frameworks\projects\mx\src\mx\controls\DateField.as(715): col: 52 Error: Ambiguous reference to removedFromStageHandler.
[compc]
[compc] addEventListener(Event.REMOVED_FROM_STAGE, removedFromStageHandler);
[compc] ^
[compc]
[compc] C:\jenkins_slave\workspace\flex-sdk_mustella\frameworks\projects\mx\src\mx\controls\PopUpButton.as(1308): col: 22 Error: Incompatible override.
[compc]
[compc] private function removedFromStageHandler(event:Event):void
[compc] ^
[compc]
[compc] C:\jenkins_slave\workspace\flex-sdk_mustella\frameworks\projects\mx\src\mx\controls\PopUpButton.as(1308): col: 22 Error: Overriding a function that is not marked for override.
[compc]
[compc] private function removedFromStageHandler(event:Event):void
[compc] ^
[compc]
[compc] C:\jenkins_slave\workspace\flex-sdk_mustella\frameworks\projects\mx\src\mx\controls\PopUpButton.as(378): col: 52 Error: Ambiguous reference to removedFromStageHandler.
[compc]
[compc] addEventListener(Event.REMOVED_FROM_STAGE, removedFromStageHandler);
[compc] ^
[compc]
BUILD FAILED
<http://localhost:8080/job/flex-sdk_mustella/ws/build.xml>:416: The following error occurred while executing this line:
<http://localhost:8080/job/flex-sdk_mustella/ws/frameworks/build.xml>:113: The following error occurred while executing this line:
<http://localhost:8080/job/flex-sdk_mustella/ws/frameworks/build.xml>:386: The following error occurred while executing this line:
<http://localhost:8080/job/flex-sdk_mustella/ws/frameworks/projects/mx/build.xml>:182: compc task failed.
Total time: 1 minute 45 seconds
Build step 'Invoke Ant' marked build as failure
Build failed in Jenkins: flex-sdk_mustella #331
Posted by fl...@gmail.com.
See <http://localhost:8080/job/flex-sdk_mustella/331/>
------------------------------------------
[...truncated 1055 lines...]
assets-clean:
clean:
bundles-clean:
clean:
bundles-clean:
assets-clean:
clean:
bundles-clean:
clean:
bundles-clean:
clean:
clean:
clean:
bundles-clean:
pixelbender-clean:
clean:
clean:
clean:
clean:
clean:
bundles-clean:
clean:
bundles-clean:
clean:
clean:
bundles-clean:
clean:
bundles-clean:
clean:
bundles-clean:
clean:
bundles-clean:
clean:
clean:
clean:
[delete] Deleting directory <http://localhost:8080/job/flex-sdk_mustella/ws/frameworks/libs>
local-fonts-snapshot:
[touch] Creating <http://localhost:8080/job/flex-sdk_mustella/ws/frameworks/localFonts.ser>
[touch] Creating <http://localhost:8080/job/flex-sdk_mustella/ws/frameworks/macFonts.ser>
[touch] Creating <http://localhost:8080/job/flex-sdk_mustella/ws/frameworks/winFonts.ser>
thirdparty-downloads:
swfobject-check:
swfobject-download:
swfobject-fabridge-download:
osmf-check:
osmf-download:
ask-osmf:
download-osmf-zip:
[unzip] Expanding: <http://localhost:8080/job/flex-sdk_mustella/ws/in/OSMF_1.0.zip> into <http://localhost:8080/job/flex-sdk_mustella/ws/in>
[unzip] Expanding: <http://localhost:8080/job/flex-sdk_mustella/ws/in/osmf_source_v1-0.zip> into <http://localhost:8080/job/flex-sdk_mustella/ws/frameworks/libs>
blazeds-jar-check:
ask-blazeds:
get-blazeds-jar:
blazeds-jar:
font-jars-check:
ask-font:
get-font-jars:
font-jars:
clean-adobe-flex-sdk:
optional-downloads:
main:
[echo] Use thirdparty-clean or super-clean to remove these.
prepare:
playerglobal-setswfversion:
flex-config:
[copy] Copying 1 file to <http://localhost:8080/job/flex-sdk_mustella/ws/frameworks>
compile:
framework:
bundles-clean:
pixelbender-clean:
assets-clean:
clean:
assets-compile:
[mxmlc] Loading configuration file C:\jenkins_slave\workspace\flex-sdk_mustella\frameworks\flex-config.xml
[mxmlc] C:\jenkins_slave\workspace\flex-sdk_mustella\frameworks\projects\framework\assets\Assets.swf (9035 bytes)
pixelbender-compile:
pixelbender-unzip:
compile:
[echo] Compiling frameworks/libs/framework.swc
[compc] Loading configuration file C:\jenkins_slave\workspace\flex-sdk_mustella\frameworks\flex-config.xml
[compc] Loading configuration file C:\jenkins_slave\workspace\flex-sdk_mustella\frameworks\projects\framework\framework-config.xml
[compc] Loading configuration file C:\jenkins_slave\workspace\flex-sdk_mustella\frameworks\projects\framework\compile-config.xml
[compc] C:\jenkins_slave\workspace\flex-sdk_mustella\frameworks\libs\framework.swc (836298 bytes)
main:
[echo] Compiling frameworks/locale/en_US/framework_rb.swc
[compc] Loading configuration file C:\jenkins_slave\workspace\flex-sdk_mustella\frameworks\projects\framework\bundle-config.xml
[compc] C:\jenkins_slave\workspace\flex-sdk_mustella\frameworks\locale\en_US\framework_rb.swc (16517 bytes)
mx:
bundles-clean:
clean:
compile:
[echo] Compiling frameworks/libs/mx/mx.swc
[compc] Loading configuration file C:\jenkins_slave\workspace\flex-sdk_mustella\frameworks\projects\mx\compile-config.xml
[compc] C:\jenkins_slave\workspace\flex-sdk_mustella\frameworks\projects\mx\src\mx\containers\Accordion.as(2180): col: 22 Error: Incompatible override.
[compc]
[compc] private function removedFromStageHandler(event:Event):void
[compc] ^
[compc]
[compc] C:\jenkins_slave\workspace\flex-sdk_mustella\frameworks\projects\mx\src\mx\containers\Accordion.as(2180): col: 22 Error: Overriding a function that is not marked for override.
[compc]
[compc] private function removedFromStageHandler(event:Event):void
[compc] ^
[compc]
[compc] C:\jenkins_slave\workspace\flex-sdk_mustella\frameworks\projects\mx\src\mx\containers\Accordion.as(1110): col: 56 Error: Ambiguous reference to removedFromStageHandler.
[compc]
[compc] addEventListener(Event.REMOVED_FROM_STAGE, removedFromStageHandler, false, 0, true);
[compc] ^
[compc]
[compc] C:\jenkins_slave\workspace\flex-sdk_mustella\frameworks\projects\mx\src\mx\containers\ViewStack.as(1323): col: 22 Error: Incompatible override.
[compc]
[compc] private function removedFromStageHandler(event:Event):void
[compc] ^
[compc]
[compc] C:\jenkins_slave\workspace\flex-sdk_mustella\frameworks\projects\mx\src\mx\containers\ViewStack.as(1323): col: 22 Error: Overriding a function that is not marked for override.
[compc]
[compc] private function removedFromStageHandler(event:Event):void
[compc] ^
[compc]
[compc] C:\jenkins_slave\workspace\flex-sdk_mustella\frameworks\projects\mx\src\mx\containers\ViewStack.as(793): col: 56 Error: Ambiguous reference to removedFromStageHandler.
[compc]
[compc] addEventListener(Event.REMOVED_FROM_STAGE, removedFromStageHandler, false, 0, true);
[compc] ^
[compc]
[compc] C:\jenkins_slave\workspace\flex-sdk_mustella\frameworks\projects\mx\src\mx\controls\ComboBox.as(2261): col: 22 Error: Incompatible override.
[compc]
[compc] private function removedFromStageHandler(event:Event):void
[compc] ^
[compc]
[compc] C:\jenkins_slave\workspace\flex-sdk_mustella\frameworks\projects\mx\src\mx\controls\ComboBox.as(2261): col: 22 Error: Overriding a function that is not marked for override.
[compc]
[compc] private function removedFromStageHandler(event:Event):void
[compc] ^
[compc]
[compc] C:\jenkins_slave\workspace\flex-sdk_mustella\frameworks\projects\mx\src\mx\controls\ComboBox.as(668): col: 52 Error: Ambiguous reference to removedFromStageHandler.
[compc]
[compc] addEventListener(Event.REMOVED_FROM_STAGE, removedFromStageHandler);
[compc] ^
[compc]
[compc] C:\jenkins_slave\workspace\flex-sdk_mustella\frameworks\projects\mx\src\mx\controls\DateField.as(2740): col: 22 Error: Incompatible override.
[compc]
[compc] private function removedFromStageHandler(event:Event):void
[compc] ^
[compc]
[compc] C:\jenkins_slave\workspace\flex-sdk_mustella\frameworks\projects\mx\src\mx\controls\DateField.as(2740): col: 22 Error: Overriding a function that is not marked for override.
[compc]
[compc] private function removedFromStageHandler(event:Event):void
[compc] ^
[compc]
[compc] C:\jenkins_slave\workspace\flex-sdk_mustella\frameworks\projects\mx\src\mx\controls\DateField.as(715): col: 52 Error: Ambiguous reference to removedFromStageHandler.
[compc]
[compc] addEventListener(Event.REMOVED_FROM_STAGE, removedFromStageHandler);
[compc] ^
[compc]
[compc] C:\jenkins_slave\workspace\flex-sdk_mustella\frameworks\projects\mx\src\mx\controls\PopUpButton.as(1308): col: 22 Error: Incompatible override.
[compc]
[compc] private function removedFromStageHandler(event:Event):void
[compc] ^
[compc]
[compc] C:\jenkins_slave\workspace\flex-sdk_mustella\frameworks\projects\mx\src\mx\controls\PopUpButton.as(1308): col: 22 Error: Overriding a function that is not marked for override.
[compc]
[compc] private function removedFromStageHandler(event:Event):void
[compc] ^
[compc]
[compc] C:\jenkins_slave\workspace\flex-sdk_mustella\frameworks\projects\mx\src\mx\controls\PopUpButton.as(378): col: 52 Error: Ambiguous reference to removedFromStageHandler.
[compc]
[compc] addEventListener(Event.REMOVED_FROM_STAGE, removedFromStageHandler);
[compc] ^
[compc]
BUILD FAILED
<http://localhost:8080/job/flex-sdk_mustella/ws/build.xml>:416: The following error occurred while executing this line:
<http://localhost:8080/job/flex-sdk_mustella/ws/frameworks/build.xml>:113: The following error occurred while executing this line:
<http://localhost:8080/job/flex-sdk_mustella/ws/frameworks/build.xml>:386: The following error occurred while executing this line:
<http://localhost:8080/job/flex-sdk_mustella/ws/frameworks/projects/mx/build.xml>:182: compc task failed.
Total time: 1 minute 47 seconds
Build step 'Invoke Ant' marked build as failure
Build failed in Jenkins: flex-sdk_mustella #330
Posted by fl...@gmail.com.
See <http://localhost:8080/job/flex-sdk_mustella/330/>
------------------------------------------
[...truncated 1055 lines...]
assets-clean:
clean:
bundles-clean:
clean:
bundles-clean:
assets-clean:
clean:
bundles-clean:
clean:
bundles-clean:
clean:
clean:
clean:
bundles-clean:
pixelbender-clean:
clean:
clean:
clean:
clean:
clean:
bundles-clean:
clean:
bundles-clean:
clean:
clean:
bundles-clean:
clean:
bundles-clean:
clean:
bundles-clean:
clean:
bundles-clean:
clean:
clean:
clean:
[delete] Deleting directory <http://localhost:8080/job/flex-sdk_mustella/ws/frameworks/libs>
local-fonts-snapshot:
[touch] Creating <http://localhost:8080/job/flex-sdk_mustella/ws/frameworks/localFonts.ser>
[touch] Creating <http://localhost:8080/job/flex-sdk_mustella/ws/frameworks/macFonts.ser>
[touch] Creating <http://localhost:8080/job/flex-sdk_mustella/ws/frameworks/winFonts.ser>
thirdparty-downloads:
swfobject-check:
swfobject-download:
swfobject-fabridge-download:
osmf-check:
osmf-download:
ask-osmf:
download-osmf-zip:
[unzip] Expanding: <http://localhost:8080/job/flex-sdk_mustella/ws/in/OSMF_1.0.zip> into <http://localhost:8080/job/flex-sdk_mustella/ws/in>
[unzip] Expanding: <http://localhost:8080/job/flex-sdk_mustella/ws/in/osmf_source_v1-0.zip> into <http://localhost:8080/job/flex-sdk_mustella/ws/frameworks/libs>
blazeds-jar-check:
ask-blazeds:
get-blazeds-jar:
blazeds-jar:
font-jars-check:
ask-font:
get-font-jars:
font-jars:
clean-adobe-flex-sdk:
optional-downloads:
main:
[echo] Use thirdparty-clean or super-clean to remove these.
prepare:
playerglobal-setswfversion:
flex-config:
[copy] Copying 1 file to <http://localhost:8080/job/flex-sdk_mustella/ws/frameworks>
compile:
framework:
bundles-clean:
pixelbender-clean:
assets-clean:
clean:
assets-compile:
[mxmlc] Loading configuration file C:\jenkins_slave\workspace\flex-sdk_mustella\frameworks\flex-config.xml
[mxmlc] C:\jenkins_slave\workspace\flex-sdk_mustella\frameworks\projects\framework\assets\Assets.swf (9036 bytes)
pixelbender-compile:
pixelbender-unzip:
compile:
[echo] Compiling frameworks/libs/framework.swc
[compc] Loading configuration file C:\jenkins_slave\workspace\flex-sdk_mustella\frameworks\flex-config.xml
[compc] Loading configuration file C:\jenkins_slave\workspace\flex-sdk_mustella\frameworks\projects\framework\framework-config.xml
[compc] Loading configuration file C:\jenkins_slave\workspace\flex-sdk_mustella\frameworks\projects\framework\compile-config.xml
[compc] C:\jenkins_slave\workspace\flex-sdk_mustella\frameworks\libs\framework.swc (836287 bytes)
main:
[echo] Compiling frameworks/locale/en_US/framework_rb.swc
[compc] Loading configuration file C:\jenkins_slave\workspace\flex-sdk_mustella\frameworks\projects\framework\bundle-config.xml
[compc] C:\jenkins_slave\workspace\flex-sdk_mustella\frameworks\locale\en_US\framework_rb.swc (16518 bytes)
mx:
bundles-clean:
clean:
compile:
[echo] Compiling frameworks/libs/mx/mx.swc
[compc] Loading configuration file C:\jenkins_slave\workspace\flex-sdk_mustella\frameworks\projects\mx\compile-config.xml
[compc] C:\jenkins_slave\workspace\flex-sdk_mustella\frameworks\projects\mx\src\mx\containers\Accordion.as(2180): col: 22 Error: Incompatible override.
[compc]
[compc] private function removedFromStageHandler(event:Event):void
[compc] ^
[compc]
[compc] C:\jenkins_slave\workspace\flex-sdk_mustella\frameworks\projects\mx\src\mx\containers\Accordion.as(2180): col: 22 Error: Overriding a function that is not marked for override.
[compc]
[compc] private function removedFromStageHandler(event:Event):void
[compc] ^
[compc]
[compc] C:\jenkins_slave\workspace\flex-sdk_mustella\frameworks\projects\mx\src\mx\containers\Accordion.as(1110): col: 56 Error: Ambiguous reference to removedFromStageHandler.
[compc]
[compc] addEventListener(Event.REMOVED_FROM_STAGE, removedFromStageHandler, false, 0, true);
[compc] ^
[compc]
[compc] C:\jenkins_slave\workspace\flex-sdk_mustella\frameworks\projects\mx\src\mx\containers\ViewStack.as(1323): col: 22 Error: Incompatible override.
[compc]
[compc] private function removedFromStageHandler(event:Event):void
[compc] ^
[compc]
[compc] C:\jenkins_slave\workspace\flex-sdk_mustella\frameworks\projects\mx\src\mx\containers\ViewStack.as(1323): col: 22 Error: Overriding a function that is not marked for override.
[compc]
[compc] private function removedFromStageHandler(event:Event):void
[compc] ^
[compc]
[compc] C:\jenkins_slave\workspace\flex-sdk_mustella\frameworks\projects\mx\src\mx\containers\ViewStack.as(793): col: 56 Error: Ambiguous reference to removedFromStageHandler.
[compc]
[compc] addEventListener(Event.REMOVED_FROM_STAGE, removedFromStageHandler, false, 0, true);
[compc] ^
[compc]
[compc] C:\jenkins_slave\workspace\flex-sdk_mustella\frameworks\projects\mx\src\mx\controls\ComboBox.as(2261): col: 22 Error: Incompatible override.
[compc]
[compc] private function removedFromStageHandler(event:Event):void
[compc] ^
[compc]
[compc] C:\jenkins_slave\workspace\flex-sdk_mustella\frameworks\projects\mx\src\mx\controls\ComboBox.as(2261): col: 22 Error: Overriding a function that is not marked for override.
[compc]
[compc] private function removedFromStageHandler(event:Event):void
[compc] ^
[compc]
[compc] C:\jenkins_slave\workspace\flex-sdk_mustella\frameworks\projects\mx\src\mx\controls\ComboBox.as(668): col: 52 Error: Ambiguous reference to removedFromStageHandler.
[compc]
[compc] addEventListener(Event.REMOVED_FROM_STAGE, removedFromStageHandler);
[compc] ^
[compc]
[compc] C:\jenkins_slave\workspace\flex-sdk_mustella\frameworks\projects\mx\src\mx\controls\DateField.as(2740): col: 22 Error: Incompatible override.
[compc]
[compc] private function removedFromStageHandler(event:Event):void
[compc] ^
[compc]
[compc] C:\jenkins_slave\workspace\flex-sdk_mustella\frameworks\projects\mx\src\mx\controls\DateField.as(2740): col: 22 Error: Overriding a function that is not marked for override.
[compc]
[compc] private function removedFromStageHandler(event:Event):void
[compc] ^
[compc]
[compc] C:\jenkins_slave\workspace\flex-sdk_mustella\frameworks\projects\mx\src\mx\controls\DateField.as(715): col: 52 Error: Ambiguous reference to removedFromStageHandler.
[compc]
[compc] addEventListener(Event.REMOVED_FROM_STAGE, removedFromStageHandler);
[compc] ^
[compc]
[compc] C:\jenkins_slave\workspace\flex-sdk_mustella\frameworks\projects\mx\src\mx\controls\PopUpButton.as(1308): col: 22 Error: Incompatible override.
[compc]
[compc] private function removedFromStageHandler(event:Event):void
[compc] ^
[compc]
[compc] C:\jenkins_slave\workspace\flex-sdk_mustella\frameworks\projects\mx\src\mx\controls\PopUpButton.as(1308): col: 22 Error: Overriding a function that is not marked for override.
[compc]
[compc] private function removedFromStageHandler(event:Event):void
[compc] ^
[compc]
[compc] C:\jenkins_slave\workspace\flex-sdk_mustella\frameworks\projects\mx\src\mx\controls\PopUpButton.as(378): col: 52 Error: Ambiguous reference to removedFromStageHandler.
[compc]
[compc] addEventListener(Event.REMOVED_FROM_STAGE, removedFromStageHandler);
[compc] ^
[compc]
BUILD FAILED
<http://localhost:8080/job/flex-sdk_mustella/ws/build.xml>:416: The following error occurred while executing this line:
<http://localhost:8080/job/flex-sdk_mustella/ws/frameworks/build.xml>:113: The following error occurred while executing this line:
<http://localhost:8080/job/flex-sdk_mustella/ws/frameworks/build.xml>:386: The following error occurred while executing this line:
<http://localhost:8080/job/flex-sdk_mustella/ws/frameworks/projects/mx/build.xml>:182: compc task failed.
Total time: 1 minute 46 seconds
Build step 'Invoke Ant' marked build as failure
Build failed in Jenkins: flex-sdk_mustella #329
Posted by fl...@gmail.com.
See <http://localhost:8080/job/flex-sdk_mustella/329/>
------------------------------------------
[...truncated 1055 lines...]
assets-clean:
clean:
bundles-clean:
clean:
bundles-clean:
assets-clean:
clean:
bundles-clean:
clean:
bundles-clean:
clean:
clean:
clean:
bundles-clean:
pixelbender-clean:
clean:
clean:
clean:
clean:
clean:
bundles-clean:
clean:
bundles-clean:
clean:
clean:
bundles-clean:
clean:
bundles-clean:
clean:
bundles-clean:
clean:
bundles-clean:
clean:
clean:
clean:
[delete] Deleting directory <http://localhost:8080/job/flex-sdk_mustella/ws/frameworks/libs>
local-fonts-snapshot:
[touch] Creating <http://localhost:8080/job/flex-sdk_mustella/ws/frameworks/localFonts.ser>
[touch] Creating <http://localhost:8080/job/flex-sdk_mustella/ws/frameworks/macFonts.ser>
[touch] Creating <http://localhost:8080/job/flex-sdk_mustella/ws/frameworks/winFonts.ser>
thirdparty-downloads:
swfobject-check:
swfobject-download:
swfobject-fabridge-download:
osmf-check:
osmf-download:
ask-osmf:
download-osmf-zip:
[unzip] Expanding: <http://localhost:8080/job/flex-sdk_mustella/ws/in/OSMF_1.0.zip> into <http://localhost:8080/job/flex-sdk_mustella/ws/in>
[unzip] Expanding: <http://localhost:8080/job/flex-sdk_mustella/ws/in/osmf_source_v1-0.zip> into <http://localhost:8080/job/flex-sdk_mustella/ws/frameworks/libs>
blazeds-jar-check:
ask-blazeds:
get-blazeds-jar:
blazeds-jar:
font-jars-check:
ask-font:
get-font-jars:
font-jars:
clean-adobe-flex-sdk:
optional-downloads:
main:
[echo] Use thirdparty-clean or super-clean to remove these.
prepare:
playerglobal-setswfversion:
flex-config:
[copy] Copying 1 file to <http://localhost:8080/job/flex-sdk_mustella/ws/frameworks>
compile:
framework:
bundles-clean:
pixelbender-clean:
assets-clean:
clean:
assets-compile:
[mxmlc] Loading configuration file C:\jenkins_slave\workspace\flex-sdk_mustella\frameworks\flex-config.xml
[mxmlc] C:\jenkins_slave\workspace\flex-sdk_mustella\frameworks\projects\framework\assets\Assets.swf (9035 bytes)
pixelbender-compile:
pixelbender-unzip:
compile:
[echo] Compiling frameworks/libs/framework.swc
[compc] Loading configuration file C:\jenkins_slave\workspace\flex-sdk_mustella\frameworks\flex-config.xml
[compc] Loading configuration file C:\jenkins_slave\workspace\flex-sdk_mustella\frameworks\projects\framework\framework-config.xml
[compc] Loading configuration file C:\jenkins_slave\workspace\flex-sdk_mustella\frameworks\projects\framework\compile-config.xml
[compc] C:\jenkins_slave\workspace\flex-sdk_mustella\frameworks\libs\framework.swc (836275 bytes)
main:
[echo] Compiling frameworks/locale/en_US/framework_rb.swc
[compc] Loading configuration file C:\jenkins_slave\workspace\flex-sdk_mustella\frameworks\projects\framework\bundle-config.xml
[compc] C:\jenkins_slave\workspace\flex-sdk_mustella\frameworks\locale\en_US\framework_rb.swc (16518 bytes)
mx:
bundles-clean:
clean:
compile:
[echo] Compiling frameworks/libs/mx/mx.swc
[compc] Loading configuration file C:\jenkins_slave\workspace\flex-sdk_mustella\frameworks\projects\mx\compile-config.xml
[compc] C:\jenkins_slave\workspace\flex-sdk_mustella\frameworks\projects\mx\src\mx\containers\Accordion.as(2180): col: 22 Error: Incompatible override.
[compc]
[compc] private function removedFromStageHandler(event:Event):void
[compc] ^
[compc]
[compc] C:\jenkins_slave\workspace\flex-sdk_mustella\frameworks\projects\mx\src\mx\containers\Accordion.as(2180): col: 22 Error: Overriding a function that is not marked for override.
[compc]
[compc] private function removedFromStageHandler(event:Event):void
[compc] ^
[compc]
[compc] C:\jenkins_slave\workspace\flex-sdk_mustella\frameworks\projects\mx\src\mx\containers\Accordion.as(1110): col: 56 Error: Ambiguous reference to removedFromStageHandler.
[compc]
[compc] addEventListener(Event.REMOVED_FROM_STAGE, removedFromStageHandler, false, 0, true);
[compc] ^
[compc]
[compc] C:\jenkins_slave\workspace\flex-sdk_mustella\frameworks\projects\mx\src\mx\containers\ViewStack.as(1323): col: 22 Error: Incompatible override.
[compc]
[compc] private function removedFromStageHandler(event:Event):void
[compc] ^
[compc]
[compc] C:\jenkins_slave\workspace\flex-sdk_mustella\frameworks\projects\mx\src\mx\containers\ViewStack.as(1323): col: 22 Error: Overriding a function that is not marked for override.
[compc]
[compc] private function removedFromStageHandler(event:Event):void
[compc] ^
[compc]
[compc] C:\jenkins_slave\workspace\flex-sdk_mustella\frameworks\projects\mx\src\mx\containers\ViewStack.as(793): col: 56 Error: Ambiguous reference to removedFromStageHandler.
[compc]
[compc] addEventListener(Event.REMOVED_FROM_STAGE, removedFromStageHandler, false, 0, true);
[compc] ^
[compc]
[compc] C:\jenkins_slave\workspace\flex-sdk_mustella\frameworks\projects\mx\src\mx\controls\ComboBox.as(2261): col: 22 Error: Incompatible override.
[compc]
[compc] private function removedFromStageHandler(event:Event):void
[compc] ^
[compc]
[compc] C:\jenkins_slave\workspace\flex-sdk_mustella\frameworks\projects\mx\src\mx\controls\ComboBox.as(2261): col: 22 Error: Overriding a function that is not marked for override.
[compc]
[compc] private function removedFromStageHandler(event:Event):void
[compc] ^
[compc]
[compc] C:\jenkins_slave\workspace\flex-sdk_mustella\frameworks\projects\mx\src\mx\controls\ComboBox.as(668): col: 52 Error: Ambiguous reference to removedFromStageHandler.
[compc]
[compc] addEventListener(Event.REMOVED_FROM_STAGE, removedFromStageHandler);
[compc] ^
[compc]
[compc] C:\jenkins_slave\workspace\flex-sdk_mustella\frameworks\projects\mx\src\mx\controls\DateField.as(2740): col: 22 Error: Incompatible override.
[compc]
[compc] private function removedFromStageHandler(event:Event):void
[compc] ^
[compc]
[compc] C:\jenkins_slave\workspace\flex-sdk_mustella\frameworks\projects\mx\src\mx\controls\DateField.as(2740): col: 22 Error: Overriding a function that is not marked for override.
[compc]
[compc] private function removedFromStageHandler(event:Event):void
[compc] ^
[compc]
[compc] C:\jenkins_slave\workspace\flex-sdk_mustella\frameworks\projects\mx\src\mx\controls\DateField.as(715): col: 52 Error: Ambiguous reference to removedFromStageHandler.
[compc]
[compc] addEventListener(Event.REMOVED_FROM_STAGE, removedFromStageHandler);
[compc] ^
[compc]
[compc] C:\jenkins_slave\workspace\flex-sdk_mustella\frameworks\projects\mx\src\mx\controls\PopUpButton.as(1308): col: 22 Error: Incompatible override.
[compc]
[compc] private function removedFromStageHandler(event:Event):void
[compc] ^
[compc]
[compc] C:\jenkins_slave\workspace\flex-sdk_mustella\frameworks\projects\mx\src\mx\controls\PopUpButton.as(1308): col: 22 Error: Overriding a function that is not marked for override.
[compc]
[compc] private function removedFromStageHandler(event:Event):void
[compc] ^
[compc]
[compc] C:\jenkins_slave\workspace\flex-sdk_mustella\frameworks\projects\mx\src\mx\controls\PopUpButton.as(378): col: 52 Error: Ambiguous reference to removedFromStageHandler.
[compc]
[compc] addEventListener(Event.REMOVED_FROM_STAGE, removedFromStageHandler);
[compc] ^
[compc]
BUILD FAILED
<http://localhost:8080/job/flex-sdk_mustella/ws/build.xml>:416: The following error occurred while executing this line:
<http://localhost:8080/job/flex-sdk_mustella/ws/frameworks/build.xml>:113: The following error occurred while executing this line:
<http://localhost:8080/job/flex-sdk_mustella/ws/frameworks/build.xml>:386: The following error occurred while executing this line:
<http://localhost:8080/job/flex-sdk_mustella/ws/frameworks/projects/mx/build.xml>:182: compc task failed.
Total time: 1 minute 48 seconds
Build step 'Invoke Ant' marked build as failure
Build failed in Jenkins: flex-sdk_mustella #328
Posted by fl...@gmail.com.
See <http://localhost:8080/job/flex-sdk_mustella/328/>
------------------------------------------
[...truncated 1056 lines...]
assets-clean:
clean:
bundles-clean:
clean:
bundles-clean:
assets-clean:
clean:
bundles-clean:
clean:
bundles-clean:
clean:
clean:
clean:
bundles-clean:
pixelbender-clean:
clean:
clean:
clean:
clean:
clean:
bundles-clean:
clean:
bundles-clean:
clean:
clean:
bundles-clean:
clean:
bundles-clean:
clean:
bundles-clean:
clean:
bundles-clean:
clean:
clean:
clean:
[delete] Deleting directory <http://localhost:8080/job/flex-sdk_mustella/ws/frameworks/libs>
local-fonts-snapshot:
[touch] Creating <http://localhost:8080/job/flex-sdk_mustella/ws/frameworks/localFonts.ser>
[touch] Creating <http://localhost:8080/job/flex-sdk_mustella/ws/frameworks/macFonts.ser>
[touch] Creating <http://localhost:8080/job/flex-sdk_mustella/ws/frameworks/winFonts.ser>
thirdparty-downloads:
swfobject-check:
swfobject-download:
swfobject-fabridge-download:
osmf-check:
osmf-download:
ask-osmf:
download-osmf-zip:
[unzip] Expanding: <http://localhost:8080/job/flex-sdk_mustella/ws/in/OSMF_1.0.zip> into <http://localhost:8080/job/flex-sdk_mustella/ws/in>
[unzip] Expanding: <http://localhost:8080/job/flex-sdk_mustella/ws/in/osmf_source_v1-0.zip> into <http://localhost:8080/job/flex-sdk_mustella/ws/frameworks/libs>
blazeds-jar-check:
ask-blazeds:
get-blazeds-jar:
blazeds-jar:
font-jars-check:
ask-font:
get-font-jars:
font-jars:
clean-adobe-flex-sdk:
optional-downloads:
main:
[echo] Use thirdparty-clean or super-clean to remove these.
prepare:
playerglobal-setswfversion:
flex-config:
[copy] Copying 1 file to <http://localhost:8080/job/flex-sdk_mustella/ws/frameworks>
compile:
framework:
bundles-clean:
pixelbender-clean:
assets-clean:
clean:
assets-compile:
[mxmlc] Loading configuration file C:\jenkins_slave\workspace\flex-sdk_mustella\frameworks\flex-config.xml
[mxmlc] C:\jenkins_slave\workspace\flex-sdk_mustella\frameworks\projects\framework\assets\Assets.swf (9035 bytes)
pixelbender-compile:
pixelbender-unzip:
compile:
[echo] Compiling frameworks/libs/framework.swc
[compc] Loading configuration file C:\jenkins_slave\workspace\flex-sdk_mustella\frameworks\flex-config.xml
[compc] Loading configuration file C:\jenkins_slave\workspace\flex-sdk_mustella\frameworks\projects\framework\framework-config.xml
[compc] Loading configuration file C:\jenkins_slave\workspace\flex-sdk_mustella\frameworks\projects\framework\compile-config.xml
[compc] C:\jenkins_slave\workspace\flex-sdk_mustella\frameworks\libs\framework.swc (836285 bytes)
main:
[echo] Compiling frameworks/locale/en_US/framework_rb.swc
[compc] Loading configuration file C:\jenkins_slave\workspace\flex-sdk_mustella\frameworks\projects\framework\bundle-config.xml
[compc] C:\jenkins_slave\workspace\flex-sdk_mustella\frameworks\locale\en_US\framework_rb.swc (16518 bytes)
mx:
bundles-clean:
clean:
compile:
[echo] Compiling frameworks/libs/mx/mx.swc
[compc] Loading configuration file C:\jenkins_slave\workspace\flex-sdk_mustella\frameworks\projects\mx\compile-config.xml
[compc] C:\jenkins_slave\workspace\flex-sdk_mustella\frameworks\projects\mx\src\mx\containers\Accordion.as(2180): col: 22 Error: Incompatible override.
[compc]
[compc] private function removedFromStageHandler(event:Event):void
[compc] ^
[compc]
[compc] C:\jenkins_slave\workspace\flex-sdk_mustella\frameworks\projects\mx\src\mx\containers\Accordion.as(2180): col: 22 Error: Overriding a function that is not marked for override.
[compc]
[compc] private function removedFromStageHandler(event:Event):void
[compc] ^
[compc]
[compc] C:\jenkins_slave\workspace\flex-sdk_mustella\frameworks\projects\mx\src\mx\containers\Accordion.as(1110): col: 56 Error: Ambiguous reference to removedFromStageHandler.
[compc]
[compc] addEventListener(Event.REMOVED_FROM_STAGE, removedFromStageHandler, false, 0, true);
[compc] ^
[compc]
[compc] C:\jenkins_slave\workspace\flex-sdk_mustella\frameworks\projects\mx\src\mx\containers\ViewStack.as(1323): col: 22 Error: Incompatible override.
[compc]
[compc] private function removedFromStageHandler(event:Event):void
[compc] ^
[compc]
[compc] C:\jenkins_slave\workspace\flex-sdk_mustella\frameworks\projects\mx\src\mx\containers\ViewStack.as(1323): col: 22 Error: Overriding a function that is not marked for override.
[compc]
[compc] private function removedFromStageHandler(event:Event):void
[compc] ^
[compc]
[compc] C:\jenkins_slave\workspace\flex-sdk_mustella\frameworks\projects\mx\src\mx\containers\ViewStack.as(793): col: 56 Error: Ambiguous reference to removedFromStageHandler.
[compc]
[compc] addEventListener(Event.REMOVED_FROM_STAGE, removedFromStageHandler, false, 0, true);
[compc] ^
[compc]
[compc] C:\jenkins_slave\workspace\flex-sdk_mustella\frameworks\projects\mx\src\mx\controls\ComboBox.as(2261): col: 22 Error: Incompatible override.
[compc]
[compc] private function removedFromStageHandler(event:Event):void
[compc] ^
[compc]
[compc] C:\jenkins_slave\workspace\flex-sdk_mustella\frameworks\projects\mx\src\mx\controls\ComboBox.as(2261): col: 22 Error: Overriding a function that is not marked for override.
[compc]
[compc] private function removedFromStageHandler(event:Event):void
[compc] ^
[compc]
[compc] C:\jenkins_slave\workspace\flex-sdk_mustella\frameworks\projects\mx\src\mx\controls\ComboBox.as(668): col: 52 Error: Ambiguous reference to removedFromStageHandler.
[compc]
[compc] addEventListener(Event.REMOVED_FROM_STAGE, removedFromStageHandler);
[compc] ^
[compc]
[compc] C:\jenkins_slave\workspace\flex-sdk_mustella\frameworks\projects\mx\src\mx\controls\DateField.as(2740): col: 22 Error: Incompatible override.
[compc]
[compc] private function removedFromStageHandler(event:Event):void
[compc] ^
[compc]
[compc] C:\jenkins_slave\workspace\flex-sdk_mustella\frameworks\projects\mx\src\mx\controls\DateField.as(2740): col: 22 Error: Overriding a function that is not marked for override.
[compc]
[compc] private function removedFromStageHandler(event:Event):void
[compc] ^
[compc]
[compc] C:\jenkins_slave\workspace\flex-sdk_mustella\frameworks\projects\mx\src\mx\controls\DateField.as(715): col: 52 Error: Ambiguous reference to removedFromStageHandler.
[compc]
[compc] addEventListener(Event.REMOVED_FROM_STAGE, removedFromStageHandler);
[compc] ^
[compc]
[compc] C:\jenkins_slave\workspace\flex-sdk_mustella\frameworks\projects\mx\src\mx\controls\PopUpButton.as(1308): col: 22 Error: Incompatible override.
[compc]
[compc] private function removedFromStageHandler(event:Event):void
[compc] ^
[compc]
[compc] C:\jenkins_slave\workspace\flex-sdk_mustella\frameworks\projects\mx\src\mx\controls\PopUpButton.as(1308): col: 22 Error: Overriding a function that is not marked for override.
[compc]
[compc] private function removedFromStageHandler(event:Event):void
[compc] ^
[compc]
[compc] C:\jenkins_slave\workspace\flex-sdk_mustella\frameworks\projects\mx\src\mx\controls\PopUpButton.as(378): col: 52 Error: Ambiguous reference to removedFromStageHandler.
[compc]
[compc] addEventListener(Event.REMOVED_FROM_STAGE, removedFromStageHandler);
[compc] ^
[compc]
BUILD FAILED
<http://localhost:8080/job/flex-sdk_mustella/ws/build.xml>:416: The following error occurred while executing this line:
<http://localhost:8080/job/flex-sdk_mustella/ws/frameworks/build.xml>:113: The following error occurred while executing this line:
<http://localhost:8080/job/flex-sdk_mustella/ws/frameworks/build.xml>:386: The following error occurred while executing this line:
<http://localhost:8080/job/flex-sdk_mustella/ws/frameworks/projects/mx/build.xml>:182: compc task failed.
Total time: 1 minute 46 seconds
Build step 'Invoke Ant' marked build as failure
Build failed in Jenkins: flex-sdk_mustella #327
Posted by fl...@gmail.com.
See <http://localhost:8080/job/flex-sdk_mustella/327/>
------------------------------------------
[...truncated 1055 lines...]
assets-clean:
clean:
bundles-clean:
clean:
bundles-clean:
assets-clean:
clean:
bundles-clean:
clean:
bundles-clean:
clean:
clean:
clean:
bundles-clean:
pixelbender-clean:
clean:
clean:
clean:
clean:
clean:
bundles-clean:
clean:
bundles-clean:
clean:
clean:
bundles-clean:
clean:
bundles-clean:
clean:
bundles-clean:
clean:
bundles-clean:
clean:
clean:
clean:
[delete] Deleting directory <http://localhost:8080/job/flex-sdk_mustella/ws/frameworks/libs>
local-fonts-snapshot:
[touch] Creating <http://localhost:8080/job/flex-sdk_mustella/ws/frameworks/localFonts.ser>
[touch] Creating <http://localhost:8080/job/flex-sdk_mustella/ws/frameworks/macFonts.ser>
[touch] Creating <http://localhost:8080/job/flex-sdk_mustella/ws/frameworks/winFonts.ser>
thirdparty-downloads:
swfobject-check:
swfobject-download:
swfobject-fabridge-download:
osmf-check:
osmf-download:
ask-osmf:
download-osmf-zip:
[unzip] Expanding: <http://localhost:8080/job/flex-sdk_mustella/ws/in/OSMF_1.0.zip> into <http://localhost:8080/job/flex-sdk_mustella/ws/in>
[unzip] Expanding: <http://localhost:8080/job/flex-sdk_mustella/ws/in/osmf_source_v1-0.zip> into <http://localhost:8080/job/flex-sdk_mustella/ws/frameworks/libs>
blazeds-jar-check:
ask-blazeds:
get-blazeds-jar:
blazeds-jar:
font-jars-check:
ask-font:
get-font-jars:
font-jars:
clean-adobe-flex-sdk:
optional-downloads:
main:
[echo] Use thirdparty-clean or super-clean to remove these.
prepare:
playerglobal-setswfversion:
flex-config:
[copy] Copying 1 file to <http://localhost:8080/job/flex-sdk_mustella/ws/frameworks>
compile:
framework:
bundles-clean:
pixelbender-clean:
assets-clean:
clean:
assets-compile:
[mxmlc] Loading configuration file C:\jenkins_slave\workspace\flex-sdk_mustella\frameworks\flex-config.xml
[mxmlc] C:\jenkins_slave\workspace\flex-sdk_mustella\frameworks\projects\framework\assets\Assets.swf (9035 bytes)
pixelbender-compile:
pixelbender-unzip:
compile:
[echo] Compiling frameworks/libs/framework.swc
[compc] Loading configuration file C:\jenkins_slave\workspace\flex-sdk_mustella\frameworks\flex-config.xml
[compc] Loading configuration file C:\jenkins_slave\workspace\flex-sdk_mustella\frameworks\projects\framework\framework-config.xml
[compc] Loading configuration file C:\jenkins_slave\workspace\flex-sdk_mustella\frameworks\projects\framework\compile-config.xml
[compc] C:\jenkins_slave\workspace\flex-sdk_mustella\frameworks\libs\framework.swc (836303 bytes)
main:
[echo] Compiling frameworks/locale/en_US/framework_rb.swc
[compc] Loading configuration file C:\jenkins_slave\workspace\flex-sdk_mustella\frameworks\projects\framework\bundle-config.xml
[compc] C:\jenkins_slave\workspace\flex-sdk_mustella\frameworks\locale\en_US\framework_rb.swc (16519 bytes)
mx:
bundles-clean:
clean:
compile:
[echo] Compiling frameworks/libs/mx/mx.swc
[compc] Loading configuration file C:\jenkins_slave\workspace\flex-sdk_mustella\frameworks\projects\mx\compile-config.xml
[compc] C:\jenkins_slave\workspace\flex-sdk_mustella\frameworks\projects\mx\src\mx\containers\Accordion.as(2180): col: 22 Error: Incompatible override.
[compc]
[compc] private function removedFromStageHandler(event:Event):void
[compc] ^
[compc]
[compc] C:\jenkins_slave\workspace\flex-sdk_mustella\frameworks\projects\mx\src\mx\containers\Accordion.as(2180): col: 22 Error: Overriding a function that is not marked for override.
[compc]
[compc] private function removedFromStageHandler(event:Event):void
[compc] ^
[compc]
[compc] C:\jenkins_slave\workspace\flex-sdk_mustella\frameworks\projects\mx\src\mx\containers\Accordion.as(1110): col: 56 Error: Ambiguous reference to removedFromStageHandler.
[compc]
[compc] addEventListener(Event.REMOVED_FROM_STAGE, removedFromStageHandler, false, 0, true);
[compc] ^
[compc]
[compc] C:\jenkins_slave\workspace\flex-sdk_mustella\frameworks\projects\mx\src\mx\containers\ViewStack.as(1323): col: 22 Error: Incompatible override.
[compc]
[compc] private function removedFromStageHandler(event:Event):void
[compc] ^
[compc]
[compc] C:\jenkins_slave\workspace\flex-sdk_mustella\frameworks\projects\mx\src\mx\containers\ViewStack.as(1323): col: 22 Error: Overriding a function that is not marked for override.
[compc]
[compc] private function removedFromStageHandler(event:Event):void
[compc] ^
[compc]
[compc] C:\jenkins_slave\workspace\flex-sdk_mustella\frameworks\projects\mx\src\mx\containers\ViewStack.as(793): col: 56 Error: Ambiguous reference to removedFromStageHandler.
[compc]
[compc] addEventListener(Event.REMOVED_FROM_STAGE, removedFromStageHandler, false, 0, true);
[compc] ^
[compc]
[compc] C:\jenkins_slave\workspace\flex-sdk_mustella\frameworks\projects\mx\src\mx\controls\ComboBox.as(2261): col: 22 Error: Incompatible override.
[compc]
[compc] private function removedFromStageHandler(event:Event):void
[compc] ^
[compc]
[compc] C:\jenkins_slave\workspace\flex-sdk_mustella\frameworks\projects\mx\src\mx\controls\ComboBox.as(2261): col: 22 Error: Overriding a function that is not marked for override.
[compc]
[compc] private function removedFromStageHandler(event:Event):void
[compc] ^
[compc]
[compc] C:\jenkins_slave\workspace\flex-sdk_mustella\frameworks\projects\mx\src\mx\controls\ComboBox.as(668): col: 52 Error: Ambiguous reference to removedFromStageHandler.
[compc]
[compc] addEventListener(Event.REMOVED_FROM_STAGE, removedFromStageHandler);
[compc] ^
[compc]
[compc] C:\jenkins_slave\workspace\flex-sdk_mustella\frameworks\projects\mx\src\mx\controls\DateField.as(2740): col: 22 Error: Incompatible override.
[compc]
[compc] private function removedFromStageHandler(event:Event):void
[compc] ^
[compc]
[compc] C:\jenkins_slave\workspace\flex-sdk_mustella\frameworks\projects\mx\src\mx\controls\DateField.as(2740): col: 22 Error: Overriding a function that is not marked for override.
[compc]
[compc] private function removedFromStageHandler(event:Event):void
[compc] ^
[compc]
[compc] C:\jenkins_slave\workspace\flex-sdk_mustella\frameworks\projects\mx\src\mx\controls\DateField.as(715): col: 52 Error: Ambiguous reference to removedFromStageHandler.
[compc]
[compc] addEventListener(Event.REMOVED_FROM_STAGE, removedFromStageHandler);
[compc] ^
[compc]
[compc] C:\jenkins_slave\workspace\flex-sdk_mustella\frameworks\projects\mx\src\mx\controls\PopUpButton.as(1308): col: 22 Error: Incompatible override.
[compc]
[compc] private function removedFromStageHandler(event:Event):void
[compc] ^
[compc]
[compc] C:\jenkins_slave\workspace\flex-sdk_mustella\frameworks\projects\mx\src\mx\controls\PopUpButton.as(1308): col: 22 Error: Overriding a function that is not marked for override.
[compc]
[compc] private function removedFromStageHandler(event:Event):void
[compc] ^
[compc]
[compc] C:\jenkins_slave\workspace\flex-sdk_mustella\frameworks\projects\mx\src\mx\controls\PopUpButton.as(378): col: 52 Error: Ambiguous reference to removedFromStageHandler.
[compc]
[compc] addEventListener(Event.REMOVED_FROM_STAGE, removedFromStageHandler);
[compc] ^
[compc]
BUILD FAILED
<http://localhost:8080/job/flex-sdk_mustella/ws/build.xml>:416: The following error occurred while executing this line:
<http://localhost:8080/job/flex-sdk_mustella/ws/frameworks/build.xml>:113: The following error occurred while executing this line:
<http://localhost:8080/job/flex-sdk_mustella/ws/frameworks/build.xml>:386: The following error occurred while executing this line:
<http://localhost:8080/job/flex-sdk_mustella/ws/frameworks/projects/mx/build.xml>:182: compc task failed.
Total time: 1 minute 47 seconds
Build step 'Invoke Ant' marked build as failure
Build failed in Jenkins: flex-sdk_mustella #326
Posted by fl...@gmail.com.
See <http://localhost:8080/job/flex-sdk_mustella/326/>
------------------------------------------
[...truncated 1056 lines...]
assets-clean:
clean:
bundles-clean:
clean:
bundles-clean:
assets-clean:
clean:
bundles-clean:
clean:
bundles-clean:
clean:
clean:
clean:
bundles-clean:
pixelbender-clean:
clean:
clean:
clean:
clean:
clean:
bundles-clean:
clean:
bundles-clean:
clean:
clean:
bundles-clean:
clean:
bundles-clean:
clean:
bundles-clean:
clean:
bundles-clean:
clean:
clean:
clean:
[delete] Deleting directory <http://localhost:8080/job/flex-sdk_mustella/ws/frameworks/libs>
local-fonts-snapshot:
[touch] Creating <http://localhost:8080/job/flex-sdk_mustella/ws/frameworks/localFonts.ser>
[touch] Creating <http://localhost:8080/job/flex-sdk_mustella/ws/frameworks/macFonts.ser>
[touch] Creating <http://localhost:8080/job/flex-sdk_mustella/ws/frameworks/winFonts.ser>
thirdparty-downloads:
swfobject-check:
swfobject-download:
swfobject-fabridge-download:
osmf-check:
osmf-download:
ask-osmf:
download-osmf-zip:
[unzip] Expanding: <http://localhost:8080/job/flex-sdk_mustella/ws/in/OSMF_1.0.zip> into <http://localhost:8080/job/flex-sdk_mustella/ws/in>
[unzip] Expanding: <http://localhost:8080/job/flex-sdk_mustella/ws/in/osmf_source_v1-0.zip> into <http://localhost:8080/job/flex-sdk_mustella/ws/frameworks/libs>
blazeds-jar-check:
ask-blazeds:
get-blazeds-jar:
blazeds-jar:
font-jars-check:
ask-font:
get-font-jars:
font-jars:
clean-adobe-flex-sdk:
optional-downloads:
main:
[echo] Use thirdparty-clean or super-clean to remove these.
prepare:
playerglobal-setswfversion:
flex-config:
[copy] Copying 1 file to <http://localhost:8080/job/flex-sdk_mustella/ws/frameworks>
compile:
framework:
bundles-clean:
pixelbender-clean:
assets-clean:
clean:
assets-compile:
[mxmlc] Loading configuration file C:\jenkins_slave\workspace\flex-sdk_mustella\frameworks\flex-config.xml
[mxmlc] C:\jenkins_slave\workspace\flex-sdk_mustella\frameworks\projects\framework\assets\Assets.swf (9035 bytes)
pixelbender-compile:
pixelbender-unzip:
compile:
[echo] Compiling frameworks/libs/framework.swc
[compc] Loading configuration file C:\jenkins_slave\workspace\flex-sdk_mustella\frameworks\flex-config.xml
[compc] Loading configuration file C:\jenkins_slave\workspace\flex-sdk_mustella\frameworks\projects\framework\framework-config.xml
[compc] Loading configuration file C:\jenkins_slave\workspace\flex-sdk_mustella\frameworks\projects\framework\compile-config.xml
[compc] C:\jenkins_slave\workspace\flex-sdk_mustella\frameworks\libs\framework.swc (836289 bytes)
main:
[echo] Compiling frameworks/locale/en_US/framework_rb.swc
[compc] Loading configuration file C:\jenkins_slave\workspace\flex-sdk_mustella\frameworks\projects\framework\bundle-config.xml
[compc] C:\jenkins_slave\workspace\flex-sdk_mustella\frameworks\locale\en_US\framework_rb.swc (16518 bytes)
mx:
bundles-clean:
clean:
compile:
[echo] Compiling frameworks/libs/mx/mx.swc
[compc] Loading configuration file C:\jenkins_slave\workspace\flex-sdk_mustella\frameworks\projects\mx\compile-config.xml
[compc] C:\jenkins_slave\workspace\flex-sdk_mustella\frameworks\projects\mx\src\mx\containers\Accordion.as(2180): col: 22 Error: Incompatible override.
[compc]
[compc] private function removedFromStageHandler(event:Event):void
[compc] ^
[compc]
[compc] C:\jenkins_slave\workspace\flex-sdk_mustella\frameworks\projects\mx\src\mx\containers\Accordion.as(2180): col: 22 Error: Overriding a function that is not marked for override.
[compc]
[compc] private function removedFromStageHandler(event:Event):void
[compc] ^
[compc]
[compc] C:\jenkins_slave\workspace\flex-sdk_mustella\frameworks\projects\mx\src\mx\containers\Accordion.as(1110): col: 56 Error: Ambiguous reference to removedFromStageHandler.
[compc]
[compc] addEventListener(Event.REMOVED_FROM_STAGE, removedFromStageHandler, false, 0, true);
[compc] ^
[compc]
[compc] C:\jenkins_slave\workspace\flex-sdk_mustella\frameworks\projects\mx\src\mx\containers\ViewStack.as(1323): col: 22 Error: Incompatible override.
[compc]
[compc] private function removedFromStageHandler(event:Event):void
[compc] ^
[compc]
[compc] C:\jenkins_slave\workspace\flex-sdk_mustella\frameworks\projects\mx\src\mx\containers\ViewStack.as(1323): col: 22 Error: Overriding a function that is not marked for override.
[compc]
[compc] private function removedFromStageHandler(event:Event):void
[compc] ^
[compc]
[compc] C:\jenkins_slave\workspace\flex-sdk_mustella\frameworks\projects\mx\src\mx\containers\ViewStack.as(793): col: 56 Error: Ambiguous reference to removedFromStageHandler.
[compc]
[compc] addEventListener(Event.REMOVED_FROM_STAGE, removedFromStageHandler, false, 0, true);
[compc] ^
[compc]
[compc] C:\jenkins_slave\workspace\flex-sdk_mustella\frameworks\projects\mx\src\mx\controls\ComboBox.as(2261): col: 22 Error: Incompatible override.
[compc]
[compc] private function removedFromStageHandler(event:Event):void
[compc] ^
[compc]
[compc] C:\jenkins_slave\workspace\flex-sdk_mustella\frameworks\projects\mx\src\mx\controls\ComboBox.as(2261): col: 22 Error: Overriding a function that is not marked for override.
[compc]
[compc] private function removedFromStageHandler(event:Event):void
[compc] ^
[compc]
[compc] C:\jenkins_slave\workspace\flex-sdk_mustella\frameworks\projects\mx\src\mx\controls\ComboBox.as(668): col: 52 Error: Ambiguous reference to removedFromStageHandler.
[compc]
[compc] addEventListener(Event.REMOVED_FROM_STAGE, removedFromStageHandler);
[compc] ^
[compc]
[compc] C:\jenkins_slave\workspace\flex-sdk_mustella\frameworks\projects\mx\src\mx\controls\DateField.as(2740): col: 22 Error: Incompatible override.
[compc]
[compc] private function removedFromStageHandler(event:Event):void
[compc] ^
[compc]
[compc] C:\jenkins_slave\workspace\flex-sdk_mustella\frameworks\projects\mx\src\mx\controls\DateField.as(2740): col: 22 Error: Overriding a function that is not marked for override.
[compc]
[compc] private function removedFromStageHandler(event:Event):void
[compc] ^
[compc]
[compc] C:\jenkins_slave\workspace\flex-sdk_mustella\frameworks\projects\mx\src\mx\controls\DateField.as(715): col: 52 Error: Ambiguous reference to removedFromStageHandler.
[compc]
[compc] addEventListener(Event.REMOVED_FROM_STAGE, removedFromStageHandler);
[compc] ^
[compc]
[compc] C:\jenkins_slave\workspace\flex-sdk_mustella\frameworks\projects\mx\src\mx\controls\PopUpButton.as(1308): col: 22 Error: Incompatible override.
[compc]
[compc] private function removedFromStageHandler(event:Event):void
[compc] ^
[compc]
[compc] C:\jenkins_slave\workspace\flex-sdk_mustella\frameworks\projects\mx\src\mx\controls\PopUpButton.as(1308): col: 22 Error: Overriding a function that is not marked for override.
[compc]
[compc] private function removedFromStageHandler(event:Event):void
[compc] ^
[compc]
[compc] C:\jenkins_slave\workspace\flex-sdk_mustella\frameworks\projects\mx\src\mx\controls\PopUpButton.as(378): col: 52 Error: Ambiguous reference to removedFromStageHandler.
[compc]
[compc] addEventListener(Event.REMOVED_FROM_STAGE, removedFromStageHandler);
[compc] ^
[compc]
BUILD FAILED
<http://localhost:8080/job/flex-sdk_mustella/ws/build.xml>:416: The following error occurred while executing this line:
<http://localhost:8080/job/flex-sdk_mustella/ws/frameworks/build.xml>:113: The following error occurred while executing this line:
<http://localhost:8080/job/flex-sdk_mustella/ws/frameworks/build.xml>:386: The following error occurred while executing this line:
<http://localhost:8080/job/flex-sdk_mustella/ws/frameworks/projects/mx/build.xml>:182: compc task failed.
Total time: 1 minute 44 seconds
Build step 'Invoke Ant' marked build as failure
Build failed in Jenkins: flex-sdk_mustella #325
Posted by fl...@gmail.com.
See <http://localhost:8080/job/flex-sdk_mustella/325/>
------------------------------------------
[...truncated 1055 lines...]
assets-clean:
clean:
bundles-clean:
clean:
bundles-clean:
assets-clean:
clean:
bundles-clean:
clean:
bundles-clean:
clean:
clean:
clean:
bundles-clean:
pixelbender-clean:
clean:
clean:
clean:
clean:
clean:
bundles-clean:
clean:
bundles-clean:
clean:
clean:
bundles-clean:
clean:
bundles-clean:
clean:
bundles-clean:
clean:
bundles-clean:
clean:
clean:
clean:
[delete] Deleting directory <http://localhost:8080/job/flex-sdk_mustella/ws/frameworks/libs>
local-fonts-snapshot:
[touch] Creating <http://localhost:8080/job/flex-sdk_mustella/ws/frameworks/localFonts.ser>
[touch] Creating <http://localhost:8080/job/flex-sdk_mustella/ws/frameworks/macFonts.ser>
[touch] Creating <http://localhost:8080/job/flex-sdk_mustella/ws/frameworks/winFonts.ser>
thirdparty-downloads:
swfobject-check:
swfobject-download:
swfobject-fabridge-download:
osmf-check:
osmf-download:
ask-osmf:
download-osmf-zip:
[unzip] Expanding: <http://localhost:8080/job/flex-sdk_mustella/ws/in/OSMF_1.0.zip> into <http://localhost:8080/job/flex-sdk_mustella/ws/in>
[unzip] Expanding: <http://localhost:8080/job/flex-sdk_mustella/ws/in/osmf_source_v1-0.zip> into <http://localhost:8080/job/flex-sdk_mustella/ws/frameworks/libs>
blazeds-jar-check:
ask-blazeds:
get-blazeds-jar:
blazeds-jar:
font-jars-check:
ask-font:
get-font-jars:
font-jars:
clean-adobe-flex-sdk:
optional-downloads:
main:
[echo] Use thirdparty-clean or super-clean to remove these.
prepare:
playerglobal-setswfversion:
flex-config:
[copy] Copying 1 file to <http://localhost:8080/job/flex-sdk_mustella/ws/frameworks>
compile:
framework:
bundles-clean:
pixelbender-clean:
assets-clean:
clean:
assets-compile:
[mxmlc] Loading configuration file C:\jenkins_slave\workspace\flex-sdk_mustella\frameworks\flex-config.xml
[mxmlc] C:\jenkins_slave\workspace\flex-sdk_mustella\frameworks\projects\framework\assets\Assets.swf (9034 bytes)
pixelbender-compile:
pixelbender-unzip:
compile:
[echo] Compiling frameworks/libs/framework.swc
[compc] Loading configuration file C:\jenkins_slave\workspace\flex-sdk_mustella\frameworks\flex-config.xml
[compc] Loading configuration file C:\jenkins_slave\workspace\flex-sdk_mustella\frameworks\projects\framework\framework-config.xml
[compc] Loading configuration file C:\jenkins_slave\workspace\flex-sdk_mustella\frameworks\projects\framework\compile-config.xml
[compc] C:\jenkins_slave\workspace\flex-sdk_mustella\frameworks\libs\framework.swc (836285 bytes)
main:
[echo] Compiling frameworks/locale/en_US/framework_rb.swc
[compc] Loading configuration file C:\jenkins_slave\workspace\flex-sdk_mustella\frameworks\projects\framework\bundle-config.xml
[compc] C:\jenkins_slave\workspace\flex-sdk_mustella\frameworks\locale\en_US\framework_rb.swc (16519 bytes)
mx:
bundles-clean:
clean:
compile:
[echo] Compiling frameworks/libs/mx/mx.swc
[compc] Loading configuration file C:\jenkins_slave\workspace\flex-sdk_mustella\frameworks\projects\mx\compile-config.xml
[compc] C:\jenkins_slave\workspace\flex-sdk_mustella\frameworks\projects\mx\src\mx\containers\Accordion.as(2180): col: 22 Error: Incompatible override.
[compc]
[compc] private function removedFromStageHandler(event:Event):void
[compc] ^
[compc]
[compc] C:\jenkins_slave\workspace\flex-sdk_mustella\frameworks\projects\mx\src\mx\containers\Accordion.as(2180): col: 22 Error: Overriding a function that is not marked for override.
[compc]
[compc] private function removedFromStageHandler(event:Event):void
[compc] ^
[compc]
[compc] C:\jenkins_slave\workspace\flex-sdk_mustella\frameworks\projects\mx\src\mx\containers\Accordion.as(1110): col: 56 Error: Ambiguous reference to removedFromStageHandler.
[compc]
[compc] addEventListener(Event.REMOVED_FROM_STAGE, removedFromStageHandler, false, 0, true);
[compc] ^
[compc]
[compc] C:\jenkins_slave\workspace\flex-sdk_mustella\frameworks\projects\mx\src\mx\containers\ViewStack.as(1323): col: 22 Error: Incompatible override.
[compc]
[compc] private function removedFromStageHandler(event:Event):void
[compc] ^
[compc]
[compc] C:\jenkins_slave\workspace\flex-sdk_mustella\frameworks\projects\mx\src\mx\containers\ViewStack.as(1323): col: 22 Error: Overriding a function that is not marked for override.
[compc]
[compc] private function removedFromStageHandler(event:Event):void
[compc] ^
[compc]
[compc] C:\jenkins_slave\workspace\flex-sdk_mustella\frameworks\projects\mx\src\mx\containers\ViewStack.as(793): col: 56 Error: Ambiguous reference to removedFromStageHandler.
[compc]
[compc] addEventListener(Event.REMOVED_FROM_STAGE, removedFromStageHandler, false, 0, true);
[compc] ^
[compc]
[compc] C:\jenkins_slave\workspace\flex-sdk_mustella\frameworks\projects\mx\src\mx\controls\ComboBox.as(2261): col: 22 Error: Incompatible override.
[compc]
[compc] private function removedFromStageHandler(event:Event):void
[compc] ^
[compc]
[compc] C:\jenkins_slave\workspace\flex-sdk_mustella\frameworks\projects\mx\src\mx\controls\ComboBox.as(2261): col: 22 Error: Overriding a function that is not marked for override.
[compc]
[compc] private function removedFromStageHandler(event:Event):void
[compc] ^
[compc]
[compc] C:\jenkins_slave\workspace\flex-sdk_mustella\frameworks\projects\mx\src\mx\controls\ComboBox.as(668): col: 52 Error: Ambiguous reference to removedFromStageHandler.
[compc]
[compc] addEventListener(Event.REMOVED_FROM_STAGE, removedFromStageHandler);
[compc] ^
[compc]
[compc] C:\jenkins_slave\workspace\flex-sdk_mustella\frameworks\projects\mx\src\mx\controls\DateField.as(2740): col: 22 Error: Incompatible override.
[compc]
[compc] private function removedFromStageHandler(event:Event):void
[compc] ^
[compc]
[compc] C:\jenkins_slave\workspace\flex-sdk_mustella\frameworks\projects\mx\src\mx\controls\DateField.as(2740): col: 22 Error: Overriding a function that is not marked for override.
[compc]
[compc] private function removedFromStageHandler(event:Event):void
[compc] ^
[compc]
[compc] C:\jenkins_slave\workspace\flex-sdk_mustella\frameworks\projects\mx\src\mx\controls\DateField.as(715): col: 52 Error: Ambiguous reference to removedFromStageHandler.
[compc]
[compc] addEventListener(Event.REMOVED_FROM_STAGE, removedFromStageHandler);
[compc] ^
[compc]
[compc] C:\jenkins_slave\workspace\flex-sdk_mustella\frameworks\projects\mx\src\mx\controls\PopUpButton.as(1308): col: 22 Error: Incompatible override.
[compc]
[compc] private function removedFromStageHandler(event:Event):void
[compc] ^
[compc]
[compc] C:\jenkins_slave\workspace\flex-sdk_mustella\frameworks\projects\mx\src\mx\controls\PopUpButton.as(1308): col: 22 Error: Overriding a function that is not marked for override.
[compc]
[compc] private function removedFromStageHandler(event:Event):void
[compc] ^
[compc]
[compc] C:\jenkins_slave\workspace\flex-sdk_mustella\frameworks\projects\mx\src\mx\controls\PopUpButton.as(378): col: 52 Error: Ambiguous reference to removedFromStageHandler.
[compc]
[compc] addEventListener(Event.REMOVED_FROM_STAGE, removedFromStageHandler);
[compc] ^
[compc]
BUILD FAILED
<http://localhost:8080/job/flex-sdk_mustella/ws/build.xml>:416: The following error occurred while executing this line:
<http://localhost:8080/job/flex-sdk_mustella/ws/frameworks/build.xml>:113: The following error occurred while executing this line:
<http://localhost:8080/job/flex-sdk_mustella/ws/frameworks/build.xml>:386: The following error occurred while executing this line:
<http://localhost:8080/job/flex-sdk_mustella/ws/frameworks/projects/mx/build.xml>:182: compc task failed.
Total time: 1 minute 47 seconds
Build step 'Invoke Ant' marked build as failure
Build failed in Jenkins: flex-sdk_mustella #324
Posted by fl...@gmail.com.
See <http://localhost:8080/job/flex-sdk_mustella/324/>
------------------------------------------
[...truncated 1056 lines...]
assets-clean:
clean:
bundles-clean:
clean:
bundles-clean:
assets-clean:
clean:
bundles-clean:
clean:
bundles-clean:
clean:
clean:
clean:
bundles-clean:
pixelbender-clean:
clean:
clean:
clean:
clean:
clean:
bundles-clean:
clean:
bundles-clean:
clean:
clean:
bundles-clean:
clean:
bundles-clean:
clean:
bundles-clean:
clean:
bundles-clean:
clean:
clean:
clean:
[delete] Deleting directory <http://localhost:8080/job/flex-sdk_mustella/ws/frameworks/libs>
local-fonts-snapshot:
[touch] Creating <http://localhost:8080/job/flex-sdk_mustella/ws/frameworks/localFonts.ser>
[touch] Creating <http://localhost:8080/job/flex-sdk_mustella/ws/frameworks/macFonts.ser>
[touch] Creating <http://localhost:8080/job/flex-sdk_mustella/ws/frameworks/winFonts.ser>
thirdparty-downloads:
swfobject-check:
swfobject-download:
swfobject-fabridge-download:
osmf-check:
osmf-download:
ask-osmf:
download-osmf-zip:
[unzip] Expanding: <http://localhost:8080/job/flex-sdk_mustella/ws/in/OSMF_1.0.zip> into <http://localhost:8080/job/flex-sdk_mustella/ws/in>
[unzip] Expanding: <http://localhost:8080/job/flex-sdk_mustella/ws/in/osmf_source_v1-0.zip> into <http://localhost:8080/job/flex-sdk_mustella/ws/frameworks/libs>
blazeds-jar-check:
ask-blazeds:
get-blazeds-jar:
blazeds-jar:
font-jars-check:
ask-font:
get-font-jars:
font-jars:
clean-adobe-flex-sdk:
optional-downloads:
main:
[echo] Use thirdparty-clean or super-clean to remove these.
prepare:
playerglobal-setswfversion:
flex-config:
[copy] Copying 1 file to <http://localhost:8080/job/flex-sdk_mustella/ws/frameworks>
compile:
framework:
bundles-clean:
pixelbender-clean:
assets-clean:
clean:
assets-compile:
[mxmlc] Loading configuration file C:\jenkins_slave\workspace\flex-sdk_mustella\frameworks\flex-config.xml
[mxmlc] C:\jenkins_slave\workspace\flex-sdk_mustella\frameworks\projects\framework\assets\Assets.swf (9035 bytes)
pixelbender-compile:
pixelbender-unzip:
compile:
[echo] Compiling frameworks/libs/framework.swc
[compc] Loading configuration file C:\jenkins_slave\workspace\flex-sdk_mustella\frameworks\flex-config.xml
[compc] Loading configuration file C:\jenkins_slave\workspace\flex-sdk_mustella\frameworks\projects\framework\framework-config.xml
[compc] Loading configuration file C:\jenkins_slave\workspace\flex-sdk_mustella\frameworks\projects\framework\compile-config.xml
[compc] C:\jenkins_slave\workspace\flex-sdk_mustella\frameworks\libs\framework.swc (836276 bytes)
main:
[echo] Compiling frameworks/locale/en_US/framework_rb.swc
[compc] Loading configuration file C:\jenkins_slave\workspace\flex-sdk_mustella\frameworks\projects\framework\bundle-config.xml
[compc] C:\jenkins_slave\workspace\flex-sdk_mustella\frameworks\locale\en_US\framework_rb.swc (16520 bytes)
mx:
bundles-clean:
clean:
compile:
[echo] Compiling frameworks/libs/mx/mx.swc
[compc] Loading configuration file C:\jenkins_slave\workspace\flex-sdk_mustella\frameworks\projects\mx\compile-config.xml
[compc] C:\jenkins_slave\workspace\flex-sdk_mustella\frameworks\projects\mx\src\mx\containers\Accordion.as(2180): col: 22 Error: Incompatible override.
[compc]
[compc] private function removedFromStageHandler(event:Event):void
[compc] ^
[compc]
[compc] C:\jenkins_slave\workspace\flex-sdk_mustella\frameworks\projects\mx\src\mx\containers\Accordion.as(2180): col: 22 Error: Overriding a function that is not marked for override.
[compc]
[compc] private function removedFromStageHandler(event:Event):void
[compc] ^
[compc]
[compc] C:\jenkins_slave\workspace\flex-sdk_mustella\frameworks\projects\mx\src\mx\containers\Accordion.as(1110): col: 56 Error: Ambiguous reference to removedFromStageHandler.
[compc]
[compc] addEventListener(Event.REMOVED_FROM_STAGE, removedFromStageHandler, false, 0, true);
[compc] ^
[compc]
[compc] C:\jenkins_slave\workspace\flex-sdk_mustella\frameworks\projects\mx\src\mx\containers\ViewStack.as(1323): col: 22 Error: Incompatible override.
[compc]
[compc] private function removedFromStageHandler(event:Event):void
[compc] ^
[compc]
[compc] C:\jenkins_slave\workspace\flex-sdk_mustella\frameworks\projects\mx\src\mx\containers\ViewStack.as(1323): col: 22 Error: Overriding a function that is not marked for override.
[compc]
[compc] private function removedFromStageHandler(event:Event):void
[compc] ^
[compc]
[compc] C:\jenkins_slave\workspace\flex-sdk_mustella\frameworks\projects\mx\src\mx\containers\ViewStack.as(793): col: 56 Error: Ambiguous reference to removedFromStageHandler.
[compc]
[compc] addEventListener(Event.REMOVED_FROM_STAGE, removedFromStageHandler, false, 0, true);
[compc] ^
[compc]
[compc] C:\jenkins_slave\workspace\flex-sdk_mustella\frameworks\projects\mx\src\mx\controls\ComboBox.as(2261): col: 22 Error: Incompatible override.
[compc]
[compc] private function removedFromStageHandler(event:Event):void
[compc] ^
[compc]
[compc] C:\jenkins_slave\workspace\flex-sdk_mustella\frameworks\projects\mx\src\mx\controls\ComboBox.as(2261): col: 22 Error: Overriding a function that is not marked for override.
[compc]
[compc] private function removedFromStageHandler(event:Event):void
[compc] ^
[compc]
[compc] C:\jenkins_slave\workspace\flex-sdk_mustella\frameworks\projects\mx\src\mx\controls\ComboBox.as(668): col: 52 Error: Ambiguous reference to removedFromStageHandler.
[compc]
[compc] addEventListener(Event.REMOVED_FROM_STAGE, removedFromStageHandler);
[compc] ^
[compc]
[compc] C:\jenkins_slave\workspace\flex-sdk_mustella\frameworks\projects\mx\src\mx\controls\DateField.as(2740): col: 22 Error: Incompatible override.
[compc]
[compc] private function removedFromStageHandler(event:Event):void
[compc] ^
[compc]
[compc] C:\jenkins_slave\workspace\flex-sdk_mustella\frameworks\projects\mx\src\mx\controls\DateField.as(2740): col: 22 Error: Overriding a function that is not marked for override.
[compc]
[compc] private function removedFromStageHandler(event:Event):void
[compc] ^
[compc]
[compc] C:\jenkins_slave\workspace\flex-sdk_mustella\frameworks\projects\mx\src\mx\controls\DateField.as(715): col: 52 Error: Ambiguous reference to removedFromStageHandler.
[compc]
[compc] addEventListener(Event.REMOVED_FROM_STAGE, removedFromStageHandler);
[compc] ^
[compc]
[compc] C:\jenkins_slave\workspace\flex-sdk_mustella\frameworks\projects\mx\src\mx\controls\PopUpButton.as(1308): col: 22 Error: Incompatible override.
[compc]
[compc] private function removedFromStageHandler(event:Event):void
[compc] ^
[compc]
[compc] C:\jenkins_slave\workspace\flex-sdk_mustella\frameworks\projects\mx\src\mx\controls\PopUpButton.as(1308): col: 22 Error: Overriding a function that is not marked for override.
[compc]
[compc] private function removedFromStageHandler(event:Event):void
[compc] ^
[compc]
[compc] C:\jenkins_slave\workspace\flex-sdk_mustella\frameworks\projects\mx\src\mx\controls\PopUpButton.as(378): col: 52 Error: Ambiguous reference to removedFromStageHandler.
[compc]
[compc] addEventListener(Event.REMOVED_FROM_STAGE, removedFromStageHandler);
[compc] ^
[compc]
BUILD FAILED
<http://localhost:8080/job/flex-sdk_mustella/ws/build.xml>:416: The following error occurred while executing this line:
<http://localhost:8080/job/flex-sdk_mustella/ws/frameworks/build.xml>:113: The following error occurred while executing this line:
<http://localhost:8080/job/flex-sdk_mustella/ws/frameworks/build.xml>:386: The following error occurred while executing this line:
<http://localhost:8080/job/flex-sdk_mustella/ws/frameworks/projects/mx/build.xml>:182: compc task failed.
Total time: 1 minute 49 seconds
Build step 'Invoke Ant' marked build as failure
Build failed in Jenkins: flex-sdk_mustella #323
Posted by fl...@gmail.com.
See <http://localhost:8080/job/flex-sdk_mustella/323/>
------------------------------------------
[...truncated 1055 lines...]
assets-clean:
clean:
bundles-clean:
clean:
bundles-clean:
assets-clean:
clean:
bundles-clean:
clean:
bundles-clean:
clean:
clean:
clean:
bundles-clean:
pixelbender-clean:
clean:
clean:
clean:
clean:
clean:
bundles-clean:
clean:
bundles-clean:
clean:
clean:
bundles-clean:
clean:
bundles-clean:
clean:
bundles-clean:
clean:
bundles-clean:
clean:
clean:
clean:
[delete] Deleting directory <http://localhost:8080/job/flex-sdk_mustella/ws/frameworks/libs>
local-fonts-snapshot:
[touch] Creating <http://localhost:8080/job/flex-sdk_mustella/ws/frameworks/localFonts.ser>
[touch] Creating <http://localhost:8080/job/flex-sdk_mustella/ws/frameworks/macFonts.ser>
[touch] Creating <http://localhost:8080/job/flex-sdk_mustella/ws/frameworks/winFonts.ser>
thirdparty-downloads:
swfobject-check:
swfobject-download:
swfobject-fabridge-download:
osmf-check:
osmf-download:
ask-osmf:
download-osmf-zip:
[unzip] Expanding: <http://localhost:8080/job/flex-sdk_mustella/ws/in/OSMF_1.0.zip> into <http://localhost:8080/job/flex-sdk_mustella/ws/in>
[unzip] Expanding: <http://localhost:8080/job/flex-sdk_mustella/ws/in/osmf_source_v1-0.zip> into <http://localhost:8080/job/flex-sdk_mustella/ws/frameworks/libs>
blazeds-jar-check:
ask-blazeds:
get-blazeds-jar:
blazeds-jar:
font-jars-check:
ask-font:
get-font-jars:
font-jars:
clean-adobe-flex-sdk:
optional-downloads:
main:
[echo] Use thirdparty-clean or super-clean to remove these.
prepare:
playerglobal-setswfversion:
flex-config:
[copy] Copying 1 file to <http://localhost:8080/job/flex-sdk_mustella/ws/frameworks>
compile:
framework:
bundles-clean:
pixelbender-clean:
assets-clean:
clean:
assets-compile:
[mxmlc] Loading configuration file C:\jenkins_slave\workspace\flex-sdk_mustella\frameworks\flex-config.xml
[mxmlc] C:\jenkins_slave\workspace\flex-sdk_mustella\frameworks\projects\framework\assets\Assets.swf (9035 bytes)
pixelbender-compile:
pixelbender-unzip:
compile:
[echo] Compiling frameworks/libs/framework.swc
[compc] Loading configuration file C:\jenkins_slave\workspace\flex-sdk_mustella\frameworks\flex-config.xml
[compc] Loading configuration file C:\jenkins_slave\workspace\flex-sdk_mustella\frameworks\projects\framework\framework-config.xml
[compc] Loading configuration file C:\jenkins_slave\workspace\flex-sdk_mustella\frameworks\projects\framework\compile-config.xml
[compc] C:\jenkins_slave\workspace\flex-sdk_mustella\frameworks\libs\framework.swc (836288 bytes)
main:
[echo] Compiling frameworks/locale/en_US/framework_rb.swc
[compc] Loading configuration file C:\jenkins_slave\workspace\flex-sdk_mustella\frameworks\projects\framework\bundle-config.xml
[compc] C:\jenkins_slave\workspace\flex-sdk_mustella\frameworks\locale\en_US\framework_rb.swc (16519 bytes)
mx:
bundles-clean:
clean:
compile:
[echo] Compiling frameworks/libs/mx/mx.swc
[compc] Loading configuration file C:\jenkins_slave\workspace\flex-sdk_mustella\frameworks\projects\mx\compile-config.xml
[compc] C:\jenkins_slave\workspace\flex-sdk_mustella\frameworks\projects\mx\src\mx\containers\Accordion.as(2180): col: 22 Error: Incompatible override.
[compc]
[compc] private function removedFromStageHandler(event:Event):void
[compc] ^
[compc]
[compc] C:\jenkins_slave\workspace\flex-sdk_mustella\frameworks\projects\mx\src\mx\containers\Accordion.as(2180): col: 22 Error: Overriding a function that is not marked for override.
[compc]
[compc] private function removedFromStageHandler(event:Event):void
[compc] ^
[compc]
[compc] C:\jenkins_slave\workspace\flex-sdk_mustella\frameworks\projects\mx\src\mx\containers\Accordion.as(1110): col: 56 Error: Ambiguous reference to removedFromStageHandler.
[compc]
[compc] addEventListener(Event.REMOVED_FROM_STAGE, removedFromStageHandler, false, 0, true);
[compc] ^
[compc]
[compc] C:\jenkins_slave\workspace\flex-sdk_mustella\frameworks\projects\mx\src\mx\containers\ViewStack.as(1323): col: 22 Error: Incompatible override.
[compc]
[compc] private function removedFromStageHandler(event:Event):void
[compc] ^
[compc]
[compc] C:\jenkins_slave\workspace\flex-sdk_mustella\frameworks\projects\mx\src\mx\containers\ViewStack.as(1323): col: 22 Error: Overriding a function that is not marked for override.
[compc]
[compc] private function removedFromStageHandler(event:Event):void
[compc] ^
[compc]
[compc] C:\jenkins_slave\workspace\flex-sdk_mustella\frameworks\projects\mx\src\mx\containers\ViewStack.as(793): col: 56 Error: Ambiguous reference to removedFromStageHandler.
[compc]
[compc] addEventListener(Event.REMOVED_FROM_STAGE, removedFromStageHandler, false, 0, true);
[compc] ^
[compc]
[compc] C:\jenkins_slave\workspace\flex-sdk_mustella\frameworks\projects\mx\src\mx\controls\ComboBox.as(2261): col: 22 Error: Incompatible override.
[compc]
[compc] private function removedFromStageHandler(event:Event):void
[compc] ^
[compc]
[compc] C:\jenkins_slave\workspace\flex-sdk_mustella\frameworks\projects\mx\src\mx\controls\ComboBox.as(2261): col: 22 Error: Overriding a function that is not marked for override.
[compc]
[compc] private function removedFromStageHandler(event:Event):void
[compc] ^
[compc]
[compc] C:\jenkins_slave\workspace\flex-sdk_mustella\frameworks\projects\mx\src\mx\controls\ComboBox.as(668): col: 52 Error: Ambiguous reference to removedFromStageHandler.
[compc]
[compc] addEventListener(Event.REMOVED_FROM_STAGE, removedFromStageHandler);
[compc] ^
[compc]
[compc] C:\jenkins_slave\workspace\flex-sdk_mustella\frameworks\projects\mx\src\mx\controls\DateField.as(2740): col: 22 Error: Incompatible override.
[compc]
[compc] private function removedFromStageHandler(event:Event):void
[compc] ^
[compc]
[compc] C:\jenkins_slave\workspace\flex-sdk_mustella\frameworks\projects\mx\src\mx\controls\DateField.as(2740): col: 22 Error: Overriding a function that is not marked for override.
[compc]
[compc] private function removedFromStageHandler(event:Event):void
[compc] ^
[compc]
[compc] C:\jenkins_slave\workspace\flex-sdk_mustella\frameworks\projects\mx\src\mx\controls\DateField.as(715): col: 52 Error: Ambiguous reference to removedFromStageHandler.
[compc]
[compc] addEventListener(Event.REMOVED_FROM_STAGE, removedFromStageHandler);
[compc] ^
[compc]
[compc] C:\jenkins_slave\workspace\flex-sdk_mustella\frameworks\projects\mx\src\mx\controls\PopUpButton.as(1308): col: 22 Error: Incompatible override.
[compc]
[compc] private function removedFromStageHandler(event:Event):void
[compc] ^
[compc]
[compc] C:\jenkins_slave\workspace\flex-sdk_mustella\frameworks\projects\mx\src\mx\controls\PopUpButton.as(1308): col: 22 Error: Overriding a function that is not marked for override.
[compc]
[compc] private function removedFromStageHandler(event:Event):void
[compc] ^
[compc]
[compc] C:\jenkins_slave\workspace\flex-sdk_mustella\frameworks\projects\mx\src\mx\controls\PopUpButton.as(378): col: 52 Error: Ambiguous reference to removedFromStageHandler.
[compc]
[compc] addEventListener(Event.REMOVED_FROM_STAGE, removedFromStageHandler);
[compc] ^
[compc]
BUILD FAILED
<http://localhost:8080/job/flex-sdk_mustella/ws/build.xml>:416: The following error occurred while executing this line:
<http://localhost:8080/job/flex-sdk_mustella/ws/frameworks/build.xml>:113: The following error occurred while executing this line:
<http://localhost:8080/job/flex-sdk_mustella/ws/frameworks/build.xml>:386: The following error occurred while executing this line:
<http://localhost:8080/job/flex-sdk_mustella/ws/frameworks/projects/mx/build.xml>:182: compc task failed.
Total time: 1 minute 45 seconds
Build step 'Invoke Ant' marked build as failure
Build failed in Jenkins: flex-sdk_mustella #322
Posted by fl...@gmail.com.
See <http://localhost:8080/job/flex-sdk_mustella/322/>
------------------------------------------
[...truncated 1056 lines...]
assets-clean:
clean:
bundles-clean:
clean:
bundles-clean:
assets-clean:
clean:
bundles-clean:
clean:
bundles-clean:
clean:
clean:
clean:
bundles-clean:
pixelbender-clean:
clean:
clean:
clean:
clean:
clean:
bundles-clean:
clean:
bundles-clean:
clean:
clean:
bundles-clean:
clean:
bundles-clean:
clean:
bundles-clean:
clean:
bundles-clean:
clean:
clean:
clean:
[delete] Deleting directory <http://localhost:8080/job/flex-sdk_mustella/ws/frameworks/libs>
local-fonts-snapshot:
[touch] Creating <http://localhost:8080/job/flex-sdk_mustella/ws/frameworks/localFonts.ser>
[touch] Creating <http://localhost:8080/job/flex-sdk_mustella/ws/frameworks/macFonts.ser>
[touch] Creating <http://localhost:8080/job/flex-sdk_mustella/ws/frameworks/winFonts.ser>
thirdparty-downloads:
swfobject-check:
swfobject-download:
swfobject-fabridge-download:
osmf-check:
osmf-download:
ask-osmf:
download-osmf-zip:
[unzip] Expanding: <http://localhost:8080/job/flex-sdk_mustella/ws/in/OSMF_1.0.zip> into <http://localhost:8080/job/flex-sdk_mustella/ws/in>
[unzip] Expanding: <http://localhost:8080/job/flex-sdk_mustella/ws/in/osmf_source_v1-0.zip> into <http://localhost:8080/job/flex-sdk_mustella/ws/frameworks/libs>
blazeds-jar-check:
ask-blazeds:
get-blazeds-jar:
blazeds-jar:
font-jars-check:
ask-font:
get-font-jars:
font-jars:
clean-adobe-flex-sdk:
optional-downloads:
main:
[echo] Use thirdparty-clean or super-clean to remove these.
prepare:
playerglobal-setswfversion:
flex-config:
[copy] Copying 1 file to <http://localhost:8080/job/flex-sdk_mustella/ws/frameworks>
compile:
framework:
bundles-clean:
pixelbender-clean:
assets-clean:
clean:
assets-compile:
[mxmlc] Loading configuration file C:\jenkins_slave\workspace\flex-sdk_mustella\frameworks\flex-config.xml
[mxmlc] C:\jenkins_slave\workspace\flex-sdk_mustella\frameworks\projects\framework\assets\Assets.swf (9035 bytes)
pixelbender-compile:
pixelbender-unzip:
compile:
[echo] Compiling frameworks/libs/framework.swc
[compc] Loading configuration file C:\jenkins_slave\workspace\flex-sdk_mustella\frameworks\flex-config.xml
[compc] Loading configuration file C:\jenkins_slave\workspace\flex-sdk_mustella\frameworks\projects\framework\framework-config.xml
[compc] Loading configuration file C:\jenkins_slave\workspace\flex-sdk_mustella\frameworks\projects\framework\compile-config.xml
[compc] C:\jenkins_slave\workspace\flex-sdk_mustella\frameworks\libs\framework.swc (836270 bytes)
main:
[echo] Compiling frameworks/locale/en_US/framework_rb.swc
[compc] Loading configuration file C:\jenkins_slave\workspace\flex-sdk_mustella\frameworks\projects\framework\bundle-config.xml
[compc] C:\jenkins_slave\workspace\flex-sdk_mustella\frameworks\locale\en_US\framework_rb.swc (16522 bytes)
mx:
bundles-clean:
clean:
compile:
[echo] Compiling frameworks/libs/mx/mx.swc
[compc] Loading configuration file C:\jenkins_slave\workspace\flex-sdk_mustella\frameworks\projects\mx\compile-config.xml
[compc] C:\jenkins_slave\workspace\flex-sdk_mustella\frameworks\projects\mx\src\mx\containers\Accordion.as(2180): col: 22 Error: Incompatible override.
[compc]
[compc] private function removedFromStageHandler(event:Event):void
[compc] ^
[compc]
[compc] C:\jenkins_slave\workspace\flex-sdk_mustella\frameworks\projects\mx\src\mx\containers\Accordion.as(2180): col: 22 Error: Overriding a function that is not marked for override.
[compc]
[compc] private function removedFromStageHandler(event:Event):void
[compc] ^
[compc]
[compc] C:\jenkins_slave\workspace\flex-sdk_mustella\frameworks\projects\mx\src\mx\containers\Accordion.as(1110): col: 56 Error: Ambiguous reference to removedFromStageHandler.
[compc]
[compc] addEventListener(Event.REMOVED_FROM_STAGE, removedFromStageHandler, false, 0, true);
[compc] ^
[compc]
[compc] C:\jenkins_slave\workspace\flex-sdk_mustella\frameworks\projects\mx\src\mx\containers\ViewStack.as(1323): col: 22 Error: Incompatible override.
[compc]
[compc] private function removedFromStageHandler(event:Event):void
[compc] ^
[compc]
[compc] C:\jenkins_slave\workspace\flex-sdk_mustella\frameworks\projects\mx\src\mx\containers\ViewStack.as(1323): col: 22 Error: Overriding a function that is not marked for override.
[compc]
[compc] private function removedFromStageHandler(event:Event):void
[compc] ^
[compc]
[compc] C:\jenkins_slave\workspace\flex-sdk_mustella\frameworks\projects\mx\src\mx\containers\ViewStack.as(793): col: 56 Error: Ambiguous reference to removedFromStageHandler.
[compc]
[compc] addEventListener(Event.REMOVED_FROM_STAGE, removedFromStageHandler, false, 0, true);
[compc] ^
[compc]
[compc] C:\jenkins_slave\workspace\flex-sdk_mustella\frameworks\projects\mx\src\mx\controls\ComboBox.as(2261): col: 22 Error: Incompatible override.
[compc]
[compc] private function removedFromStageHandler(event:Event):void
[compc] ^
[compc]
[compc] C:\jenkins_slave\workspace\flex-sdk_mustella\frameworks\projects\mx\src\mx\controls\ComboBox.as(2261): col: 22 Error: Overriding a function that is not marked for override.
[compc]
[compc] private function removedFromStageHandler(event:Event):void
[compc] ^
[compc]
[compc] C:\jenkins_slave\workspace\flex-sdk_mustella\frameworks\projects\mx\src\mx\controls\ComboBox.as(668): col: 52 Error: Ambiguous reference to removedFromStageHandler.
[compc]
[compc] addEventListener(Event.REMOVED_FROM_STAGE, removedFromStageHandler);
[compc] ^
[compc]
[compc] C:\jenkins_slave\workspace\flex-sdk_mustella\frameworks\projects\mx\src\mx\controls\DateField.as(2740): col: 22 Error: Incompatible override.
[compc]
[compc] private function removedFromStageHandler(event:Event):void
[compc] ^
[compc]
[compc] C:\jenkins_slave\workspace\flex-sdk_mustella\frameworks\projects\mx\src\mx\controls\DateField.as(2740): col: 22 Error: Overriding a function that is not marked for override.
[compc]
[compc] private function removedFromStageHandler(event:Event):void
[compc] ^
[compc]
[compc] C:\jenkins_slave\workspace\flex-sdk_mustella\frameworks\projects\mx\src\mx\controls\DateField.as(715): col: 52 Error: Ambiguous reference to removedFromStageHandler.
[compc]
[compc] addEventListener(Event.REMOVED_FROM_STAGE, removedFromStageHandler);
[compc] ^
[compc]
[compc] C:\jenkins_slave\workspace\flex-sdk_mustella\frameworks\projects\mx\src\mx\controls\PopUpButton.as(1308): col: 22 Error: Incompatible override.
[compc]
[compc] private function removedFromStageHandler(event:Event):void
[compc] ^
[compc]
[compc] C:\jenkins_slave\workspace\flex-sdk_mustella\frameworks\projects\mx\src\mx\controls\PopUpButton.as(1308): col: 22 Error: Overriding a function that is not marked for override.
[compc]
[compc] private function removedFromStageHandler(event:Event):void
[compc] ^
[compc]
[compc] C:\jenkins_slave\workspace\flex-sdk_mustella\frameworks\projects\mx\src\mx\controls\PopUpButton.as(378): col: 52 Error: Ambiguous reference to removedFromStageHandler.
[compc]
[compc] addEventListener(Event.REMOVED_FROM_STAGE, removedFromStageHandler);
[compc] ^
[compc]
BUILD FAILED
<http://localhost:8080/job/flex-sdk_mustella/ws/build.xml>:416: The following error occurred while executing this line:
<http://localhost:8080/job/flex-sdk_mustella/ws/frameworks/build.xml>:113: The following error occurred while executing this line:
<http://localhost:8080/job/flex-sdk_mustella/ws/frameworks/build.xml>:386: The following error occurred while executing this line:
<http://localhost:8080/job/flex-sdk_mustella/ws/frameworks/projects/mx/build.xml>:182: compc task failed.
Total time: 1 minute 47 seconds
Build step 'Invoke Ant' marked build as failure
Build failed in Jenkins: flex-sdk_mustella #321
Posted by fl...@gmail.com.
See <http://localhost:8080/job/flex-sdk_mustella/321/>
------------------------------------------
[...truncated 1055 lines...]
assets-clean:
clean:
bundles-clean:
clean:
bundles-clean:
assets-clean:
clean:
bundles-clean:
clean:
bundles-clean:
clean:
clean:
clean:
bundles-clean:
pixelbender-clean:
clean:
clean:
clean:
clean:
clean:
bundles-clean:
clean:
bundles-clean:
clean:
clean:
bundles-clean:
clean:
bundles-clean:
clean:
bundles-clean:
clean:
bundles-clean:
clean:
clean:
clean:
[delete] Deleting directory <http://localhost:8080/job/flex-sdk_mustella/ws/frameworks/libs>
local-fonts-snapshot:
[touch] Creating <http://localhost:8080/job/flex-sdk_mustella/ws/frameworks/localFonts.ser>
[touch] Creating <http://localhost:8080/job/flex-sdk_mustella/ws/frameworks/macFonts.ser>
[touch] Creating <http://localhost:8080/job/flex-sdk_mustella/ws/frameworks/winFonts.ser>
thirdparty-downloads:
swfobject-check:
swfobject-download:
swfobject-fabridge-download:
osmf-check:
osmf-download:
ask-osmf:
download-osmf-zip:
[unzip] Expanding: <http://localhost:8080/job/flex-sdk_mustella/ws/in/OSMF_1.0.zip> into <http://localhost:8080/job/flex-sdk_mustella/ws/in>
[unzip] Expanding: <http://localhost:8080/job/flex-sdk_mustella/ws/in/osmf_source_v1-0.zip> into <http://localhost:8080/job/flex-sdk_mustella/ws/frameworks/libs>
blazeds-jar-check:
ask-blazeds:
get-blazeds-jar:
blazeds-jar:
font-jars-check:
ask-font:
get-font-jars:
font-jars:
clean-adobe-flex-sdk:
optional-downloads:
main:
[echo] Use thirdparty-clean or super-clean to remove these.
prepare:
playerglobal-setswfversion:
flex-config:
[copy] Copying 1 file to <http://localhost:8080/job/flex-sdk_mustella/ws/frameworks>
compile:
framework:
bundles-clean:
pixelbender-clean:
assets-clean:
clean:
assets-compile:
[mxmlc] Loading configuration file C:\jenkins_slave\workspace\flex-sdk_mustella\frameworks\flex-config.xml
[mxmlc] C:\jenkins_slave\workspace\flex-sdk_mustella\frameworks\projects\framework\assets\Assets.swf (9035 bytes)
pixelbender-compile:
pixelbender-unzip:
compile:
[echo] Compiling frameworks/libs/framework.swc
[compc] Loading configuration file C:\jenkins_slave\workspace\flex-sdk_mustella\frameworks\flex-config.xml
[compc] Loading configuration file C:\jenkins_slave\workspace\flex-sdk_mustella\frameworks\projects\framework\framework-config.xml
[compc] Loading configuration file C:\jenkins_slave\workspace\flex-sdk_mustella\frameworks\projects\framework\compile-config.xml
[compc] C:\jenkins_slave\workspace\flex-sdk_mustella\frameworks\libs\framework.swc (836319 bytes)
main:
[echo] Compiling frameworks/locale/en_US/framework_rb.swc
[compc] Loading configuration file C:\jenkins_slave\workspace\flex-sdk_mustella\frameworks\projects\framework\bundle-config.xml
[compc] C:\jenkins_slave\workspace\flex-sdk_mustella\frameworks\locale\en_US\framework_rb.swc (16515 bytes)
mx:
bundles-clean:
clean:
compile:
[echo] Compiling frameworks/libs/mx/mx.swc
[compc] Loading configuration file C:\jenkins_slave\workspace\flex-sdk_mustella\frameworks\projects\mx\compile-config.xml
[compc] C:\jenkins_slave\workspace\flex-sdk_mustella\frameworks\projects\mx\src\mx\containers\Accordion.as(2180): col: 22 Error: Incompatible override.
[compc]
[compc] private function removedFromStageHandler(event:Event):void
[compc] ^
[compc]
[compc] C:\jenkins_slave\workspace\flex-sdk_mustella\frameworks\projects\mx\src\mx\containers\Accordion.as(2180): col: 22 Error: Overriding a function that is not marked for override.
[compc]
[compc] private function removedFromStageHandler(event:Event):void
[compc] ^
[compc]
[compc] C:\jenkins_slave\workspace\flex-sdk_mustella\frameworks\projects\mx\src\mx\containers\Accordion.as(1110): col: 56 Error: Ambiguous reference to removedFromStageHandler.
[compc]
[compc] addEventListener(Event.REMOVED_FROM_STAGE, removedFromStageHandler, false, 0, true);
[compc] ^
[compc]
[compc] C:\jenkins_slave\workspace\flex-sdk_mustella\frameworks\projects\mx\src\mx\containers\ViewStack.as(1323): col: 22 Error: Incompatible override.
[compc]
[compc] private function removedFromStageHandler(event:Event):void
[compc] ^
[compc]
[compc] C:\jenkins_slave\workspace\flex-sdk_mustella\frameworks\projects\mx\src\mx\containers\ViewStack.as(1323): col: 22 Error: Overriding a function that is not marked for override.
[compc]
[compc] private function removedFromStageHandler(event:Event):void
[compc] ^
[compc]
[compc] C:\jenkins_slave\workspace\flex-sdk_mustella\frameworks\projects\mx\src\mx\containers\ViewStack.as(793): col: 56 Error: Ambiguous reference to removedFromStageHandler.
[compc]
[compc] addEventListener(Event.REMOVED_FROM_STAGE, removedFromStageHandler, false, 0, true);
[compc] ^
[compc]
[compc] C:\jenkins_slave\workspace\flex-sdk_mustella\frameworks\projects\mx\src\mx\controls\ComboBox.as(2261): col: 22 Error: Incompatible override.
[compc]
[compc] private function removedFromStageHandler(event:Event):void
[compc] ^
[compc]
[compc] C:\jenkins_slave\workspace\flex-sdk_mustella\frameworks\projects\mx\src\mx\controls\ComboBox.as(2261): col: 22 Error: Overriding a function that is not marked for override.
[compc]
[compc] private function removedFromStageHandler(event:Event):void
[compc] ^
[compc]
[compc] C:\jenkins_slave\workspace\flex-sdk_mustella\frameworks\projects\mx\src\mx\controls\ComboBox.as(668): col: 52 Error: Ambiguous reference to removedFromStageHandler.
[compc]
[compc] addEventListener(Event.REMOVED_FROM_STAGE, removedFromStageHandler);
[compc] ^
[compc]
[compc] C:\jenkins_slave\workspace\flex-sdk_mustella\frameworks\projects\mx\src\mx\controls\DateField.as(2740): col: 22 Error: Incompatible override.
[compc]
[compc] private function removedFromStageHandler(event:Event):void
[compc] ^
[compc]
[compc] C:\jenkins_slave\workspace\flex-sdk_mustella\frameworks\projects\mx\src\mx\controls\DateField.as(2740): col: 22 Error: Overriding a function that is not marked for override.
[compc]
[compc] private function removedFromStageHandler(event:Event):void
[compc] ^
[compc]
[compc] C:\jenkins_slave\workspace\flex-sdk_mustella\frameworks\projects\mx\src\mx\controls\DateField.as(715): col: 52 Error: Ambiguous reference to removedFromStageHandler.
[compc]
[compc] addEventListener(Event.REMOVED_FROM_STAGE, removedFromStageHandler);
[compc] ^
[compc]
[compc] C:\jenkins_slave\workspace\flex-sdk_mustella\frameworks\projects\mx\src\mx\controls\PopUpButton.as(1308): col: 22 Error: Incompatible override.
[compc]
[compc] private function removedFromStageHandler(event:Event):void
[compc] ^
[compc]
[compc] C:\jenkins_slave\workspace\flex-sdk_mustella\frameworks\projects\mx\src\mx\controls\PopUpButton.as(1308): col: 22 Error: Overriding a function that is not marked for override.
[compc]
[compc] private function removedFromStageHandler(event:Event):void
[compc] ^
[compc]
[compc] C:\jenkins_slave\workspace\flex-sdk_mustella\frameworks\projects\mx\src\mx\controls\PopUpButton.as(378): col: 52 Error: Ambiguous reference to removedFromStageHandler.
[compc]
[compc] addEventListener(Event.REMOVED_FROM_STAGE, removedFromStageHandler);
[compc] ^
[compc]
BUILD FAILED
<http://localhost:8080/job/flex-sdk_mustella/ws/build.xml>:416: The following error occurred while executing this line:
<http://localhost:8080/job/flex-sdk_mustella/ws/frameworks/build.xml>:113: The following error occurred while executing this line:
<http://localhost:8080/job/flex-sdk_mustella/ws/frameworks/build.xml>:386: The following error occurred while executing this line:
<http://localhost:8080/job/flex-sdk_mustella/ws/frameworks/projects/mx/build.xml>:182: compc task failed.
Total time: 1 minute 46 seconds
Build step 'Invoke Ant' marked build as failure
Build failed in Jenkins: flex-sdk_mustella #320
Posted by fl...@gmail.com.
See <http://localhost:8080/job/flex-sdk_mustella/320/>
------------------------------------------
[...truncated 1055 lines...]
assets-clean:
clean:
bundles-clean:
clean:
bundles-clean:
assets-clean:
clean:
bundles-clean:
clean:
bundles-clean:
clean:
clean:
clean:
bundles-clean:
pixelbender-clean:
clean:
clean:
clean:
clean:
clean:
bundles-clean:
clean:
bundles-clean:
clean:
clean:
bundles-clean:
clean:
bundles-clean:
clean:
bundles-clean:
clean:
bundles-clean:
clean:
clean:
clean:
[delete] Deleting directory <http://localhost:8080/job/flex-sdk_mustella/ws/frameworks/libs>
local-fonts-snapshot:
[touch] Creating <http://localhost:8080/job/flex-sdk_mustella/ws/frameworks/localFonts.ser>
[touch] Creating <http://localhost:8080/job/flex-sdk_mustella/ws/frameworks/macFonts.ser>
[touch] Creating <http://localhost:8080/job/flex-sdk_mustella/ws/frameworks/winFonts.ser>
thirdparty-downloads:
swfobject-check:
swfobject-download:
swfobject-fabridge-download:
osmf-check:
osmf-download:
ask-osmf:
download-osmf-zip:
[unzip] Expanding: <http://localhost:8080/job/flex-sdk_mustella/ws/in/OSMF_1.0.zip> into <http://localhost:8080/job/flex-sdk_mustella/ws/in>
[unzip] Expanding: <http://localhost:8080/job/flex-sdk_mustella/ws/in/osmf_source_v1-0.zip> into <http://localhost:8080/job/flex-sdk_mustella/ws/frameworks/libs>
blazeds-jar-check:
ask-blazeds:
get-blazeds-jar:
blazeds-jar:
font-jars-check:
ask-font:
get-font-jars:
font-jars:
clean-adobe-flex-sdk:
optional-downloads:
main:
[echo] Use thirdparty-clean or super-clean to remove these.
prepare:
playerglobal-setswfversion:
flex-config:
[copy] Copying 1 file to <http://localhost:8080/job/flex-sdk_mustella/ws/frameworks>
compile:
framework:
bundles-clean:
pixelbender-clean:
assets-clean:
clean:
assets-compile:
[mxmlc] Loading configuration file C:\jenkins_slave\workspace\flex-sdk_mustella\frameworks\flex-config.xml
[mxmlc] C:\jenkins_slave\workspace\flex-sdk_mustella\frameworks\projects\framework\assets\Assets.swf (9036 bytes)
pixelbender-compile:
pixelbender-unzip:
compile:
[echo] Compiling frameworks/libs/framework.swc
[compc] Loading configuration file C:\jenkins_slave\workspace\flex-sdk_mustella\frameworks\flex-config.xml
[compc] Loading configuration file C:\jenkins_slave\workspace\flex-sdk_mustella\frameworks\projects\framework\framework-config.xml
[compc] Loading configuration file C:\jenkins_slave\workspace\flex-sdk_mustella\frameworks\projects\framework\compile-config.xml
[compc] C:\jenkins_slave\workspace\flex-sdk_mustella\frameworks\libs\framework.swc (836288 bytes)
main:
[echo] Compiling frameworks/locale/en_US/framework_rb.swc
[compc] Loading configuration file C:\jenkins_slave\workspace\flex-sdk_mustella\frameworks\projects\framework\bundle-config.xml
[compc] C:\jenkins_slave\workspace\flex-sdk_mustella\frameworks\locale\en_US\framework_rb.swc (16517 bytes)
mx:
bundles-clean:
clean:
compile:
[echo] Compiling frameworks/libs/mx/mx.swc
[compc] Loading configuration file C:\jenkins_slave\workspace\flex-sdk_mustella\frameworks\projects\mx\compile-config.xml
[compc] C:\jenkins_slave\workspace\flex-sdk_mustella\frameworks\projects\mx\src\mx\containers\Accordion.as(2180): col: 22 Error: Incompatible override.
[compc]
[compc] private function removedFromStageHandler(event:Event):void
[compc] ^
[compc]
[compc] C:\jenkins_slave\workspace\flex-sdk_mustella\frameworks\projects\mx\src\mx\containers\Accordion.as(2180): col: 22 Error: Overriding a function that is not marked for override.
[compc]
[compc] private function removedFromStageHandler(event:Event):void
[compc] ^
[compc]
[compc] C:\jenkins_slave\workspace\flex-sdk_mustella\frameworks\projects\mx\src\mx\containers\Accordion.as(1110): col: 56 Error: Ambiguous reference to removedFromStageHandler.
[compc]
[compc] addEventListener(Event.REMOVED_FROM_STAGE, removedFromStageHandler, false, 0, true);
[compc] ^
[compc]
[compc] C:\jenkins_slave\workspace\flex-sdk_mustella\frameworks\projects\mx\src\mx\containers\ViewStack.as(1323): col: 22 Error: Incompatible override.
[compc]
[compc] private function removedFromStageHandler(event:Event):void
[compc] ^
[compc]
[compc] C:\jenkins_slave\workspace\flex-sdk_mustella\frameworks\projects\mx\src\mx\containers\ViewStack.as(1323): col: 22 Error: Overriding a function that is not marked for override.
[compc]
[compc] private function removedFromStageHandler(event:Event):void
[compc] ^
[compc]
[compc] C:\jenkins_slave\workspace\flex-sdk_mustella\frameworks\projects\mx\src\mx\containers\ViewStack.as(793): col: 56 Error: Ambiguous reference to removedFromStageHandler.
[compc]
[compc] addEventListener(Event.REMOVED_FROM_STAGE, removedFromStageHandler, false, 0, true);
[compc] ^
[compc]
[compc] C:\jenkins_slave\workspace\flex-sdk_mustella\frameworks\projects\mx\src\mx\controls\ComboBox.as(2261): col: 22 Error: Incompatible override.
[compc]
[compc] private function removedFromStageHandler(event:Event):void
[compc] ^
[compc]
[compc] C:\jenkins_slave\workspace\flex-sdk_mustella\frameworks\projects\mx\src\mx\controls\ComboBox.as(2261): col: 22 Error: Overriding a function that is not marked for override.
[compc]
[compc] private function removedFromStageHandler(event:Event):void
[compc] ^
[compc]
[compc] C:\jenkins_slave\workspace\flex-sdk_mustella\frameworks\projects\mx\src\mx\controls\ComboBox.as(668): col: 52 Error: Ambiguous reference to removedFromStageHandler.
[compc]
[compc] addEventListener(Event.REMOVED_FROM_STAGE, removedFromStageHandler);
[compc] ^
[compc]
[compc] C:\jenkins_slave\workspace\flex-sdk_mustella\frameworks\projects\mx\src\mx\controls\DateField.as(2740): col: 22 Error: Incompatible override.
[compc]
[compc] private function removedFromStageHandler(event:Event):void
[compc] ^
[compc]
[compc] C:\jenkins_slave\workspace\flex-sdk_mustella\frameworks\projects\mx\src\mx\controls\DateField.as(2740): col: 22 Error: Overriding a function that is not marked for override.
[compc]
[compc] private function removedFromStageHandler(event:Event):void
[compc] ^
[compc]
[compc] C:\jenkins_slave\workspace\flex-sdk_mustella\frameworks\projects\mx\src\mx\controls\DateField.as(715): col: 52 Error: Ambiguous reference to removedFromStageHandler.
[compc]
[compc] addEventListener(Event.REMOVED_FROM_STAGE, removedFromStageHandler);
[compc] ^
[compc]
[compc] C:\jenkins_slave\workspace\flex-sdk_mustella\frameworks\projects\mx\src\mx\controls\PopUpButton.as(1308): col: 22 Error: Incompatible override.
[compc]
[compc] private function removedFromStageHandler(event:Event):void
[compc] ^
[compc]
[compc] C:\jenkins_slave\workspace\flex-sdk_mustella\frameworks\projects\mx\src\mx\controls\PopUpButton.as(1308): col: 22 Error: Overriding a function that is not marked for override.
[compc]
[compc] private function removedFromStageHandler(event:Event):void
[compc] ^
[compc]
[compc] C:\jenkins_slave\workspace\flex-sdk_mustella\frameworks\projects\mx\src\mx\controls\PopUpButton.as(378): col: 52 Error: Ambiguous reference to removedFromStageHandler.
[compc]
[compc] addEventListener(Event.REMOVED_FROM_STAGE, removedFromStageHandler);
[compc] ^
[compc]
BUILD FAILED
<http://localhost:8080/job/flex-sdk_mustella/ws/build.xml>:416: The following error occurred while executing this line:
<http://localhost:8080/job/flex-sdk_mustella/ws/frameworks/build.xml>:113: The following error occurred while executing this line:
<http://localhost:8080/job/flex-sdk_mustella/ws/frameworks/build.xml>:386: The following error occurred while executing this line:
<http://localhost:8080/job/flex-sdk_mustella/ws/frameworks/projects/mx/build.xml>:182: compc task failed.
Total time: 1 minute 47 seconds
Build step 'Invoke Ant' marked build as failure
Build failed in Jenkins: flex-sdk_mustella #319
Posted by fl...@gmail.com.
See <http://localhost:8080/job/flex-sdk_mustella/319/>
------------------------------------------
[...truncated 1056 lines...]
assets-clean:
clean:
bundles-clean:
clean:
bundles-clean:
assets-clean:
clean:
bundles-clean:
clean:
bundles-clean:
clean:
clean:
clean:
bundles-clean:
pixelbender-clean:
clean:
clean:
clean:
clean:
clean:
bundles-clean:
clean:
bundles-clean:
clean:
clean:
bundles-clean:
clean:
bundles-clean:
clean:
bundles-clean:
clean:
bundles-clean:
clean:
clean:
clean:
[delete] Deleting directory <http://localhost:8080/job/flex-sdk_mustella/ws/frameworks/libs>
local-fonts-snapshot:
[touch] Creating <http://localhost:8080/job/flex-sdk_mustella/ws/frameworks/localFonts.ser>
[touch] Creating <http://localhost:8080/job/flex-sdk_mustella/ws/frameworks/macFonts.ser>
[touch] Creating <http://localhost:8080/job/flex-sdk_mustella/ws/frameworks/winFonts.ser>
thirdparty-downloads:
swfobject-check:
swfobject-download:
swfobject-fabridge-download:
osmf-check:
osmf-download:
ask-osmf:
download-osmf-zip:
[unzip] Expanding: <http://localhost:8080/job/flex-sdk_mustella/ws/in/OSMF_1.0.zip> into <http://localhost:8080/job/flex-sdk_mustella/ws/in>
[unzip] Expanding: <http://localhost:8080/job/flex-sdk_mustella/ws/in/osmf_source_v1-0.zip> into <http://localhost:8080/job/flex-sdk_mustella/ws/frameworks/libs>
blazeds-jar-check:
ask-blazeds:
get-blazeds-jar:
blazeds-jar:
font-jars-check:
ask-font:
get-font-jars:
font-jars:
clean-adobe-flex-sdk:
optional-downloads:
main:
[echo] Use thirdparty-clean or super-clean to remove these.
prepare:
playerglobal-setswfversion:
flex-config:
[copy] Copying 1 file to <http://localhost:8080/job/flex-sdk_mustella/ws/frameworks>
compile:
framework:
bundles-clean:
pixelbender-clean:
assets-clean:
clean:
assets-compile:
[mxmlc] Loading configuration file C:\jenkins_slave\workspace\flex-sdk_mustella\frameworks\flex-config.xml
[mxmlc] C:\jenkins_slave\workspace\flex-sdk_mustella\frameworks\projects\framework\assets\Assets.swf (9034 bytes)
pixelbender-compile:
pixelbender-unzip:
compile:
[echo] Compiling frameworks/libs/framework.swc
[compc] Loading configuration file C:\jenkins_slave\workspace\flex-sdk_mustella\frameworks\flex-config.xml
[compc] Loading configuration file C:\jenkins_slave\workspace\flex-sdk_mustella\frameworks\projects\framework\framework-config.xml
[compc] Loading configuration file C:\jenkins_slave\workspace\flex-sdk_mustella\frameworks\projects\framework\compile-config.xml
[compc] C:\jenkins_slave\workspace\flex-sdk_mustella\frameworks\libs\framework.swc (836290 bytes)
main:
[echo] Compiling frameworks/locale/en_US/framework_rb.swc
[compc] Loading configuration file C:\jenkins_slave\workspace\flex-sdk_mustella\frameworks\projects\framework\bundle-config.xml
[compc] C:\jenkins_slave\workspace\flex-sdk_mustella\frameworks\locale\en_US\framework_rb.swc (16519 bytes)
mx:
bundles-clean:
clean:
compile:
[echo] Compiling frameworks/libs/mx/mx.swc
[compc] Loading configuration file C:\jenkins_slave\workspace\flex-sdk_mustella\frameworks\projects\mx\compile-config.xml
[compc] C:\jenkins_slave\workspace\flex-sdk_mustella\frameworks\projects\mx\src\mx\containers\Accordion.as(2180): col: 22 Error: Incompatible override.
[compc]
[compc] private function removedFromStageHandler(event:Event):void
[compc] ^
[compc]
[compc] C:\jenkins_slave\workspace\flex-sdk_mustella\frameworks\projects\mx\src\mx\containers\Accordion.as(2180): col: 22 Error: Overriding a function that is not marked for override.
[compc]
[compc] private function removedFromStageHandler(event:Event):void
[compc] ^
[compc]
[compc] C:\jenkins_slave\workspace\flex-sdk_mustella\frameworks\projects\mx\src\mx\containers\Accordion.as(1110): col: 56 Error: Ambiguous reference to removedFromStageHandler.
[compc]
[compc] addEventListener(Event.REMOVED_FROM_STAGE, removedFromStageHandler, false, 0, true);
[compc] ^
[compc]
[compc] C:\jenkins_slave\workspace\flex-sdk_mustella\frameworks\projects\mx\src\mx\containers\ViewStack.as(1323): col: 22 Error: Incompatible override.
[compc]
[compc] private function removedFromStageHandler(event:Event):void
[compc] ^
[compc]
[compc] C:\jenkins_slave\workspace\flex-sdk_mustella\frameworks\projects\mx\src\mx\containers\ViewStack.as(1323): col: 22 Error: Overriding a function that is not marked for override.
[compc]
[compc] private function removedFromStageHandler(event:Event):void
[compc] ^
[compc]
[compc] C:\jenkins_slave\workspace\flex-sdk_mustella\frameworks\projects\mx\src\mx\containers\ViewStack.as(793): col: 56 Error: Ambiguous reference to removedFromStageHandler.
[compc]
[compc] addEventListener(Event.REMOVED_FROM_STAGE, removedFromStageHandler, false, 0, true);
[compc] ^
[compc]
[compc] C:\jenkins_slave\workspace\flex-sdk_mustella\frameworks\projects\mx\src\mx\controls\ComboBox.as(2261): col: 22 Error: Incompatible override.
[compc]
[compc] private function removedFromStageHandler(event:Event):void
[compc] ^
[compc]
[compc] C:\jenkins_slave\workspace\flex-sdk_mustella\frameworks\projects\mx\src\mx\controls\ComboBox.as(2261): col: 22 Error: Overriding a function that is not marked for override.
[compc]
[compc] private function removedFromStageHandler(event:Event):void
[compc] ^
[compc]
[compc] C:\jenkins_slave\workspace\flex-sdk_mustella\frameworks\projects\mx\src\mx\controls\ComboBox.as(668): col: 52 Error: Ambiguous reference to removedFromStageHandler.
[compc]
[compc] addEventListener(Event.REMOVED_FROM_STAGE, removedFromStageHandler);
[compc] ^
[compc]
[compc] C:\jenkins_slave\workspace\flex-sdk_mustella\frameworks\projects\mx\src\mx\controls\DateField.as(2740): col: 22 Error: Incompatible override.
[compc]
[compc] private function removedFromStageHandler(event:Event):void
[compc] ^
[compc]
[compc] C:\jenkins_slave\workspace\flex-sdk_mustella\frameworks\projects\mx\src\mx\controls\DateField.as(2740): col: 22 Error: Overriding a function that is not marked for override.
[compc]
[compc] private function removedFromStageHandler(event:Event):void
[compc] ^
[compc]
[compc] C:\jenkins_slave\workspace\flex-sdk_mustella\frameworks\projects\mx\src\mx\controls\DateField.as(715): col: 52 Error: Ambiguous reference to removedFromStageHandler.
[compc]
[compc] addEventListener(Event.REMOVED_FROM_STAGE, removedFromStageHandler);
[compc] ^
[compc]
[compc] C:\jenkins_slave\workspace\flex-sdk_mustella\frameworks\projects\mx\src\mx\controls\PopUpButton.as(1308): col: 22 Error: Incompatible override.
[compc]
[compc] private function removedFromStageHandler(event:Event):void
[compc] ^
[compc]
[compc] C:\jenkins_slave\workspace\flex-sdk_mustella\frameworks\projects\mx\src\mx\controls\PopUpButton.as(1308): col: 22 Error: Overriding a function that is not marked for override.
[compc]
[compc] private function removedFromStageHandler(event:Event):void
[compc] ^
[compc]
[compc] C:\jenkins_slave\workspace\flex-sdk_mustella\frameworks\projects\mx\src\mx\controls\PopUpButton.as(378): col: 52 Error: Ambiguous reference to removedFromStageHandler.
[compc]
[compc] addEventListener(Event.REMOVED_FROM_STAGE, removedFromStageHandler);
[compc] ^
[compc]
BUILD FAILED
<http://localhost:8080/job/flex-sdk_mustella/ws/build.xml>:416: The following error occurred while executing this line:
<http://localhost:8080/job/flex-sdk_mustella/ws/frameworks/build.xml>:113: The following error occurred while executing this line:
<http://localhost:8080/job/flex-sdk_mustella/ws/frameworks/build.xml>:386: The following error occurred while executing this line:
<http://localhost:8080/job/flex-sdk_mustella/ws/frameworks/projects/mx/build.xml>:182: compc task failed.
Total time: 1 minute 46 seconds
Build step 'Invoke Ant' marked build as failure