You are viewing a plain text version of this content. The canonical link for it is here.
Posted to yarn-dev@hadoop.apache.org by Apache Jenkins Server <je...@builds.apache.org> on 2014/04/23 13:08:07 UTC

Hadoop-Yarn-trunk - Build # 549 - Failure

See https://builds.apache.org/job/Hadoop-Yarn-trunk/549/

###################################################################################
########################## LAST 60 LINES OF THE CONSOLE ###########################
[...truncated 15095 lines...]
Running org.apache.hadoop.yarn.server.resourcemanager.webapp.TestRMWebServicesApps
Tests run: 40, Failures: 0, Errors: 0, Skipped: 0, Time elapsed: 174.328 sec - in org.apache.hadoop.yarn.server.resourcemanager.webapp.TestRMWebServicesApps

Results :

Failed tests: 
  TestFairScheduler.testContinuousScheduling:2429 expected:<2> but was:<1>
  TestRMRestart.testQueueMetricsOnRMRestart:1687->assertQueueMetrics:1731 expected:<3> but was:<4>

Tests run: 589, Failures: 2, Errors: 0, Skipped: 1

[INFO] ------------------------------------------------------------------------
[INFO] Reactor Summary:
[INFO] 
[INFO] hadoop-yarn ....................................... SUCCESS [3.281s]
[INFO] hadoop-yarn-api ................................... SUCCESS [3:19.674s]
[INFO] hadoop-yarn-common ................................ SUCCESS [2:18.942s]
[INFO] hadoop-yarn-server ................................ SUCCESS [0.089s]
[INFO] hadoop-yarn-server-common ......................... SUCCESS [35.897s]
[INFO] hadoop-yarn-server-nodemanager .................... SUCCESS [4:38.488s]
[INFO] hadoop-yarn-server-web-proxy ...................... SUCCESS [22.911s]
[INFO] hadoop-yarn-server-applicationhistoryservice ...... SUCCESS [1:20.035s]
[INFO] hadoop-yarn-server-resourcemanager ................ FAILURE [19:36.485s]
[INFO] hadoop-yarn-server-tests .......................... SKIPPED
[INFO] hadoop-yarn-client ................................ SKIPPED
[INFO] hadoop-yarn-applications .......................... SKIPPED
[INFO] hadoop-yarn-applications-distributedshell ......... SKIPPED
[INFO] hadoop-yarn-applications-unmanaged-am-launcher .... SKIPPED
[INFO] hadoop-yarn-site .................................. SKIPPED
[INFO] hadoop-yarn-project ............................... SKIPPED
[INFO] ------------------------------------------------------------------------
[INFO] BUILD FAILURE
[INFO] ------------------------------------------------------------------------
[INFO] Total time: 32:18.019s
[INFO] Finished at: Wed Apr 23 11:08:03 UTC 2014
[INFO] Final Memory: 46M/640M
[INFO] ------------------------------------------------------------------------
[ERROR] Failed to execute goal org.apache.maven.plugins:maven-surefire-plugin:2.16:test (default-test) on project hadoop-yarn-server-resourcemanager: There are test failures.
[ERROR] 
[ERROR] Please refer to /home/jenkins/jenkins-slave/workspace/Hadoop-Yarn-trunk/trunk/hadoop-yarn-project/hadoop-yarn/hadoop-yarn-server/hadoop-yarn-server-resourcemanager/target/surefire-reports for the individual test results.
[ERROR] -> [Help 1]
[ERROR] 
[ERROR] To see the full stack trace of the errors, re-run Maven with the -e switch.
[ERROR] Re-run Maven using the -X switch to enable full debug logging.
[ERROR] 
[ERROR] For more information about the errors and possible solutions, please read the following articles:
[ERROR] [Help 1] http://cwiki.apache.org/confluence/display/MAVEN/MojoFailureException
[ERROR] 
[ERROR] After correcting the problems, you can resume the build with the command
[ERROR]   mvn <goals> -rf :hadoop-yarn-server-resourcemanager
Build step 'Execute shell' marked build as failure
Archiving artifacts
Updating MAPREDUCE-5833
Updating MAPREDUCE-5832
Updating HADOOP-10503
Updating MAPREDUCE-5827
Sending e-mails to: yarn-dev@hadoop.apache.org
Email was triggered for: Failure
Sending email for trigger: Failure



###################################################################################
############################## FAILED TESTS (if any) ##############################
No tests ran.