You are viewing a plain text version of this content. The canonical link for it is here.
Posted to commits@servicemix.apache.org by Apache Jenkins Server <je...@builds.apache.org> on 2015/06/15 18:31:20 UTC
Build failed in Jenkins: ServiceMix-Bundles #837
See <https://builds.apache.org/job/ServiceMix-Bundles/837/changes>
Changes:
[jbonofre] Prepare bundles-2015.05 release
[jbonofre] [maven-release-plugin] prepare release org.apache.servicemix.bundles.spring-oxm-3.2.13.RELEASE_2
[jbonofre] [maven-release-plugin] prepare for next development iteration
[jbonofre] Prepare bundles-2015.05 release
[jbonofre] [maven-release-plugin] prepare release org.apache.servicemix.bundles.spring-struts-3.2.13.RELEASE_2
[jbonofre] [maven-release-plugin] prepare for next development iteration
[jbonofre] Prepare bundles-2015.05 release
[jbonofre] [maven-release-plugin] prepare release org.apache.servicemix.bundles.spring-test-3.2.13.RELEASE_2
[jbonofre] [maven-release-plugin] prepare for next development iteration
[jbonofre] Prepare bundles-2015.05 release
[jbonofre] [maven-release-plugin] prepare release org.apache.servicemix.bundles.spring-tx-3.2.13.RELEASE_2
[jbonofre] [maven-release-plugin] prepare for next development iteration
[jbonofre] Prepare bundles-2015.05 release
[jbonofre] [maven-release-plugin] prepare release org.apache.servicemix.bundles.spring-web-3.2.13.RELEASE_2
[jbonofre] [maven-release-plugin] prepare for next development iteration
[jbonofre] Prepare bundle-2015.05 release
[jbonofre] [maven-release-plugin] prepare release org.apache.servicemix.bundles.spring-webmvc-3.2.13.RELEASE_2
[jbonofre] [maven-release-plugin] prepare for next development iteration
[jbonofre] Prepare bundles-2015.05 release
[jbonofre] [maven-release-plugin] prepare release org.apache.servicemix.bundles.spring-webmvc-portlet-3.2.13.RELEASE_2
[jbonofre] [maven-release-plugin] prepare for next development iteration
[jbonofre] [maven-release-plugin] prepare release org.apache.servicemix.bundles.reflections-0.9.9_1
[jbonofre] [maven-release-plugin] prepare for next development iteration
[jbonofre] [maven-release-plugin] prepare release org.apache.servicemix.bundles.xmlgraphics-commons-2.0_1
[jbonofre] [maven-release-plugin] prepare for next development iteration
[jbonofre] [maven-release-plugin] prepare release org.apache.servicemix.bundles.jedis-2.7.2_1
[jbonofre] [maven-release-plugin] prepare for next development iteration
------------------------------------------
Started by an SCM change
Building remotely on ubuntu3 (Ubuntu ubuntu legacy-ubuntu) in workspace <https://builds.apache.org/job/ServiceMix-Bundles/ws/>
> git rev-parse --is-inside-work-tree # timeout=10
Fetching changes from the remote Git repository
> git config remote.origin.url https://git-wip-us.apache.org/repos/asf/servicemix-bundles.git # timeout=10
Fetching upstream changes from https://git-wip-us.apache.org/repos/asf/servicemix-bundles.git
> git --version # timeout=10
> git fetch --tags --progress https://git-wip-us.apache.org/repos/asf/servicemix-bundles.git +refs/heads/*:refs/remotes/origin/*
> git rev-parse refs/remotes/origin/master^{commit} # timeout=10
> git rev-parse refs/remotes/origin/origin/master^{commit} # timeout=10
Checking out Revision 09ec37f7047db104b27a2ad24cd213d08cad2471 (refs/remotes/origin/master)
> git config core.sparsecheckout # timeout=10
> git checkout -f 09ec37f7047db104b27a2ad24cd213d08cad2471
> git rev-list fc465ab0205bb9678278f05f2de2ba943665943b # timeout=10
Parsing POMs
Modules changed, recalculating dependency graph
maven3-agent.jar already up to date
maven3-interceptor.jar already up to date
maven3-interceptor-commons.jar already up to date
[ServiceMix-Bundles] $ /home/jenkins/tools/java/latest1.6/bin/java -da -dsa -XX:MaxPermSize=192m -Xmx512M -cp /home/jenkins/jenkins-slave/maven3-agent.jar:/home/jenkins/jenkins-slave/tools/hudson.tasks.Maven_MavenInstallation/Maven_3.0.3/boot/plexus-classworlds-2.4.jar org.jvnet.hudson.maven3.agent.Maven3Main /home/jenkins/jenkins-slave/tools/hudson.tasks.Maven_MavenInstallation/Maven_3.0.3 /x1/jenkins/jenkins-slave/slave.jar /home/jenkins/jenkins-slave/maven3-interceptor.jar /home/jenkins/jenkins-slave/maven3-interceptor-commons.jar 48752
<===[JENKINS REMOTING CAPACITY]===> channel started
Executing Maven: -B -f <https://builds.apache.org/job/ServiceMix-Bundles/ws/pom.xml> -Dmaven.repo.local=<https://builds.apache.org/job/ServiceMix-Bundles/ws/.repository> -B -e clean install
[INFO] Error stacktraces are turned on.
[INFO] Scanning for projects...
[ERROR] The build could not read 1 project -> [Help 1]
org.apache.maven.project.ProjectBuildingException: Some problems were encountered while processing the POMs:
[ERROR] 'modules.module[52]' specifies duplicate child module poi-3.11 @ line 98, column 17
[ERROR] 'modules.module[53]' specifies duplicate child module swagger-core_2.11-1.3.12 @ line 99, column 17
[ERROR] 'modules.module[75]' specifies duplicate child module olingo-odata2-core-2.0.4 @ line 121, column 17
at org.apache.maven.project.DefaultProjectBuilder.build(DefaultProjectBuilder.java:339)
at org.apache.maven.DefaultMaven.collectProjects(DefaultMaven.java:632)
at org.apache.maven.DefaultMaven.getProjectsForMavenReactor(DefaultMaven.java:581)
at org.apache.maven.DefaultMaven.doExecute(DefaultMaven.java:233)
at org.apache.maven.DefaultMaven.execute(DefaultMaven.java:156)
at org.jvnet.hudson.maven3.launcher.Maven3Launcher.main(Maven3Launcher.java:117)
at sun.reflect.NativeMethodAccessorImpl.invoke0(Native Method)
at sun.reflect.NativeMethodAccessorImpl.invoke(NativeMethodAccessorImpl.java:39)
at sun.reflect.DelegatingMethodAccessorImpl.invoke(DelegatingMethodAccessorImpl.java:25)
at java.lang.reflect.Method.invoke(Method.java:597)
at org.codehaus.plexus.classworlds.launcher.Launcher.launchStandard(Launcher.java:329)
at org.codehaus.plexus.classworlds.launcher.Launcher.launch(Launcher.java:239)
at org.jvnet.hudson.maven3.agent.Maven3Main.launch(Maven3Main.java:178)
at sun.reflect.NativeMethodAccessorImpl.invoke0(Native Method)
at sun.reflect.NativeMethodAccessorImpl.invoke(NativeMethodAccessorImpl.java:39)
at sun.reflect.DelegatingMethodAccessorImpl.invoke(DelegatingMethodAccessorImpl.java:25)
at java.lang.reflect.Method.invoke(Method.java:597)
at hudson.maven.Maven3Builder.call(Maven3Builder.java:136)
at hudson.maven.Maven3Builder.call(Maven3Builder.java:71)
at hudson.remoting.UserRequest.perform(UserRequest.java:118)
at hudson.remoting.UserRequest.perform(UserRequest.java:48)
at hudson.remoting.Request$2.run(Request.java:328)
at hudson.remoting.InterceptingExecutorService$1.call(InterceptingExecutorService.java:72)
at java.util.concurrent.FutureTask$Sync.innerRun(FutureTask.java:303)
at java.util.concurrent.FutureTask.run(FutureTask.java:138)
at java.util.concurrent.ThreadPoolExecutor$Worker.runTask(ThreadPoolExecutor.java:895)
at java.util.concurrent.ThreadPoolExecutor$Worker.run(ThreadPoolExecutor.java:918)
at java.lang.Thread.run(Thread.java:662)
[ERROR]
[ERROR] The project org.apache.servicemix.bundles:org.apache.servicemix.bundles.pom:1-SNAPSHOT (<https://builds.apache.org/job/ServiceMix-Bundles/ws/pom.xml)> has 3 errors
[ERROR] 'modules.module[52]' specifies duplicate child module poi-3.11 @ line 98, column 17
[ERROR] 'modules.module[53]' specifies duplicate child module swagger-core_2.11-1.3.12 @ line 99, column 17
[ERROR] 'modules.module[75]' specifies duplicate child module olingo-odata2-core-2.0.4 @ line 121, column 17
[ERROR]
[ERROR] Re-run Maven using the -X switch to enable full debug logging.
[ERROR]
[ERROR] For more information about the errors and possible solutions, please read the following articles:
[ERROR] [Help 1] http://cwiki.apache.org/confluence/display/MAVEN/ProjectBuildingException
channel stopped
Jenkins build is back to normal : ServiceMix-Bundles #840
Posted by Apache Jenkins Server <je...@builds.apache.org>.
See <https://builds.apache.org/job/ServiceMix-Bundles/840/changes>
Build failed in Jenkins: ServiceMix-Bundles #839
Posted by Apache Jenkins Server <je...@builds.apache.org>.
See <https://builds.apache.org/job/ServiceMix-Bundles/839/changes>
Changes:
[jbonofre] [maven-release-plugin] prepare release org.apache.servicemix.bundles.reflections-0.9.10_1
[jbonofre] [maven-release-plugin] prepare for next development iteration
[jbonofre] [maven-release-plugin] prepare release org.apache.servicemix.bundles.dbunit-2.5.1_1
[jbonofre] [maven-release-plugin] prepare for next development iteration
[jbonofre] [maven-release-plugin] prepare release org.apache.servicemix.bundles.sparkjava-core-2.2_1
[jbonofre] [maven-release-plugin] prepare for next development iteration
[jbonofre] [maven-release-plugin] prepare release org.apache.servicemix.bundles.spring-integration-core-4.1.4.RELEASE_1
[jbonofre] [maven-release-plugin] prepare for next development iteration
[jbonofre] [maven-release-plugin] prepare release org.apache.servicemix.bundles.aws-java-sdk-1.9.39_1
[jbonofre] [maven-release-plugin] prepare for next development iteration
[jbonofre] [SM-2592] Create OSGi bundle for elasticsearch 1.6.0
[jbonofre] [maven-release-plugin] prepare release org.apache.servicemix.bundles.poi-3.12_1
[jbonofre] [maven-release-plugin] prepare for next development iteration
[jbonofre] [maven-release-plugin] prepare release org.apache.servicemix.bundles.aws-java-sdk-1.9.40_1
[jbonofre] [maven-release-plugin] prepare for next development iteration
[jbonofre] Prepare bundles-2015.05 release
[jbonofre] [maven-release-plugin] prepare release org.apache.servicemix.bundles.olingo-odata2-core-2.0.0_2
[jbonofre] [maven-release-plugin] prepare for next development iteration
[jbonofre] [maven-release-plugin] prepare release org.apache.servicemix.bundles.olingo-odata2-core-2.0.3_2
[jbonofre] [maven-release-plugin] prepare for next development iteration
[jbonofre] [maven-release-plugin] prepare release org.apache.servicemix.bundles.jsch-0.1.53_1
------------------------------------------
Started by an SCM change
Building remotely on ubuntu-5 (docker Ubuntu ubuntu5 ubuntu) in workspace <https://builds.apache.org/job/ServiceMix-Bundles/ws/>
> git rev-parse --is-inside-work-tree # timeout=10
Fetching changes from the remote Git repository
> git config remote.origin.url https://git-wip-us.apache.org/repos/asf/servicemix-bundles.git # timeout=10
Fetching upstream changes from https://git-wip-us.apache.org/repos/asf/servicemix-bundles.git
> git --version # timeout=10
> git fetch --tags --progress https://git-wip-us.apache.org/repos/asf/servicemix-bundles.git +refs/heads/*:refs/remotes/origin/*
> git rev-parse refs/remotes/origin/master^{commit} # timeout=10
> git rev-parse refs/remotes/origin/origin/master^{commit} # timeout=10
Checking out Revision 551feccab07314016b4291bdf064318458c3f516 (refs/remotes/origin/master)
> git config core.sparsecheckout # timeout=10
> git checkout -f 551feccab07314016b4291bdf064318458c3f516
> git rev-list 40e54bbd91531969824046fa3d5f2769923d7997 # timeout=10
Parsing POMs
Modules changed, recalculating dependency graph
maven3-agent.jar already up to date
maven3-interceptor.jar already up to date
maven3-interceptor-commons.jar already up to date
[ServiceMix-Bundles] $ /home/jenkins/tools/java/latest1.6/bin/java -da -dsa -XX:MaxPermSize=192m -Xmx512M -cp /home/jenkins/jenkins-slave/maven3-agent.jar:/home/jenkins/jenkins-slave/tools/hudson.tasks.Maven_MavenInstallation/Maven_3.0.3/boot/plexus-classworlds-2.4.jar org.jvnet.hudson.maven3.agent.Maven3Main /home/jenkins/jenkins-slave/tools/hudson.tasks.Maven_MavenInstallation/Maven_3.0.3 /home/jenkins/jenkins-slave/slave.jar /home/jenkins/jenkins-slave/maven3-interceptor.jar /home/jenkins/jenkins-slave/maven3-interceptor-commons.jar 50610
<===[JENKINS REMOTING CAPACITY]===> channel started
Executing Maven: -B -f <https://builds.apache.org/job/ServiceMix-Bundles/ws/pom.xml> -Dmaven.repo.local=<https://builds.apache.org/job/ServiceMix-Bundles/ws/.repository> -B -e clean install
[INFO] Error stacktraces are turned on.
[INFO] Scanning for projects...
[ERROR] The build could not read 1 project -> [Help 1]
org.apache.maven.project.ProjectBuildingException: Some problems were encountered while processing the POMs:
[ERROR] 'modules.module[52]' specifies duplicate child module poi-3.11 @ line 98, column 17
[ERROR] 'modules.module[53]' specifies duplicate child module swagger-core_2.11-1.3.12 @ line 99, column 17
[ERROR] 'modules.module[75]' specifies duplicate child module olingo-odata2-core-2.0.4 @ line 121, column 17
at org.apache.maven.project.DefaultProjectBuilder.build(DefaultProjectBuilder.java:339)
at org.apache.maven.DefaultMaven.collectProjects(DefaultMaven.java:632)
at org.apache.maven.DefaultMaven.getProjectsForMavenReactor(DefaultMaven.java:581)
at org.apache.maven.DefaultMaven.doExecute(DefaultMaven.java:233)
at org.apache.maven.DefaultMaven.execute(DefaultMaven.java:156)
at org.jvnet.hudson.maven3.launcher.Maven3Launcher.main(Maven3Launcher.java:117)
at sun.reflect.NativeMethodAccessorImpl.invoke0(Native Method)
at sun.reflect.NativeMethodAccessorImpl.invoke(NativeMethodAccessorImpl.java:39)
at sun.reflect.DelegatingMethodAccessorImpl.invoke(DelegatingMethodAccessorImpl.java:25)
at java.lang.reflect.Method.invoke(Method.java:597)
at org.codehaus.plexus.classworlds.launcher.Launcher.launchStandard(Launcher.java:329)
at org.codehaus.plexus.classworlds.launcher.Launcher.launch(Launcher.java:239)
at org.jvnet.hudson.maven3.agent.Maven3Main.launch(Maven3Main.java:178)
at sun.reflect.NativeMethodAccessorImpl.invoke0(Native Method)
at sun.reflect.NativeMethodAccessorImpl.invoke(NativeMethodAccessorImpl.java:39)
at sun.reflect.DelegatingMethodAccessorImpl.invoke(DelegatingMethodAccessorImpl.java:25)
at java.lang.reflect.Method.invoke(Method.java:597)
at hudson.maven.Maven3Builder.call(Maven3Builder.java:136)
at hudson.maven.Maven3Builder.call(Maven3Builder.java:71)
at hudson.remoting.UserRequest.perform(UserRequest.java:118)
at hudson.remoting.UserRequest.perform(UserRequest.java:48)
at hudson.remoting.Request$2.run(Request.java:328)
at hudson.remoting.InterceptingExecutorService$1.call(InterceptingExecutorService.java:72)
at java.util.concurrent.FutureTask$Sync.innerRun(FutureTask.java:303)
at java.util.concurrent.FutureTask.run(FutureTask.java:138)
at java.util.concurrent.ThreadPoolExecutor$Worker.runTask(ThreadPoolExecutor.java:895)
at java.util.concurrent.ThreadPoolExecutor$Worker.run(ThreadPoolExecutor.java:918)
at java.lang.Thread.run(Thread.java:662)
[ERROR]
[ERROR] The project org.apache.servicemix.bundles:org.apache.servicemix.bundles.pom:1-SNAPSHOT (<https://builds.apache.org/job/ServiceMix-Bundles/ws/pom.xml)> has 3 errors
[ERROR] 'modules.module[52]' specifies duplicate child module poi-3.11 @ line 98, column 17
[ERROR] 'modules.module[53]' specifies duplicate child module swagger-core_2.11-1.3.12 @ line 99, column 17
[ERROR] 'modules.module[75]' specifies duplicate child module olingo-odata2-core-2.0.4 @ line 121, column 17
[ERROR]
[ERROR] Re-run Maven using the -X switch to enable full debug logging.
[ERROR]
[ERROR] For more information about the errors and possible solutions, please read the following articles:
[ERROR] [Help 1] http://cwiki.apache.org/confluence/display/MAVEN/ProjectBuildingException
channel stopped
Build failed in Jenkins: ServiceMix-Bundles #838
Posted by Apache Jenkins Server <je...@builds.apache.org>.
See <https://builds.apache.org/job/ServiceMix-Bundles/838/changes>
Changes:
[jbonofre] [maven-release-plugin] prepare release org.apache.servicemix.bundles.hbase-1.1.0.1_1
[jbonofre] [maven-release-plugin] prepare for next development iteration
[jbonofre] [maven-release-plugin] prepare release org.apache.servicemix.bundles.olingo-odata2-api-2.0.4_1
[jbonofre] [maven-release-plugin] prepare for next development iteration
[jbonofre] [maven-release-plugin] prepare release org.apache.servicemix.bundles.olingo-odata2-core-2.0.4_1
[jbonofre] [maven-release-plugin] prepare for next development iteration
[jbonofre] [maven-release-plugin] prepare release org.apache.servicemix.bundles.spring-batch-core-3.0.4.RELEASE_1
[jbonofre] [maven-release-plugin] prepare for next development iteration
[jbonofre] [maven-release-plugin] prepare release org.apache.servicemix.bundles.spring-batch-infrastructure-3.0.4.RELEASE_1
[jbonofre] [maven-release-plugin] prepare for next development iteration
[jbonofre] [maven-release-plugin] prepare release org.apache.servicemix.bundles.spring-ldap-2.0.3.RELEASE_1
[jbonofre] [maven-release-plugin] prepare for next development iteration
[jbonofre] [maven-release-plugin] prepare release org.apache.servicemix.bundles.gae-1.9.21_1
[jbonofre] [maven-release-plugin] prepare for next development iteration
[jbonofre] [maven-release-plugin] prepare release org.apache.servicemix.bundles.jt400-8.5_1
[jbonofre] [maven-release-plugin] prepare for next development iteration
[jbonofre] [maven-release-plugin] prepare release org.apache.servicemix.bundles.docker-java-1.3.0_1
[jbonofre] [maven-release-plugin] prepare for next development iteration
------------------------------------------
Started by an SCM change
Building remotely on ubuntu-5 (docker Ubuntu ubuntu5 ubuntu) in workspace <https://builds.apache.org/job/ServiceMix-Bundles/ws/>
> git rev-parse --is-inside-work-tree # timeout=10
Fetching changes from the remote Git repository
> git config remote.origin.url https://git-wip-us.apache.org/repos/asf/servicemix-bundles.git # timeout=10
Fetching upstream changes from https://git-wip-us.apache.org/repos/asf/servicemix-bundles.git
> git --version # timeout=10
> git fetch --tags --progress https://git-wip-us.apache.org/repos/asf/servicemix-bundles.git +refs/heads/*:refs/remotes/origin/*
> git rev-parse refs/remotes/origin/master^{commit} # timeout=10
> git rev-parse refs/remotes/origin/origin/master^{commit} # timeout=10
Checking out Revision 40e54bbd91531969824046fa3d5f2769923d7997 (refs/remotes/origin/master)
> git config core.sparsecheckout # timeout=10
> git checkout -f 40e54bbd91531969824046fa3d5f2769923d7997
> git rev-list 09ec37f7047db104b27a2ad24cd213d08cad2471 # timeout=10
Parsing POMs
Modules changed, recalculating dependency graph
maven3-agent.jar already up to date
maven3-interceptor.jar already up to date
maven3-interceptor-commons.jar already up to date
[ServiceMix-Bundles] $ /home/jenkins/tools/java/latest1.6/bin/java -da -dsa -XX:MaxPermSize=192m -Xmx512M -cp /home/jenkins/jenkins-slave/maven3-agent.jar:/home/jenkins/jenkins-slave/tools/hudson.tasks.Maven_MavenInstallation/Maven_3.0.3/boot/plexus-classworlds-2.4.jar org.jvnet.hudson.maven3.agent.Maven3Main /home/jenkins/jenkins-slave/tools/hudson.tasks.Maven_MavenInstallation/Maven_3.0.3 /home/jenkins/jenkins-slave/slave.jar /home/jenkins/jenkins-slave/maven3-interceptor.jar /home/jenkins/jenkins-slave/maven3-interceptor-commons.jar 55701
<===[JENKINS REMOTING CAPACITY]===> channel started
Executing Maven: -B -f <https://builds.apache.org/job/ServiceMix-Bundles/ws/pom.xml> -Dmaven.repo.local=<https://builds.apache.org/job/ServiceMix-Bundles/ws/.repository> -B -e clean install
[INFO] Error stacktraces are turned on.
[INFO] Scanning for projects...
[ERROR] The build could not read 1 project -> [Help 1]
org.apache.maven.project.ProjectBuildingException: Some problems were encountered while processing the POMs:
[ERROR] 'modules.module[52]' specifies duplicate child module poi-3.11 @ line 98, column 17
[ERROR] 'modules.module[53]' specifies duplicate child module swagger-core_2.11-1.3.12 @ line 99, column 17
[ERROR] 'modules.module[75]' specifies duplicate child module olingo-odata2-core-2.0.4 @ line 121, column 17
at org.apache.maven.project.DefaultProjectBuilder.build(DefaultProjectBuilder.java:339)
at org.apache.maven.DefaultMaven.collectProjects(DefaultMaven.java:632)
at org.apache.maven.DefaultMaven.getProjectsForMavenReactor(DefaultMaven.java:581)
at org.apache.maven.DefaultMaven.doExecute(DefaultMaven.java:233)
at org.apache.maven.DefaultMaven.execute(DefaultMaven.java:156)
at org.jvnet.hudson.maven3.launcher.Maven3Launcher.main(Maven3Launcher.java:117)
at sun.reflect.NativeMethodAccessorImpl.invoke0(Native Method)
at sun.reflect.NativeMethodAccessorImpl.invoke(NativeMethodAccessorImpl.java:39)
at sun.reflect.DelegatingMethodAccessorImpl.invoke(DelegatingMethodAccessorImpl.java:25)
at java.lang.reflect.Method.invoke(Method.java:597)
at org.codehaus.plexus.classworlds.launcher.Launcher.launchStandard(Launcher.java:329)
at org.codehaus.plexus.classworlds.launcher.Launcher.launch(Launcher.java:239)
at org.jvnet.hudson.maven3.agent.Maven3Main.launch(Maven3Main.java:178)
at sun.reflect.NativeMethodAccessorImpl.invoke0(Native Method)
at sun.reflect.NativeMethodAccessorImpl.invoke(NativeMethodAccessorImpl.java:39)
at sun.reflect.DelegatingMethodAccessorImpl.invoke(DelegatingMethodAccessorImpl.java:25)
at java.lang.reflect.Method.invoke(Method.java:597)
at hudson.maven.Maven3Builder.call(Maven3Builder.java:136)
at hudson.maven.Maven3Builder.call(Maven3Builder.java:71)
at hudson.remoting.UserRequest.perform(UserRequest.java:118)
at hudson.remoting.UserRequest.perform(UserRequest.java:48)
at hudson.remoting.Request$2.run(Request.java:328)
at hudson.remoting.InterceptingExecutorService$1.call(InterceptingExecutorService.java:72)
at java.util.concurrent.FutureTask$Sync.innerRun(FutureTask.java:303)
at java.util.concurrent.FutureTask.run(FutureTask.java:138)
at java.util.concurrent.ThreadPoolExecutor$Worker.runTask(ThreadPoolExecutor.java:895)
at java.util.concurrent.ThreadPoolExecutor$Worker.run(ThreadPoolExecutor.java:918)
at java.lang.Thread.run(Thread.java:662)
[ERROR]
[ERROR] The project org.apache.servicemix.bundles:org.apache.servicemix.bundles.pom:1-SNAPSHOT (<https://builds.apache.org/job/ServiceMix-Bundles/ws/pom.xml)> has 3 errors
[ERROR] 'modules.module[52]' specifies duplicate child module poi-3.11 @ line 98, column 17
[ERROR] 'modules.module[53]' specifies duplicate child module swagger-core_2.11-1.3.12 @ line 99, column 17
[ERROR] 'modules.module[75]' specifies duplicate child module olingo-odata2-core-2.0.4 @ line 121, column 17
[ERROR]
[ERROR] Re-run Maven using the -X switch to enable full debug logging.
[ERROR]
[ERROR] For more information about the errors and possible solutions, please read the following articles:
[ERROR] [Help 1] http://cwiki.apache.org/confluence/display/MAVEN/ProjectBuildingException
channel stopped