You are viewing a plain text version of this content. The canonical link for it is here.
Posted to builds@lucene.apache.org by Policeman Jenkins Server <je...@thetaphi.de> on 2020/09/02 11:26:45 UTC

[JENKINS] Lucene-Solr-master-MacOSX (64bit/jdk-12.0.2) - Build # 6493 - Unstable!

Build: https://jenkins.thetaphi.de/job/Lucene-Solr-master-MacOSX/6493/
Java: 64bit/jdk-12.0.2 -XX:-UseCompressedOops -XX:+UseG1GC

2 tests failed.
FAILED:  org.apache.solr.cloud.api.collections.TestHdfsCloudBackupRestore.test

Error Message:
java.lang.AssertionError: Node 127.0.0.1:57282_solr has 4 replicas. Expected num replicas : 2. state: 
DocCollection(hdfsbackuprestore_testok_restored/13)={
  "pullReplicas":1,
  "replicationFactor":1,
  "shards":{
    "shard2":{
      "range":null,
      "state":"active",
      "replicas":{
        "core_node2":{
          "core":"hdfsbackuprestore_testok_restored_shard2_replica_n1",
          "leader":"true",
          "core_node_name":"core_node2",
          "base_url":"http://127.0.0.1:57282/solr",
          "node_name":"127.0.0.1:57282_solr",
          "state":"active",
          "collection":"hdfsbackuprestore_testok_restored",
          "shard":"shard2",
          "type":"NRT",
          "force_set_state":"false"},
        "core_node6":{
          "core":"hdfsbackuprestore_testok_restored_shard2_replica_p5",
          "core_node_name":"core_node6",
          "base_url":"http://127.0.0.1:57282/solr",
          "node_name":"127.0.0.1:57282_solr",
          "state":"active",
          "collection":"hdfsbackuprestore_testok_restored",
          "shard":"shard2",
          "type":"PULL",
          "force_set_state":"false"}},
      "stateTimestamp":"1599044758625641246"},
    "shard1":{
      "range":null,
      "state":"active",
      "replicas":{
        "core_node4":{
          "core":"hdfsbackuprestore_testok_restored_shard1_replica_n3",
          "leader":"true",
          "core_node_name":"core_node4",
          "base_url":"http://127.0.0.1:57282/solr",
          "node_name":"127.0.0.1:57282_solr",
          "state":"active",
          "collection":"hdfsbackuprestore_testok_restored",
          "shard":"shard1",
          "type":"NRT",
          "force_set_state":"false"},
        "core_node8":{
          "core":"hdfsbackuprestore_testok_restored_shard1_replica_p7",
          "core_node_name":"core_node8",
          "base_url":"http://127.0.0.1:57282/solr",
          "node_name":"127.0.0.1:57282_solr",
          "state":"active",
          "collection":"hdfsbackuprestore_testok_restored",
          "shard":"shard1",
          "type":"PULL",
          "force_set_state":"false"}},
      "stateTimestamp":"1599044758625641282"}},
  "router":{
    "name":"implicit",
    "field":"shard_s"},
  "nrtReplicas":1,
  "tlogReplicas":0}

Stack Trace:
java.lang.AssertionError: Node 127.0.0.1:57282_solr has 4 replicas. Expected num replicas : 2. state: 
DocCollection(hdfsbackuprestore_testok_restored/13)={
  "pullReplicas":1,
  "replicationFactor":1,
  "shards":{
    "shard2":{
      "range":null,
      "state":"active",
      "replicas":{
        "core_node2":{
          "core":"hdfsbackuprestore_testok_restored_shard2_replica_n1",
          "leader":"true",
          "core_node_name":"core_node2",
          "base_url":"http://127.0.0.1:57282/solr",
          "node_name":"127.0.0.1:57282_solr",
          "state":"active",
          "collection":"hdfsbackuprestore_testok_restored",
          "shard":"shard2",
          "type":"NRT",
          "force_set_state":"false"},
        "core_node6":{
          "core":"hdfsbackuprestore_testok_restored_shard2_replica_p5",
          "core_node_name":"core_node6",
          "base_url":"http://127.0.0.1:57282/solr",
          "node_name":"127.0.0.1:57282_solr",
          "state":"active",
          "collection":"hdfsbackuprestore_testok_restored",
          "shard":"shard2",
          "type":"PULL",
          "force_set_state":"false"}},
      "stateTimestamp":"1599044758625641246"},
    "shard1":{
      "range":null,
      "state":"active",
      "replicas":{
        "core_node4":{
          "core":"hdfsbackuprestore_testok_restored_shard1_replica_n3",
          "leader":"true",
          "core_node_name":"core_node4",
          "base_url":"http://127.0.0.1:57282/solr",
          "node_name":"127.0.0.1:57282_solr",
          "state":"active",
          "collection":"hdfsbackuprestore_testok_restored",
          "shard":"shard1",
          "type":"NRT",
          "force_set_state":"false"},
        "core_node8":{
          "core":"hdfsbackuprestore_testok_restored_shard1_replica_p7",
          "core_node_name":"core_node8",
          "base_url":"http://127.0.0.1:57282/solr",
          "node_name":"127.0.0.1:57282_solr",
          "state":"active",
          "collection":"hdfsbackuprestore_testok_restored",
          "shard":"shard1",
          "type":"PULL",
          "force_set_state":"false"}},
      "stateTimestamp":"1599044758625641282"}},
  "router":{
    "name":"implicit",
    "field":"shard_s"},
  "nrtReplicas":1,
  "tlogReplicas":0}
	at __randomizedtesting.SeedInfo.seed([C047075B09BB5D3B:48133881A74730C3]:0)
	at org.junit.Assert.fail(Assert.java:88)
	at org.junit.Assert.assertTrue(Assert.java:41)
	at org.apache.solr.cloud.api.collections.AbstractCloudBackupRestoreTestCase.lambda$testBackupAndRestore$1(AbstractCloudBackupRestoreTestCase.java:374)
	at java.base/java.util.HashMap.forEach(HashMap.java:1333)
	at org.apache.solr.cloud.api.collections.AbstractCloudBackupRestoreTestCase.testBackupAndRestore(AbstractCloudBackupRestoreTestCase.java:373)
	at org.apache.solr.cloud.api.collections.AbstractCloudBackupRestoreTestCase.test(AbstractCloudBackupRestoreTestCase.java:155)
	at org.apache.solr.cloud.api.collections.TestHdfsCloudBackupRestore.test(TestHdfsCloudBackupRestore.java:225)
	at java.base/jdk.internal.reflect.NativeMethodAccessorImpl.invoke0(Native Method)
	at java.base/jdk.internal.reflect.NativeMethodAccessorImpl.invoke(NativeMethodAccessorImpl.java:62)
	at java.base/jdk.internal.reflect.DelegatingMethodAccessorImpl.invoke(DelegatingMethodAccessorImpl.java:43)
	at java.base/java.lang.reflect.Method.invoke(Method.java:567)
	at com.carrotsearch.randomizedtesting.RandomizedRunner.invoke(RandomizedRunner.java:1754)
	at com.carrotsearch.randomizedtesting.RandomizedRunner$8.evaluate(RandomizedRunner.java:942)
	at com.carrotsearch.randomizedtesting.RandomizedRunner$9.evaluate(RandomizedRunner.java:978)
	at com.carrotsearch.randomizedtesting.RandomizedRunner$10.evaluate(RandomizedRunner.java:992)
	at com.carrotsearch.randomizedtesting.rules.SystemPropertiesRestoreRule$1.evaluate(SystemPropertiesRestoreRule.java:57)
	at org.apache.lucene.util.TestRuleSetupTeardownChained$1.evaluate(TestRuleSetupTeardownChained.java:49)
	at org.apache.lucene.util.AbstractBeforeAfterRule$1.evaluate(AbstractBeforeAfterRule.java:45)
	at org.apache.lucene.util.TestRuleThreadAndTestName$1.evaluate(TestRuleThreadAndTestName.java:48)
	at org.apache.lucene.util.TestRuleIgnoreAfterMaxFailures$1.evaluate(TestRuleIgnoreAfterMaxFailures.java:64)
	at org.apache.lucene.util.TestRuleMarkFailure$1.evaluate(TestRuleMarkFailure.java:47)
	at com.carrotsearch.randomizedtesting.rules.StatementAdapter.evaluate(StatementAdapter.java:36)
	at com.carrotsearch.randomizedtesting.ThreadLeakControl$StatementRunner.run(ThreadLeakControl.java:370)
	at com.carrotsearch.randomizedtesting.ThreadLeakControl.forkTimeoutingTask(ThreadLeakControl.java:819)
	at com.carrotsearch.randomizedtesting.ThreadLeakControl$3.evaluate(ThreadLeakControl.java:470)
	at com.carrotsearch.randomizedtesting.RandomizedRunner.runSingleTest(RandomizedRunner.java:951)
	at com.carrotsearch.randomizedtesting.RandomizedRunner$5.evaluate(RandomizedRunner.java:836)
	at com.carrotsearch.randomizedtesting.RandomizedRunner$6.evaluate(RandomizedRunner.java:887)
	at com.carrotsearch.randomizedtesting.RandomizedRunner$7.evaluate(RandomizedRunner.java:898)
	at com.carrotsearch.randomizedtesting.rules.StatementAdapter.evaluate(StatementAdapter.java:36)
	at com.carrotsearch.randomizedtesting.rules.SystemPropertiesRestoreRule$1.evaluate(SystemPropertiesRestoreRule.java:57)
	at org.apache.lucene.util.AbstractBeforeAfterRule$1.evaluate(AbstractBeforeAfterRule.java:45)
	at com.carrotsearch.randomizedtesting.rules.StatementAdapter.evaluate(StatementAdapter.java:36)
	at org.apache.lucene.util.TestRuleStoreClassName$1.evaluate(TestRuleStoreClassName.java:41)
	at com.carrotsearch.randomizedtesting.rules.NoShadowingOrOverridesOnMethodsRule$1.evaluate(NoShadowingOrOverridesOnMethodsRule.java:40)
	at com.carrotsearch.randomizedtesting.rules.NoShadowingOrOverridesOnMethodsRule$1.evaluate(NoShadowingOrOverridesOnMethodsRule.java:40)
	at com.carrotsearch.randomizedtesting.rules.StatementAdapter.evaluate(StatementAdapter.java:36)
	at com.carrotsearch.randomizedtesting.rules.StatementAdapter.evaluate(StatementAdapter.java:36)
	at org.apache.lucene.util.TestRuleAssertionsRequired$1.evaluate(TestRuleAssertionsRequired.java:53)
	at org.apache.lucene.util.TestRuleMarkFailure$1.evaluate(TestRuleMarkFailure.java:47)
	at org.apache.lucene.util.TestRuleIgnoreAfterMaxFailures$1.evaluate(TestRuleIgnoreAfterMaxFailures.java:64)
	at org.apache.lucene.util.TestRuleIgnoreTestSuites$1.evaluate(TestRuleIgnoreTestSuites.java:54)
	at com.carrotsearch.randomizedtesting.rules.StatementAdapter.evaluate(StatementAdapter.java:36)
	at com.carrotsearch.randomizedtesting.ThreadLeakControl$StatementRunner.run(ThreadLeakControl.java:370)
	at com.carrotsearch.randomizedtesting.ThreadLeakControl.lambda$forkTimeoutingTask$0(ThreadLeakControl.java:826)
	at java.base/java.lang.Thread.run(Thread.java:835)


FAILED:  org.apache.solr.cloud.api.collections.TestLocalFSCloudBackupRestore.test

Error Message:
java.lang.AssertionError: Node 127.0.0.1:60816_solr has 4 replicas. Expected num replicas : 2. state: 
DocCollection(backuprestore_testok_restored/11)={
  "pullReplicas":1,
  "replicationFactor":1,
  "shards":{
    "shard2":{
      "range":null,
      "state":"active",
      "replicas":{
        "core_node2":{
          "core":"backuprestore_testok_restored_shard2_replica_n1",
          "leader":"true",
          "core_node_name":"core_node2",
          "base_url":"https://127.0.0.1:60816/solr",
          "node_name":"127.0.0.1:60816_solr",
          "state":"active",
          "collection":"backuprestore_testok_restored",
          "shard":"shard2",
          "type":"NRT",
          "force_set_state":"false"},
        "core_node6":{
          "core":"backuprestore_testok_restored_shard2_replica_p5",
          "core_node_name":"core_node6",
          "base_url":"https://127.0.0.1:60816/solr",
          "node_name":"127.0.0.1:60816_solr",
          "state":"active",
          "collection":"backuprestore_testok_restored",
          "shard":"shard2",
          "type":"PULL",
          "force_set_state":"false"}},
      "stateTimestamp":"1599044974213672508"},
    "shard1":{
      "range":null,
      "state":"active",
      "replicas":{
        "core_node4":{
          "core":"backuprestore_testok_restored_shard1_replica_n3",
          "leader":"true",
          "core_node_name":"core_node4",
          "base_url":"https://127.0.0.1:60816/solr",
          "node_name":"127.0.0.1:60816_solr",
          "state":"active",
          "collection":"backuprestore_testok_restored",
          "shard":"shard1",
          "type":"NRT",
          "force_set_state":"false"},
        "core_node8":{
          "core":"backuprestore_testok_restored_shard1_replica_p7",
          "core_node_name":"core_node8",
          "base_url":"https://127.0.0.1:60816/solr",
          "node_name":"127.0.0.1:60816_solr",
          "state":"active",
          "collection":"backuprestore_testok_restored",
          "shard":"shard1",
          "type":"PULL",
          "force_set_state":"false"}},
      "stateTimestamp":"1599044974213686912"}},
  "router":{
    "name":"implicit",
    "field":"shard_s"},
  "nrtReplicas":1,
  "tlogReplicas":0}

Stack Trace:
java.lang.AssertionError: Node 127.0.0.1:60816_solr has 4 replicas. Expected num replicas : 2. state: 
DocCollection(backuprestore_testok_restored/11)={
  "pullReplicas":1,
  "replicationFactor":1,
  "shards":{
    "shard2":{
      "range":null,
      "state":"active",
      "replicas":{
        "core_node2":{
          "core":"backuprestore_testok_restored_shard2_replica_n1",
          "leader":"true",
          "core_node_name":"core_node2",
          "base_url":"https://127.0.0.1:60816/solr",
          "node_name":"127.0.0.1:60816_solr",
          "state":"active",
          "collection":"backuprestore_testok_restored",
          "shard":"shard2",
          "type":"NRT",
          "force_set_state":"false"},
        "core_node6":{
          "core":"backuprestore_testok_restored_shard2_replica_p5",
          "core_node_name":"core_node6",
          "base_url":"https://127.0.0.1:60816/solr",
          "node_name":"127.0.0.1:60816_solr",
          "state":"active",
          "collection":"backuprestore_testok_restored",
          "shard":"shard2",
          "type":"PULL",
          "force_set_state":"false"}},
      "stateTimestamp":"1599044974213672508"},
    "shard1":{
      "range":null,
      "state":"active",
      "replicas":{
        "core_node4":{
          "core":"backuprestore_testok_restored_shard1_replica_n3",
          "leader":"true",
          "core_node_name":"core_node4",
          "base_url":"https://127.0.0.1:60816/solr",
          "node_name":"127.0.0.1:60816_solr",
          "state":"active",
          "collection":"backuprestore_testok_restored",
          "shard":"shard1",
          "type":"NRT",
          "force_set_state":"false"},
        "core_node8":{
          "core":"backuprestore_testok_restored_shard1_replica_p7",
          "core_node_name":"core_node8",
          "base_url":"https://127.0.0.1:60816/solr",
          "node_name":"127.0.0.1:60816_solr",
          "state":"active",
          "collection":"backuprestore_testok_restored",
          "shard":"shard1",
          "type":"PULL",
          "force_set_state":"false"}},
      "stateTimestamp":"1599044974213686912"}},
  "router":{
    "name":"implicit",
    "field":"shard_s"},
  "nrtReplicas":1,
  "tlogReplicas":0}
	at __randomizedtesting.SeedInfo.seed([C047075B09BB5D3B:48133881A74730C3]:0)
	at org.junit.Assert.fail(Assert.java:88)
	at org.junit.Assert.assertTrue(Assert.java:41)
	at org.apache.solr.cloud.api.collections.AbstractCloudBackupRestoreTestCase.lambda$testBackupAndRestore$1(AbstractCloudBackupRestoreTestCase.java:374)
	at java.base/java.util.HashMap.forEach(HashMap.java:1333)
	at org.apache.solr.cloud.api.collections.AbstractCloudBackupRestoreTestCase.testBackupAndRestore(AbstractCloudBackupRestoreTestCase.java:373)
	at org.apache.solr.cloud.api.collections.AbstractCloudBackupRestoreTestCase.test(AbstractCloudBackupRestoreTestCase.java:155)
	at org.apache.solr.cloud.api.collections.TestLocalFSCloudBackupRestore.test(TestLocalFSCloudBackupRestore.java:93)
	at java.base/jdk.internal.reflect.NativeMethodAccessorImpl.invoke0(Native Method)
	at java.base/jdk.internal.reflect.NativeMethodAccessorImpl.invoke(NativeMethodAccessorImpl.java:62)
	at java.base/jdk.internal.reflect.DelegatingMethodAccessorImpl.invoke(DelegatingMethodAccessorImpl.java:43)
	at java.base/java.lang.reflect.Method.invoke(Method.java:567)
	at com.carrotsearch.randomizedtesting.RandomizedRunner.invoke(RandomizedRunner.java:1754)
	at com.carrotsearch.randomizedtesting.RandomizedRunner$8.evaluate(RandomizedRunner.java:942)
	at com.carrotsearch.randomizedtesting.RandomizedRunner$9.evaluate(RandomizedRunner.java:978)
	at com.carrotsearch.randomizedtesting.RandomizedRunner$10.evaluate(RandomizedRunner.java:992)
	at com.carrotsearch.randomizedtesting.rules.SystemPropertiesRestoreRule$1.evaluate(SystemPropertiesRestoreRule.java:57)
	at org.apache.lucene.util.TestRuleSetupTeardownChained$1.evaluate(TestRuleSetupTeardownChained.java:49)
	at org.apache.lucene.util.AbstractBeforeAfterRule$1.evaluate(AbstractBeforeAfterRule.java:45)
	at org.apache.lucene.util.TestRuleThreadAndTestName$1.evaluate(TestRuleThreadAndTestName.java:48)
	at org.apache.lucene.util.TestRuleIgnoreAfterMaxFailures$1.evaluate(TestRuleIgnoreAfterMaxFailures.java:64)
	at org.apache.lucene.util.TestRuleMarkFailure$1.evaluate(TestRuleMarkFailure.java:47)
	at com.carrotsearch.randomizedtesting.rules.StatementAdapter.evaluate(StatementAdapter.java:36)
	at com.carrotsearch.randomizedtesting.ThreadLeakControl$StatementRunner.run(ThreadLeakControl.java:370)
	at com.carrotsearch.randomizedtesting.ThreadLeakControl.forkTimeoutingTask(ThreadLeakControl.java:819)
	at com.carrotsearch.randomizedtesting.ThreadLeakControl$3.evaluate(ThreadLeakControl.java:470)
	at com.carrotsearch.randomizedtesting.RandomizedRunner.runSingleTest(RandomizedRunner.java:951)
	at com.carrotsearch.randomizedtesting.RandomizedRunner$5.evaluate(RandomizedRunner.java:836)
	at com.carrotsearch.randomizedtesting.RandomizedRunner$6.evaluate(RandomizedRunner.java:887)
	at com.carrotsearch.randomizedtesting.RandomizedRunner$7.evaluate(RandomizedRunner.java:898)
	at com.carrotsearch.randomizedtesting.rules.StatementAdapter.evaluate(StatementAdapter.java:36)
	at com.carrotsearch.randomizedtesting.rules.SystemPropertiesRestoreRule$1.evaluate(SystemPropertiesRestoreRule.java:57)
	at org.apache.lucene.util.AbstractBeforeAfterRule$1.evaluate(AbstractBeforeAfterRule.java:45)
	at com.carrotsearch.randomizedtesting.rules.StatementAdapter.evaluate(StatementAdapter.java:36)
	at org.apache.lucene.util.TestRuleStoreClassName$1.evaluate(TestRuleStoreClassName.java:41)
	at com.carrotsearch.randomizedtesting.rules.NoShadowingOrOverridesOnMethodsRule$1.evaluate(NoShadowingOrOverridesOnMethodsRule.java:40)
	at com.carrotsearch.randomizedtesting.rules.NoShadowingOrOverridesOnMethodsRule$1.evaluate(NoShadowingOrOverridesOnMethodsRule.java:40)
	at com.carrotsearch.randomizedtesting.rules.StatementAdapter.evaluate(StatementAdapter.java:36)
	at com.carrotsearch.randomizedtesting.rules.StatementAdapter.evaluate(StatementAdapter.java:36)
	at org.apache.lucene.util.TestRuleAssertionsRequired$1.evaluate(TestRuleAssertionsRequired.java:53)
	at org.apache.lucene.util.TestRuleMarkFailure$1.evaluate(TestRuleMarkFailure.java:47)
	at org.apache.lucene.util.TestRuleIgnoreAfterMaxFailures$1.evaluate(TestRuleIgnoreAfterMaxFailures.java:64)
	at org.apache.lucene.util.TestRuleIgnoreTestSuites$1.evaluate(TestRuleIgnoreTestSuites.java:54)
	at com.carrotsearch.randomizedtesting.rules.StatementAdapter.evaluate(StatementAdapter.java:36)
	at com.carrotsearch.randomizedtesting.ThreadLeakControl$StatementRunner.run(ThreadLeakControl.java:370)
	at com.carrotsearch.randomizedtesting.ThreadLeakControl.lambda$forkTimeoutingTask$0(ThreadLeakControl.java:826)
	at java.base/java.lang.Thread.run(Thread.java:835)




Build Log:
[...truncated 6640 lines...]
ERROR: The following test(s) have failed:
  - org.apache.solr.cloud.api.collections.TestHdfsCloudBackupRestore.test (:solr:core)
    Test output: /Users/jenkins/workspace/Lucene-Solr-master-MacOSX/solr/core/build/test-results/test/outputs/OUTPUT-org.apache.solr.cloud.api.collections.TestHdfsCloudBackupRestore.txt
    Reproduce with: gradlew :solr:core:test --tests "org.apache.solr.cloud.api.collections.TestHdfsCloudBackupRestore" -Ptests.jvms=5 -Ptests.haltonfailure=false -Ptests.jvmargs=-XX:-UseCompressedOops -XX:+UseG1GC -Ptests.seed=C047075B09BB5D3B -Ptests.badapples=false -Ptests.file.encoding=US-ASCII

  - org.apache.solr.cloud.api.collections.TestLocalFSCloudBackupRestore.test (:solr:core)
    Test output: /Users/jenkins/workspace/Lucene-Solr-master-MacOSX/solr/core/build/test-results/test/outputs/OUTPUT-org.apache.solr.cloud.api.collections.TestLocalFSCloudBackupRestore.txt
    Reproduce with: gradlew :solr:core:test --tests "org.apache.solr.cloud.api.collections.TestLocalFSCloudBackupRestore" -Ptests.jvms=5 -Ptests.haltonfailure=false -Ptests.jvmargs=-XX:-UseCompressedOops -XX:+UseG1GC -Ptests.seed=C047075B09BB5D3B -Ptests.badapples=false -Ptests.file.encoding=US-ASCII


Deprecated Gradle features were used in this build, making it incompatible with Gradle 7.0.
Use '--warning-mode all' to show the individual deprecation warnings.
See https://docs.gradle.org/6.4.1/userguide/command_line_interface.html#sec:command_line_warnings

BUILD SUCCESSFUL in 1h 0m 37s
840 actionable tasks: 840 executed
Build step 'Invoke Gradle script' changed build result to SUCCESS
Archiving artifacts
java.lang.InterruptedException: no matches found within 10000
	at hudson.FilePath$ValidateAntFileMask.hasMatch(FilePath.java:2865)
	at hudson.FilePath$ValidateAntFileMask.invoke(FilePath.java:2744)
	at hudson.FilePath$ValidateAntFileMask.invoke(FilePath.java:2725)
	at hudson.FilePath$FileCallableWrapper.call(FilePath.java:3112)
Also:   hudson.remoting.Channel$CallSiteStackTrace: Remote call to MacOSX VBOX
		at hudson.remoting.Channel.attachCallSiteStackTrace(Channel.java:1800)
		at hudson.remoting.UserRequest$ExceptionResponse.retrieve(UserRequest.java:357)
		at hudson.remoting.Channel.call(Channel.java:1001)
		at hudson.FilePath.act(FilePath.java:1070)
		at hudson.FilePath.act(FilePath.java:1059)
		at hudson.FilePath.validateAntFileMask(FilePath.java:2723)
		at hudson.tasks.ArtifactArchiver.perform(ArtifactArchiver.java:270)
		at hudson.tasks.BuildStepCompatibilityLayer.perform(BuildStepCompatibilityLayer.java:78)
		at hudson.tasks.BuildStepMonitor$1.perform(BuildStepMonitor.java:20)
		at hudson.model.AbstractBuild$AbstractBuildExecution.perform(AbstractBuild.java:741)
		at hudson.model.AbstractBuild$AbstractBuildExecution.performAllBuildSteps(AbstractBuild.java:690)
		at hudson.model.Build$BuildExecution.post2(Build.java:186)
		at hudson.model.AbstractBuild$AbstractBuildExecution.post(AbstractBuild.java:635)
		at hudson.model.Run.execute(Run.java:1919)
		at hudson.model.FreeStyleBuild.run(FreeStyleBuild.java:43)
		at hudson.model.ResourceController.execute(ResourceController.java:97)
		at hudson.model.Executor.run(Executor.java:428)
Caused: hudson.FilePath$TunneledInterruptedException
	at hudson.FilePath$FileCallableWrapper.call(FilePath.java:3114)
	at hudson.remoting.UserRequest.perform(UserRequest.java:211)
	at hudson.remoting.UserRequest.perform(UserRequest.java:54)
	at hudson.remoting.Request$2.run(Request.java:375)
	at hudson.remoting.InterceptingExecutorService$1.call(InterceptingExecutorService.java:73)
	at java.util.concurrent.FutureTask.run(FutureTask.java:266)
	at java.util.concurrent.ThreadPoolExecutor.runWorker(ThreadPoolExecutor.java:1149)
	at java.util.concurrent.ThreadPoolExecutor$Worker.run(ThreadPoolExecutor.java:624)
	at java.lang.Thread.run(Thread.java:748)
Caused: java.lang.InterruptedException: java.lang.InterruptedException: no matches found within 10000
	at hudson.FilePath.act(FilePath.java:1072)
	at hudson.FilePath.act(FilePath.java:1059)
	at hudson.FilePath.validateAntFileMask(FilePath.java:2723)
	at hudson.tasks.ArtifactArchiver.perform(ArtifactArchiver.java:270)
	at hudson.tasks.BuildStepCompatibilityLayer.perform(BuildStepCompatibilityLayer.java:78)
	at hudson.tasks.BuildStepMonitor$1.perform(BuildStepMonitor.java:20)
	at hudson.model.AbstractBuild$AbstractBuildExecution.perform(AbstractBuild.java:741)
	at hudson.model.AbstractBuild$AbstractBuildExecution.performAllBuildSteps(AbstractBuild.java:690)
	at hudson.model.Build$BuildExecution.post2(Build.java:186)
	at hudson.model.AbstractBuild$AbstractBuildExecution.post(AbstractBuild.java:635)
	at hudson.model.Run.execute(Run.java:1919)
	at hudson.model.FreeStyleBuild.run(FreeStyleBuild.java:43)
	at hudson.model.ResourceController.execute(ResourceController.java:97)
	at hudson.model.Executor.run(Executor.java:428)
No artifacts found that match the file pattern "**/*.events,heapdumps/**,**/*_pid*.log". Configuration error?
[Java] Sleeping for 5 seconds due to JENKINS-32191...
[Java] Parsing console log (workspace: '/Users/jenkins/workspace/Lucene-Solr-master-MacOSX')
[Java] Successfully parsed console log
[Java] -> found 0 issues (skipped 0 duplicates)
[Java] Skipping post processing
[Java] No filter has been set, publishing all 0 issues
[Java] Using reference build 'Lucene-Solr-master-MacOSX #6492' to compute new, fixed, and outstanding issues
[Java] Issues delta (vs. reference build): outstanding: 0, new: 0, fixed: 0
[Java] No quality gates have been set - skipping
[Java] Health report is disabled - skipping
[Java] Created analysis result for 0 issues (found 0 new issues, fixed 0 issues)
[Java] Attaching ResultAction with ID 'java' to run 'Lucene-Solr-master-MacOSX #6493'.
Recording test results
Build step 'Publish JUnit test result report' changed build result to UNSTABLE
Email was triggered for: Unstable (Test Failures)
Sending email for trigger: Unstable (Test Failures)