You are viewing a plain text version of this content. The canonical link for it is here.
Posted to builds@beam.apache.org by Apache Jenkins Server <je...@builds.apache.org> on 2020/08/29 06:07:19 UTC

Build failed in Jenkins: beam_PostCommit_Python_VR_Spark #3583

See <https://ci-beam.apache.org/job/beam_PostCommit_Python_VR_Spark/3583/display/redirect?page=changes>

Changes:

[srohde] Remove unnecessary limiters and add a method to get the size of a


------------------------------------------
[...truncated 176.24 KB...]
Requirement already satisfied: psycopg2-binary<3.0.0,>=2.8.5 in <https://ci-beam.apache.org/job/beam_PostCommit_Python_VR_Spark/ws/src/build/gradleenv/2022703442/lib/python3.8/site-packages> (from apache-beam==2.25.0.dev0) (2.8.5)
Requirement already satisfied: testcontainers<4.0.0,>=3.0.3 in <https://ci-beam.apache.org/job/beam_PostCommit_Python_VR_Spark/ws/src/build/gradleenv/2022703442/lib/python3.8/site-packages> (from apache-beam==2.25.0.dev0) (3.0.3)
Requirement already satisfied: six>=1.5.2 in <https://ci-beam.apache.org/job/beam_PostCommit_Python_VR_Spark/ws/src/build/gradleenv/2022703442/lib/python3.8/site-packages> (from grpcio<2,>=1.29.0->apache-beam==2.25.0.dev0) (1.15.0)
Requirement already satisfied: docopt in <https://ci-beam.apache.org/job/beam_PostCommit_Python_VR_Spark/ws/src/build/gradleenv/2022703442/lib/python3.8/site-packages> (from hdfs<3.0.0,>=2.1.0->apache-beam==2.25.0.dev0) (0.6.2)
Requirement already satisfied: pbr>=0.11 in <https://ci-beam.apache.org/job/beam_PostCommit_Python_VR_Spark/ws/src/build/gradleenv/2022703442/lib/python3.8/site-packages> (from mock<3.0.0,>=1.0.1->apache-beam==2.25.0.dev0) (5.4.5)
Requirement already satisfied: pyasn1>=0.1.7 in <https://ci-beam.apache.org/job/beam_PostCommit_Python_VR_Spark/ws/src/build/gradleenv/2022703442/lib/python3.8/site-packages> (from oauth2client<4,>=2.0.1->apache-beam==2.25.0.dev0) (0.4.8)
Requirement already satisfied: rsa>=3.1.4 in <https://ci-beam.apache.org/job/beam_PostCommit_Python_VR_Spark/ws/src/build/gradleenv/2022703442/lib/python3.8/site-packages> (from oauth2client<4,>=2.0.1->apache-beam==2.25.0.dev0) (4.6)
Requirement already satisfied: pyasn1-modules>=0.0.5 in <https://ci-beam.apache.org/job/beam_PostCommit_Python_VR_Spark/ws/src/build/gradleenv/2022703442/lib/python3.8/site-packages> (from oauth2client<4,>=2.0.1->apache-beam==2.25.0.dev0) (0.2.8)
Requirement already satisfied: setuptools in <https://ci-beam.apache.org/job/beam_PostCommit_Python_VR_Spark/ws/src/build/gradleenv/2022703442/lib/python3.8/site-packages> (from protobuf<4,>=3.12.2->apache-beam==2.25.0.dev0) (49.6.0)
Requirement already satisfied: pyparsing>=2.1.4 in <https://ci-beam.apache.org/job/beam_PostCommit_Python_VR_Spark/ws/src/build/gradleenv/2022703442/lib/python3.8/site-packages> (from pydot<2,>=1.2.0->apache-beam==2.25.0.dev0) (2.4.7)
Requirement already satisfied: idna<3,>=2.5 in <https://ci-beam.apache.org/job/beam_PostCommit_Python_VR_Spark/ws/src/build/gradleenv/2022703442/lib/python3.8/site-packages> (from requests<3.0.0,>=2.24.0->apache-beam==2.25.0.dev0) (2.10)
Requirement already satisfied: chardet<4,>=3.0.2 in <https://ci-beam.apache.org/job/beam_PostCommit_Python_VR_Spark/ws/src/build/gradleenv/2022703442/lib/python3.8/site-packages> (from requests<3.0.0,>=2.24.0->apache-beam==2.25.0.dev0) (3.0.4)
Requirement already satisfied: certifi>=2017.4.17 in <https://ci-beam.apache.org/job/beam_PostCommit_Python_VR_Spark/ws/src/build/gradleenv/2022703442/lib/python3.8/site-packages> (from requests<3.0.0,>=2.24.0->apache-beam==2.25.0.dev0) (2020.6.20)
Requirement already satisfied: urllib3!=1.25.0,!=1.25.1,<1.26,>=1.21.1 in <https://ci-beam.apache.org/job/beam_PostCommit_Python_VR_Spark/ws/src/build/gradleenv/2022703442/lib/python3.8/site-packages> (from requests<3.0.0,>=2.24.0->apache-beam==2.25.0.dev0) (1.25.10)
Requirement already satisfied: packaging in <https://ci-beam.apache.org/job/beam_PostCommit_Python_VR_Spark/ws/src/build/gradleenv/2022703442/lib/python3.8/site-packages> (from pytest<5.0,>=4.4.0->apache-beam==2.25.0.dev0) (20.4)
Requirement already satisfied: wcwidth in <https://ci-beam.apache.org/job/beam_PostCommit_Python_VR_Spark/ws/src/build/gradleenv/2022703442/lib/python3.8/site-packages> (from pytest<5.0,>=4.4.0->apache-beam==2.25.0.dev0) (0.2.5)
Requirement already satisfied: atomicwrites>=1.0 in <https://ci-beam.apache.org/job/beam_PostCommit_Python_VR_Spark/ws/src/build/gradleenv/2022703442/lib/python3.8/site-packages> (from pytest<5.0,>=4.4.0->apache-beam==2.25.0.dev0) (1.4.0)
Requirement already satisfied: pluggy<1.0,>=0.12 in <https://ci-beam.apache.org/job/beam_PostCommit_Python_VR_Spark/ws/src/build/gradleenv/2022703442/lib/python3.8/site-packages> (from pytest<5.0,>=4.4.0->apache-beam==2.25.0.dev0) (0.13.1)
Requirement already satisfied: more-itertools>=4.0.0; python_version > "2.7" in <https://ci-beam.apache.org/job/beam_PostCommit_Python_VR_Spark/ws/src/build/gradleenv/2022703442/lib/python3.8/site-packages> (from pytest<5.0,>=4.4.0->apache-beam==2.25.0.dev0) (8.5.0)
Requirement already satisfied: attrs>=17.4.0 in <https://ci-beam.apache.org/job/beam_PostCommit_Python_VR_Spark/ws/src/build/gradleenv/2022703442/lib/python3.8/site-packages> (from pytest<5.0,>=4.4.0->apache-beam==2.25.0.dev0) (20.1.0)
Requirement already satisfied: py>=1.5.0 in <https://ci-beam.apache.org/job/beam_PostCommit_Python_VR_Spark/ws/src/build/gradleenv/2022703442/lib/python3.8/site-packages> (from pytest<5.0,>=4.4.0->apache-beam==2.25.0.dev0) (1.9.0)
Requirement already satisfied: pytest-forked in <https://ci-beam.apache.org/job/beam_PostCommit_Python_VR_Spark/ws/src/build/gradleenv/2022703442/lib/python3.8/site-packages> (from pytest-xdist<2,>=1.29.0->apache-beam==2.25.0.dev0) (1.3.0)
Requirement already satisfied: execnet>=1.1 in <https://ci-beam.apache.org/job/beam_PostCommit_Python_VR_Spark/ws/src/build/gradleenv/2022703442/lib/python3.8/site-packages> (from pytest-xdist<2,>=1.29.0->apache-beam==2.25.0.dev0) (1.7.1)
Requirement already satisfied: blindspin in <https://ci-beam.apache.org/job/beam_PostCommit_Python_VR_Spark/ws/src/build/gradleenv/2022703442/lib/python3.8/site-packages> (from testcontainers<4.0.0,>=3.0.3->apache-beam==2.25.0.dev0) (2.0.1)
Requirement already satisfied: wrapt in <https://ci-beam.apache.org/job/beam_PostCommit_Python_VR_Spark/ws/src/build/gradleenv/2022703442/lib/python3.8/site-packages> (from testcontainers<4.0.0,>=3.0.3->apache-beam==2.25.0.dev0) (1.12.1)
Requirement already satisfied: deprecation in <https://ci-beam.apache.org/job/beam_PostCommit_Python_VR_Spark/ws/src/build/gradleenv/2022703442/lib/python3.8/site-packages> (from testcontainers<4.0.0,>=3.0.3->apache-beam==2.25.0.dev0) (2.1.0)
Requirement already satisfied: crayons in <https://ci-beam.apache.org/job/beam_PostCommit_Python_VR_Spark/ws/src/build/gradleenv/2022703442/lib/python3.8/site-packages> (from testcontainers<4.0.0,>=3.0.3->apache-beam==2.25.0.dev0) (0.4.0)
Requirement already satisfied: docker in <https://ci-beam.apache.org/job/beam_PostCommit_Python_VR_Spark/ws/src/build/gradleenv/2022703442/lib/python3.8/site-packages> (from testcontainers<4.0.0,>=3.0.3->apache-beam==2.25.0.dev0) (4.3.1)
Requirement already satisfied: apipkg>=1.4 in <https://ci-beam.apache.org/job/beam_PostCommit_Python_VR_Spark/ws/src/build/gradleenv/2022703442/lib/python3.8/site-packages> (from execnet>=1.1->pytest-xdist<2,>=1.29.0->apache-beam==2.25.0.dev0) (1.5)
Requirement already satisfied: colorama in <https://ci-beam.apache.org/job/beam_PostCommit_Python_VR_Spark/ws/src/build/gradleenv/2022703442/lib/python3.8/site-packages> (from crayons->testcontainers<4.0.0,>=3.0.3->apache-beam==2.25.0.dev0) (0.4.3)
Requirement already satisfied: websocket-client>=0.32.0 in <https://ci-beam.apache.org/job/beam_PostCommit_Python_VR_Spark/ws/src/build/gradleenv/2022703442/lib/python3.8/site-packages> (from docker->testcontainers<4.0.0,>=3.0.3->apache-beam==2.25.0.dev0) (0.57.0)
Installing collected packages: apache-beam
  Attempting uninstall: apache-beam
    Found existing installation: apache-beam 2.25.0.dev0
    Uninstalling apache-beam-2.25.0.dev0:
      Successfully uninstalled apache-beam-2.25.0.dev0
  Running setup.py develop for apache-beam
Successfully installed apache-beam
Traceback (most recent call last):
  File "/usr/lib/python3.8/runpy.py", line 185, in _run_module_as_main
    mod_name, mod_spec, code = _get_module_details(mod_name, _Error)
  File "/usr/lib/python3.8/runpy.py", line 111, in _get_module_details
    __import__(pkg_name)
  File "<https://ci-beam.apache.org/job/beam_PostCommit_Python_VR_Spark/ws/src/sdks/python/apache_beam/__init__.py",> line 104, in <module>
    from apache_beam import coders
  File "<https://ci-beam.apache.org/job/beam_PostCommit_Python_VR_Spark/ws/src/sdks/python/apache_beam/coders/__init__.py",> line 19, in <module>
    from apache_beam.coders.coders import *
  File "<https://ci-beam.apache.org/job/beam_PostCommit_Python_VR_Spark/ws/src/sdks/python/apache_beam/coders/coders.py",> line 46, in <module>
    from apache_beam.coders import coder_impl
  File "<https://ci-beam.apache.org/job/beam_PostCommit_Python_VR_Spark/ws/src/sdks/python/apache_beam/coders/coder_impl.py",> line 61, in <module>
    from apache_beam.utils import windowed_value
  File "<https://ci-beam.apache.org/job/beam_PostCommit_Python_VR_Spark/ws/src/sdks/python/apache_beam/utils/windowed_value.py",> line 40, in <module>
    from apache_beam.utils.timestamp import MAX_TIMESTAMP
  File "<https://ci-beam.apache.org/job/beam_PostCommit_Python_VR_Spark/ws/src/sdks/python/apache_beam/utils/timestamp.py",> line 41, in <module>
    from apache_beam.portability import common_urns
  File "<https://ci-beam.apache.org/job/beam_PostCommit_Python_VR_Spark/ws/src/sdks/python/apache_beam/portability/common_urns.py",> line 35, in <module>
    from apache_beam.portability.api.standard_window_fns_pb2_urns import FixedWindowsPayload
  File "<https://ci-beam.apache.org/job/beam_PostCommit_Python_VR_Spark/ws/src/sdks/python/apache_beam/portability/api/standard_window_fns_pb2_urns.py",> line 29
    PROPS)
         ^
SyntaxError: unmatched ')'

> Task :sdks:python:test-suites:portable:py38:sparkCompatibilityMatrixBatchLOOPBACK FAILED

> Task :sdks:python:test-suites:portable:py35:sparkCompatibilityMatrixBatchLOOPBACK
Obtaining file://<https://ci-beam.apache.org/job/beam_PostCommit_Python_VR_Spark/ws/src/sdks/python>
Requirement already satisfied: crcmod<2.0,>=1.7 in <https://ci-beam.apache.org/job/beam_PostCommit_Python_VR_Spark/ws/src/build/gradleenv/2022703439/lib/python3.5/site-packages> (from apache-beam==2.25.0.dev0) (1.7)
Requirement already satisfied: dill<0.3.2,>=0.3.1.1 in <https://ci-beam.apache.org/job/beam_PostCommit_Python_VR_Spark/ws/src/build/gradleenv/2022703439/lib/python3.5/site-packages> (from apache-beam==2.25.0.dev0) (0.3.1.1)
Requirement already satisfied: fastavro<0.24,>=0.21.4 in <https://ci-beam.apache.org/job/beam_PostCommit_Python_VR_Spark/ws/src/build/gradleenv/2022703439/lib/python3.5/site-packages> (from apache-beam==2.25.0.dev0) (0.23.6)
Requirement already satisfied: future<1.0.0,>=0.18.2 in <https://ci-beam.apache.org/job/beam_PostCommit_Python_VR_Spark/ws/src/build/gradleenv/2022703439/lib/python3.5/site-packages> (from apache-beam==2.25.0.dev0) (0.18.2)
Requirement already satisfied: grpcio<2,>=1.29.0 in <https://ci-beam.apache.org/job/beam_PostCommit_Python_VR_Spark/ws/src/build/gradleenv/2022703439/lib/python3.5/site-packages> (from apache-beam==2.25.0.dev0) (1.31.0)
Requirement already satisfied: hdfs<3.0.0,>=2.1.0 in <https://ci-beam.apache.org/job/beam_PostCommit_Python_VR_Spark/ws/src/build/gradleenv/2022703439/lib/python3.5/site-packages> (from apache-beam==2.25.0.dev0) (2.5.8)
Requirement already satisfied: httplib2<0.18.0,>=0.8 in <https://ci-beam.apache.org/job/beam_PostCommit_Python_VR_Spark/ws/src/build/gradleenv/2022703439/lib/python3.5/site-packages> (from apache-beam==2.25.0.dev0) (0.17.4)
Requirement already satisfied: mock<3.0.0,>=1.0.1 in <https://ci-beam.apache.org/job/beam_PostCommit_Python_VR_Spark/ws/src/build/gradleenv/2022703439/lib/python3.5/site-packages> (from apache-beam==2.25.0.dev0) (2.0.0)
Requirement already satisfied: numpy<2,>=1.14.3 in <https://ci-beam.apache.org/job/beam_PostCommit_Python_VR_Spark/ws/src/build/gradleenv/2022703439/lib/python3.5/site-packages> (from apache-beam==2.25.0.dev0) (1.18.5)
Requirement already satisfied: pymongo<4.0.0,>=3.8.0 in <https://ci-beam.apache.org/job/beam_PostCommit_Python_VR_Spark/ws/src/build/gradleenv/2022703439/lib/python3.5/site-packages> (from apache-beam==2.25.0.dev0) (3.11.0)
Requirement already satisfied: oauth2client<4,>=2.0.1 in <https://ci-beam.apache.org/job/beam_PostCommit_Python_VR_Spark/ws/src/build/gradleenv/2022703439/lib/python3.5/site-packages> (from apache-beam==2.25.0.dev0) (3.0.0)
Requirement already satisfied: protobuf<4,>=3.12.2 in <https://ci-beam.apache.org/job/beam_PostCommit_Python_VR_Spark/ws/src/build/gradleenv/2022703439/lib/python3.5/site-packages> (from apache-beam==2.25.0.dev0) (3.13.0)
Requirement already satisfied: pydot<2,>=1.2.0 in <https://ci-beam.apache.org/job/beam_PostCommit_Python_VR_Spark/ws/src/build/gradleenv/2022703439/lib/python3.5/site-packages> (from apache-beam==2.25.0.dev0) (1.4.1)
Requirement already satisfied: python-dateutil<3,>=2.8.0 in <https://ci-beam.apache.org/job/beam_PostCommit_Python_VR_Spark/ws/src/build/gradleenv/2022703439/lib/python3.5/site-packages> (from apache-beam==2.25.0.dev0) (2.8.1)
Requirement already satisfied: pytz>=2018.3 in <https://ci-beam.apache.org/job/beam_PostCommit_Python_VR_Spark/ws/src/build/gradleenv/2022703439/lib/python3.5/site-packages> (from apache-beam==2.25.0.dev0) (2020.1)
Requirement already satisfied: requests<3.0.0,>=2.24.0 in <https://ci-beam.apache.org/job/beam_PostCommit_Python_VR_Spark/ws/src/build/gradleenv/2022703439/lib/python3.5/site-packages> (from apache-beam==2.25.0.dev0) (2.24.0)
Requirement already satisfied: typing-extensions<3.8.0,>=3.7.0 in <https://ci-beam.apache.org/job/beam_PostCommit_Python_VR_Spark/ws/src/build/gradleenv/2022703439/lib/python3.5/site-packages> (from apache-beam==2.25.0.dev0) (3.7.4.3)
Requirement already satisfied: typing<3.8.0,>=3.7.0 in <https://ci-beam.apache.org/job/beam_PostCommit_Python_VR_Spark/ws/src/build/gradleenv/2022703439/lib/python3.5/site-packages> (from apache-beam==2.25.0.dev0) (3.7.4.3)
Requirement already satisfied: avro-python3!=1.9.2,<1.10.0,>=1.8.1 in <https://ci-beam.apache.org/job/beam_PostCommit_Python_VR_Spark/ws/src/build/gradleenv/2022703439/lib/python3.5/site-packages> (from apache-beam==2.25.0.dev0) (1.9.2.1)
Requirement already satisfied: pyarrow<0.18.0,>=0.15.1 in <https://ci-beam.apache.org/job/beam_PostCommit_Python_VR_Spark/ws/src/build/gradleenv/2022703439/lib/python3.5/site-packages> (from apache-beam==2.25.0.dev0) (0.17.1)
Requirement already satisfied: freezegun>=0.3.12 in <https://ci-beam.apache.org/job/beam_PostCommit_Python_VR_Spark/ws/src/build/gradleenv/2022703439/lib/python3.5/site-packages> (from apache-beam==2.25.0.dev0) (0.3.15)
Requirement already satisfied: nose>=1.3.7 in <https://ci-beam.apache.org/job/beam_PostCommit_Python_VR_Spark/ws/src/build/gradleenv/2022703439/lib/python3.5/site-packages> (from apache-beam==2.25.0.dev0) (1.3.7)
Requirement already satisfied: nose_xunitmp>=0.4.1 in <https://ci-beam.apache.org/job/beam_PostCommit_Python_VR_Spark/ws/src/build/gradleenv/2022703439/lib/python3.5/site-packages> (from apache-beam==2.25.0.dev0) (0.4.1)
Requirement already satisfied: parameterized<0.8.0,>=0.7.1 in <https://ci-beam.apache.org/job/beam_PostCommit_Python_VR_Spark/ws/src/build/gradleenv/2022703439/lib/python3.5/site-packages> (from apache-beam==2.25.0.dev0) (0.7.4)
Requirement already satisfied: pyhamcrest!=1.10.0,<2.0.0,>=1.9 in <https://ci-beam.apache.org/job/beam_PostCommit_Python_VR_Spark/ws/src/build/gradleenv/2022703439/lib/python3.5/site-packages> (from apache-beam==2.25.0.dev0) (1.10.1)
Requirement already satisfied: pyyaml<6.0.0,>=3.12 in <https://ci-beam.apache.org/job/beam_PostCommit_Python_VR_Spark/ws/src/build/gradleenv/2022703439/lib/python3.5/site-packages> (from apache-beam==2.25.0.dev0) (5.3.1)
Requirement already satisfied: requests_mock<2.0,>=1.7 in <https://ci-beam.apache.org/job/beam_PostCommit_Python_VR_Spark/ws/src/build/gradleenv/2022703439/lib/python3.5/site-packages> (from apache-beam==2.25.0.dev0) (1.8.0)
Requirement already satisfied: tenacity<6.0,>=5.0.2 in <https://ci-beam.apache.org/job/beam_PostCommit_Python_VR_Spark/ws/src/build/gradleenv/2022703439/lib/python3.5/site-packages> (from apache-beam==2.25.0.dev0) (5.1.5)
Requirement already satisfied: pytest<5.0,>=4.4.0 in <https://ci-beam.apache.org/job/beam_PostCommit_Python_VR_Spark/ws/src/build/gradleenv/2022703439/lib/python3.5/site-packages> (from apache-beam==2.25.0.dev0) (4.6.11)
Requirement already satisfied: pytest-xdist<2,>=1.29.0 in <https://ci-beam.apache.org/job/beam_PostCommit_Python_VR_Spark/ws/src/build/gradleenv/2022703439/lib/python3.5/site-packages> (from apache-beam==2.25.0.dev0) (1.34.0)
Requirement already satisfied: pytest-timeout<2,>=1.3.3 in <https://ci-beam.apache.org/job/beam_PostCommit_Python_VR_Spark/ws/src/build/gradleenv/2022703439/lib/python3.5/site-packages> (from apache-beam==2.25.0.dev0) (1.4.2)
Requirement already satisfied: pandas<1,>=0.24.2 in <https://ci-beam.apache.org/job/beam_PostCommit_Python_VR_Spark/ws/src/build/gradleenv/2022703439/lib/python3.5/site-packages> (from apache-beam==2.25.0.dev0) (0.24.2)
Requirement already satisfied: sqlalchemy<2.0,>=1.3 in <https://ci-beam.apache.org/job/beam_PostCommit_Python_VR_Spark/ws/src/build/gradleenv/2022703439/lib/python3.5/site-packages> (from apache-beam==2.25.0.dev0) (1.3.19)
Requirement already satisfied: psycopg2-binary<3.0.0,>=2.8.5 in <https://ci-beam.apache.org/job/beam_PostCommit_Python_VR_Spark/ws/src/build/gradleenv/2022703439/lib/python3.5/site-packages> (from apache-beam==2.25.0.dev0) (2.8.5)
Requirement already satisfied: testcontainers<4.0.0,>=3.0.3 in <https://ci-beam.apache.org/job/beam_PostCommit_Python_VR_Spark/ws/src/build/gradleenv/2022703439/lib/python3.5/site-packages> (from apache-beam==2.25.0.dev0) (3.0.3)
Requirement already satisfied: six>=1.5.2 in <https://ci-beam.apache.org/job/beam_PostCommit_Python_VR_Spark/ws/src/build/gradleenv/2022703439/lib/python3.5/site-packages> (from grpcio<2,>=1.29.0->apache-beam==2.25.0.dev0) (1.15.0)
Requirement already satisfied: docopt in <https://ci-beam.apache.org/job/beam_PostCommit_Python_VR_Spark/ws/src/build/gradleenv/2022703439/lib/python3.5/site-packages> (from hdfs<3.0.0,>=2.1.0->apache-beam==2.25.0.dev0) (0.6.2)
Requirement already satisfied: pbr>=0.11 in <https://ci-beam.apache.org/job/beam_PostCommit_Python_VR_Spark/ws/src/build/gradleenv/2022703439/lib/python3.5/site-packages> (from mock<3.0.0,>=1.0.1->apache-beam==2.25.0.dev0) (5.4.5)
Requirement already satisfied: pyasn1>=0.1.7 in <https://ci-beam.apache.org/job/beam_PostCommit_Python_VR_Spark/ws/src/build/gradleenv/2022703439/lib/python3.5/site-packages> (from oauth2client<4,>=2.0.1->apache-beam==2.25.0.dev0) (0.4.8)
Requirement already satisfied: pyasn1-modules>=0.0.5 in <https://ci-beam.apache.org/job/beam_PostCommit_Python_VR_Spark/ws/src/build/gradleenv/2022703439/lib/python3.5/site-packages> (from oauth2client<4,>=2.0.1->apache-beam==2.25.0.dev0) (0.2.8)
Requirement already satisfied: rsa>=3.1.4 in <https://ci-beam.apache.org/job/beam_PostCommit_Python_VR_Spark/ws/src/build/gradleenv/2022703439/lib/python3.5/site-packages> (from oauth2client<4,>=2.0.1->apache-beam==2.25.0.dev0) (4.6)
Requirement already satisfied: setuptools in <https://ci-beam.apache.org/job/beam_PostCommit_Python_VR_Spark/ws/src/build/gradleenv/2022703439/lib/python3.5/site-packages> (from protobuf<4,>=3.12.2->apache-beam==2.25.0.dev0) (49.6.0)
Requirement already satisfied: pyparsing>=2.1.4 in <https://ci-beam.apache.org/job/beam_PostCommit_Python_VR_Spark/ws/src/build/gradleenv/2022703439/lib/python3.5/site-packages> (from pydot<2,>=1.2.0->apache-beam==2.25.0.dev0) (2.4.7)
Requirement already satisfied: idna<3,>=2.5 in <https://ci-beam.apache.org/job/beam_PostCommit_Python_VR_Spark/ws/src/build/gradleenv/2022703439/lib/python3.5/site-packages> (from requests<3.0.0,>=2.24.0->apache-beam==2.25.0.dev0) (2.10)
Requirement already satisfied: certifi>=2017.4.17 in <https://ci-beam.apache.org/job/beam_PostCommit_Python_VR_Spark/ws/src/build/gradleenv/2022703439/lib/python3.5/site-packages> (from requests<3.0.0,>=2.24.0->apache-beam==2.25.0.dev0) (2020.6.20)
Requirement already satisfied: chardet<4,>=3.0.2 in <https://ci-beam.apache.org/job/beam_PostCommit_Python_VR_Spark/ws/src/build/gradleenv/2022703439/lib/python3.5/site-packages> (from requests<3.0.0,>=2.24.0->apache-beam==2.25.0.dev0) (3.0.4)
Requirement already satisfied: urllib3!=1.25.0,!=1.25.1,<1.26,>=1.21.1 in <https://ci-beam.apache.org/job/beam_PostCommit_Python_VR_Spark/ws/src/build/gradleenv/2022703439/lib/python3.5/site-packages> (from requests<3.0.0,>=2.24.0->apache-beam==2.25.0.dev0) (1.25.10)
Requirement already satisfied: pluggy<1.0,>=0.12 in <https://ci-beam.apache.org/job/beam_PostCommit_Python_VR_Spark/ws/src/build/gradleenv/2022703439/lib/python3.5/site-packages> (from pytest<5.0,>=4.4.0->apache-beam==2.25.0.dev0) (0.13.1)
Requirement already satisfied: pathlib2>=2.2.0; python_version < "3.6" in <https://ci-beam.apache.org/job/beam_PostCommit_Python_VR_Spark/ws/src/build/gradleenv/2022703439/lib/python3.5/site-packages> (from pytest<5.0,>=4.4.0->apache-beam==2.25.0.dev0) (2.3.5)
Requirement already satisfied: more-itertools>=4.0.0; python_version > "2.7" in <https://ci-beam.apache.org/job/beam_PostCommit_Python_VR_Spark/ws/src/build/gradleenv/2022703439/lib/python3.5/site-packages> (from pytest<5.0,>=4.4.0->apache-beam==2.25.0.dev0) (8.5.0)
Requirement already satisfied: wcwidth in <https://ci-beam.apache.org/job/beam_PostCommit_Python_VR_Spark/ws/src/build/gradleenv/2022703439/lib/python3.5/site-packages> (from pytest<5.0,>=4.4.0->apache-beam==2.25.0.dev0) (0.2.5)
Requirement already satisfied: packaging in <https://ci-beam.apache.org/job/beam_PostCommit_Python_VR_Spark/ws/src/build/gradleenv/2022703439/lib/python3.5/site-packages> (from pytest<5.0,>=4.4.0->apache-beam==2.25.0.dev0) (20.4)
Requirement already satisfied: importlib-metadata>=0.12; python_version < "3.8" in <https://ci-beam.apache.org/job/beam_PostCommit_Python_VR_Spark/ws/src/build/gradleenv/2022703439/lib/python3.5/site-packages> (from pytest<5.0,>=4.4.0->apache-beam==2.25.0.dev0) (1.7.0)
Requirement already satisfied: attrs>=17.4.0 in <https://ci-beam.apache.org/job/beam_PostCommit_Python_VR_Spark/ws/src/build/gradleenv/2022703439/lib/python3.5/site-packages> (from pytest<5.0,>=4.4.0->apache-beam==2.25.0.dev0) (20.1.0)
Requirement already satisfied: atomicwrites>=1.0 in <https://ci-beam.apache.org/job/beam_PostCommit_Python_VR_Spark/ws/src/build/gradleenv/2022703439/lib/python3.5/site-packages> (from pytest<5.0,>=4.4.0->apache-beam==2.25.0.dev0) (1.4.0)
Requirement already satisfied: py>=1.5.0 in <https://ci-beam.apache.org/job/beam_PostCommit_Python_VR_Spark/ws/src/build/gradleenv/2022703439/lib/python3.5/site-packages> (from pytest<5.0,>=4.4.0->apache-beam==2.25.0.dev0) (1.9.0)
Requirement already satisfied: pytest-forked in <https://ci-beam.apache.org/job/beam_PostCommit_Python_VR_Spark/ws/src/build/gradleenv/2022703439/lib/python3.5/site-packages> (from pytest-xdist<2,>=1.29.0->apache-beam==2.25.0.dev0) (1.3.0)
Requirement already satisfied: execnet>=1.1 in <https://ci-beam.apache.org/job/beam_PostCommit_Python_VR_Spark/ws/src/build/gradleenv/2022703439/lib/python3.5/site-packages> (from pytest-xdist<2,>=1.29.0->apache-beam==2.25.0.dev0) (1.7.1)
Requirement already satisfied: docker in <https://ci-beam.apache.org/job/beam_PostCommit_Python_VR_Spark/ws/src/build/gradleenv/2022703439/lib/python3.5/site-packages> (from testcontainers<4.0.0,>=3.0.3->apache-beam==2.25.0.dev0) (4.3.1)
Requirement already satisfied: deprecation in <https://ci-beam.apache.org/job/beam_PostCommit_Python_VR_Spark/ws/src/build/gradleenv/2022703439/lib/python3.5/site-packages> (from testcontainers<4.0.0,>=3.0.3->apache-beam==2.25.0.dev0) (2.1.0)
Requirement already satisfied: blindspin in <https://ci-beam.apache.org/job/beam_PostCommit_Python_VR_Spark/ws/src/build/gradleenv/2022703439/lib/python3.5/site-packages> (from testcontainers<4.0.0,>=3.0.3->apache-beam==2.25.0.dev0) (2.0.1)
Requirement already satisfied: crayons in <https://ci-beam.apache.org/job/beam_PostCommit_Python_VR_Spark/ws/src/build/gradleenv/2022703439/lib/python3.5/site-packages> (from testcontainers<4.0.0,>=3.0.3->apache-beam==2.25.0.dev0) (0.4.0)
Requirement already satisfied: wrapt in <https://ci-beam.apache.org/job/beam_PostCommit_Python_VR_Spark/ws/src/build/gradleenv/2022703439/lib/python3.5/site-packages> (from testcontainers<4.0.0,>=3.0.3->apache-beam==2.25.0.dev0) (1.12.1)
Requirement already satisfied: zipp>=0.5 in <https://ci-beam.apache.org/job/beam_PostCommit_Python_VR_Spark/ws/src/build/gradleenv/2022703439/lib/python3.5/site-packages> (from importlib-metadata>=0.12; python_version < "3.8"->pytest<5.0,>=4.4.0->apache-beam==2.25.0.dev0) (1.2.0)
Requirement already satisfied: apipkg>=1.4 in <https://ci-beam.apache.org/job/beam_PostCommit_Python_VR_Spark/ws/src/build/gradleenv/2022703439/lib/python3.5/site-packages> (from execnet>=1.1->pytest-xdist<2,>=1.29.0->apache-beam==2.25.0.dev0) (1.5)
Requirement already satisfied: websocket-client>=0.32.0 in <https://ci-beam.apache.org/job/beam_PostCommit_Python_VR_Spark/ws/src/build/gradleenv/2022703439/lib/python3.5/site-packages> (from docker->testcontainers<4.0.0,>=3.0.3->apache-beam==2.25.0.dev0) (0.57.0)
Requirement already satisfied: colorama in <https://ci-beam.apache.org/job/beam_PostCommit_Python_VR_Spark/ws/src/build/gradleenv/2022703439/lib/python3.5/site-packages> (from crayons->testcontainers<4.0.0,>=3.0.3->apache-beam==2.25.0.dev0) (0.4.3)
Installing collected packages: apache-beam
  Attempting uninstall: apache-beam
    Found existing installation: apache-beam 2.25.0.dev0
    Uninstalling apache-beam-2.25.0.dev0:
      Successfully uninstalled apache-beam-2.25.0.dev0
  Running setup.py develop for apache-beam
Successfully installed apache-beam
<https://ci-beam.apache.org/job/beam_PostCommit_Python_VR_Spark/ws/src/sdks/python/apache_beam/__init__.py>:86: UserWarning: You are using the final Apache Beam release with Python 3.5 support. New releases of Apache Beam will require Python 3.6 or a newer version.
  'You are using the final Apache Beam release with Python 3.5 support. '
Traceback (most recent call last):
  File "/usr/lib/python3.5/runpy.py", line 174, in _run_module_as_main
    mod_name, mod_spec, code = _get_module_details(mod_name, _Error)
  File "/usr/lib/python3.5/runpy.py", line 109, in _get_module_details
    __import__(pkg_name)
  File "<https://ci-beam.apache.org/job/beam_PostCommit_Python_VR_Spark/ws/src/sdks/python/apache_beam/__init__.py",> line 104, in <module>
    from apache_beam import coders
  File "<https://ci-beam.apache.org/job/beam_PostCommit_Python_VR_Spark/ws/src/sdks/python/apache_beam/coders/__init__.py",> line 19, in <module>
    from apache_beam.coders.coders import *
  File "<https://ci-beam.apache.org/job/beam_PostCommit_Python_VR_Spark/ws/src/sdks/python/apache_beam/coders/coders.py",> line 46, in <module>
    from apache_beam.coders import coder_impl
  File "<https://ci-beam.apache.org/job/beam_PostCommit_Python_VR_Spark/ws/src/sdks/python/apache_beam/coders/coder_impl.py",> line 61, in <module>
    from apache_beam.utils import windowed_value
  File "<https://ci-beam.apache.org/job/beam_PostCommit_Python_VR_Spark/ws/src/sdks/python/apache_beam/utils/windowed_value.py",> line 40, in <module>
    from apache_beam.utils.timestamp import MAX_TIMESTAMP
  File "<https://ci-beam.apache.org/job/beam_PostCommit_Python_VR_Spark/ws/src/sdks/python/apache_beam/utils/timestamp.py",> line 41, in <module>
    from apache_beam.portability import common_urns
  File "<https://ci-beam.apache.org/job/beam_PostCommit_Python_VR_Spark/ws/src/sdks/python/apache_beam/portability/common_urns.py",> line 35, in <module>
    from apache_beam.portability.api.standard_window_fns_pb2_urns import FixedWindowsPayload
  File "<https://ci-beam.apache.org/job/beam_PostCommit_Python_VR_Spark/ws/src/sdks/python/apache_beam/portability/api/standard_window_fns_pb2_urns.py",> line 29
    PROPS)
         ^
SyntaxError: invalid syntax

> Task :sdks:python:test-suites:portable:py35:sparkCompatibilityMatrixBatchLOOPBACK FAILED

FAILURE: Build completed with 5 failures.

1: Task failed with an exception.
-----------
* Where:
Script '<https://ci-beam.apache.org/job/beam_PostCommit_Python_VR_Spark/ws/src/sdks/python/test-suites/portable/common.gradle'> line: 173

* What went wrong:
Execution failed for task ':sdks:python:test-suites:portable:py2:sparkCompatibilityMatrixBatchLOOPBACK'.
> Process 'command 'sh'' finished with non-zero exit value 1

* Try:
Run with --stacktrace option to get the stack trace. Run with --info or --debug option to get more log output. Run with --scan to get full insights.
==============================================================================

2: Task failed with an exception.
-----------
* Where:
Script '<https://ci-beam.apache.org/job/beam_PostCommit_Python_VR_Spark/ws/src/sdks/python/test-suites/portable/common.gradle'> line: 173

* What went wrong:
Execution failed for task ':sdks:python:test-suites:portable:py37:sparkCompatibilityMatrixBatchLOOPBACK'.
> Process 'command 'sh'' finished with non-zero exit value 1

* Try:
Run with --stacktrace option to get the stack trace. Run with --info or --debug option to get more log output. Run with --scan to get full insights.
==============================================================================

3: Task failed with an exception.
-----------
* Where:
Script '<https://ci-beam.apache.org/job/beam_PostCommit_Python_VR_Spark/ws/src/sdks/python/test-suites/portable/common.gradle'> line: 173

* What went wrong:
Execution failed for task ':sdks:python:test-suites:portable:py36:sparkCompatibilityMatrixBatchLOOPBACK'.
> Process 'command 'sh'' finished with non-zero exit value 1

* Try:
Run with --stacktrace option to get the stack trace. Run with --info or --debug option to get more log output. Run with --scan to get full insights.
==============================================================================

4: Task failed with an exception.
-----------
* Where:
Script '<https://ci-beam.apache.org/job/beam_PostCommit_Python_VR_Spark/ws/src/sdks/python/test-suites/portable/common.gradle'> line: 173

* What went wrong:
Execution failed for task ':sdks:python:test-suites:portable:py38:sparkCompatibilityMatrixBatchLOOPBACK'.
> Process 'command 'sh'' finished with non-zero exit value 1

* Try:
Run with --stacktrace option to get the stack trace. Run with --info or --debug option to get more log output. Run with --scan to get full insights.
==============================================================================

5: Task failed with an exception.
-----------
* Where:
Script '<https://ci-beam.apache.org/job/beam_PostCommit_Python_VR_Spark/ws/src/sdks/python/test-suites/portable/common.gradle'> line: 173

* What went wrong:
Execution failed for task ':sdks:python:test-suites:portable:py35:sparkCompatibilityMatrixBatchLOOPBACK'.
> Process 'command 'sh'' finished with non-zero exit value 1

* Try:
Run with --stacktrace option to get the stack trace. Run with --info or --debug option to get more log output. Run with --scan to get full insights.
==============================================================================

* Get more help at https://help.gradle.org

Deprecated Gradle features were used in this build, making it incompatible with Gradle 6.0.
Use '--warning-mode all' to show the individual deprecation warnings.
See https://docs.gradle.org/5.2.1/userguide/command_line_interface.html#sec:command_line_warnings

BUILD FAILED in 6m 53s
78 actionable tasks: 63 executed, 15 from cache

Publishing build scan...
https://gradle.com/s/t3zusbpkqy4rk

Build step 'Invoke Gradle script' changed build result to FAILURE
Build step 'Invoke Gradle script' marked build as failure

---------------------------------------------------------------------
To unsubscribe, e-mail: builds-unsubscribe@beam.apache.org
For additional commands, e-mail: builds-help@beam.apache.org


Jenkins build is back to normal : beam_PostCommit_Python_VR_Spark #3584

Posted by Apache Jenkins Server <je...@builds.apache.org>.
See <https://ci-beam.apache.org/job/beam_PostCommit_Python_VR_Spark/3584/display/redirect>


---------------------------------------------------------------------
To unsubscribe, e-mail: builds-unsubscribe@beam.apache.org
For additional commands, e-mail: builds-help@beam.apache.org