You are viewing a plain text version of this content. The canonical link for it is here.
Posted to builds@mesos.apache.org by Apache Jenkins Server <je...@builds.apache.org> on 2026/06/15 12:46:06 UTC

Branch: origin/master Mesos » Mesos-Buildbot - Build # 392 - Failure!

Branch: origin/master

Mesos » Mesos-Buildbot - Build # 392 - Failure:

Check console output at https://ci-builds.apache.org/job/Mesos/job/Mesos-Buildbot/392/ to view the results.

45 tests failed.
FAILED:  SSLTest.SSLSocket

Error Message:
/tmp/SRC/3rdparty/libprocess/src/tests/ssl_tests.cpp:172
(socket).failure(): Failed to complete SSL connection for 172.17.0.2:37754: error:00000000:lib(0):func(0):reason(0)

Stack Trace:
/tmp/SRC/3rdparty/libprocess/src/tests/ssl_tests.cpp:172
(socket).failure(): Failed to complete SSL connection for 172.17.0.2:37754: error:00000000:lib(0):func(0):reason(0)

FAILED:  SSLTest.ECDHESupport

Error Message:
/tmp/SRC/3rdparty/libprocess/src/tests/ssl_tests.cpp:476
(socket).failure(): Failed to complete SSL connection for 172.17.0.2:54584: error:00000000:lib(0):func(0):reason(0)

Stack Trace:
/tmp/SRC/3rdparty/libprocess/src/tests/ssl_tests.cpp:476
(socket).failure(): Failed to complete SSL connection for 172.17.0.2:54584: error:00000000:lib(0):func(0):reason(0)

FAILED:  SSLTest.PeerAddress

Error Message:
/tmp/SRC/3rdparty/libprocess/src/tests/ssl_tests.cpp:654
Failed to wait 15secs for socket

Stack Trace:
/tmp/SRC/3rdparty/libprocess/src/tests/ssl_tests.cpp:654
Failed to wait 15secs for socket

FAILED:  Scheme/HTTPTest.Endpoints/0

Error Message:
/tmp/SRC/3rdparty/libprocess/src/tests/http_tests.cpp:279
(connected).failure(): Failed connect: connection closed

Stack Trace:
/tmp/SRC/3rdparty/libprocess/src/tests/http_tests.cpp:279
(connected).failure(): Failed connect: connection closed

FAILED:  Scheme/HTTPTest.EndpointsHelp/0

Error Message:
/tmp/SRC/3rdparty/libprocess/src/tests/http_tests.cpp:405
(response).failure(): Failed connect: connection closed

Stack Trace:
/tmp/SRC/3rdparty/libprocess/src/tests/http_tests.cpp:405
(response).failure(): Failed connect: connection closed

FAILED:  Scheme/HTTPTest.Get/0

Error Message:
/tmp/SRC/3rdparty/libprocess/src/tests/http_tests.cpp:763
(noQueryFuture).failure(): Failed connect: connection closed

Stack Trace:
/tmp/SRC/3rdparty/libprocess/src/tests/http_tests.cpp:763
(noQueryFuture).failure(): Failed connect: connection closed

FAILED:  Scheme/HTTPTest.StreamingGetComplete/0

Error Message:
/tmp/SRC/3rdparty/libprocess/src/tests/http_tests.cpp:824
(response).failure(): Failed connect: connection closed

Stack Trace:
/tmp/SRC/3rdparty/libprocess/src/tests/http_tests.cpp:824
(response).failure(): Failed connect: connection closed

FAILED:  Scheme/HTTPTest.StreamingGetFailure/0

Error Message:
/tmp/SRC/3rdparty/libprocess/src/tests/http_tests.cpp:866
(response).failure(): Failed connect: connection closed

Stack Trace:
/tmp/SRC/3rdparty/libprocess/src/tests/http_tests.cpp:866
(response).failure(): Failed connect: connection closed

FAILED:  Scheme/HTTPTest.ProvideSendfile/0

Error Message:
/tmp/SRC/3rdparty/libprocess/src/tests/http_tests.cpp:946
(response).failure(): Failed connect: connection closed

Stack Trace:
/tmp/SRC/3rdparty/libprocess/src/tests/http_tests.cpp:946
(response).failure(): Failed connect: connection closed

FAILED:  Scheme/HTTPTest.Post/0

Error Message:
/tmp/SRC/3rdparty/libprocess/src/tests/http_tests.cpp:1019
(future).failure(): Failed connect: connection closed

Stack Trace:
/tmp/SRC/3rdparty/libprocess/src/tests/http_tests.cpp:1019
(future).failure(): Failed connect: connection closed

FAILED:  Scheme/HTTPTest.Request/0

Error Message:
/tmp/SRC/3rdparty/libprocess/src/tests/http_tests.cpp:1097
(future).failure(): Failed connect: connection closed

Stack Trace:
/tmp/SRC/3rdparty/libprocess/src/tests/http_tests.cpp:1097
(future).failure(): Failed connect: connection closed

FAILED:  Encryption/NetSocketTest.EOFBeforeRecv/0

Error Message:
/tmp/SRC/3rdparty/libprocess/src/tests/socket_tests.cpp:209
(connectSocket( *client, Address(process::address().ip, server_address->port))).failure(): Failed connect: connection closed

Stack Trace:
/tmp/SRC/3rdparty/libprocess/src/tests/socket_tests.cpp:209
(connectSocket( *client, Address(process::address().ip, server_address->port))).failure(): Failed connect: connection closed

FAILED:  Encryption/NetSocketTest.EOFAfterRecv/0

Error Message:
/tmp/SRC/3rdparty/libprocess/src/tests/socket_tests.cpp:254
(connectSocket( *client, Address(process::address().ip, server_address->port))).failure(): Failed connect: connection closed

Stack Trace:
/tmp/SRC/3rdparty/libprocess/src/tests/socket_tests.cpp:254
(connectSocket( *client, Address(process::address().ip, server_address->port))).failure(): Failed connect: connection closed

FAILED:  HostnameValidationScheme/SSLTestStringParameter.NoVerifyBadCA/0

Error Message:
/tmp/SRC/3rdparty/libprocess/src/tests/ssl_tests.cpp:243
(socket).failure(): Failed to complete SSL connection for 172.17.0.2:35082: error:00000000:lib(0):func(0):reason(0)

Stack Trace:
/tmp/SRC/3rdparty/libprocess/src/tests/ssl_tests.cpp:243
(socket).failure(): Failed to complete SSL connection for 172.17.0.2:35082: error:00000000:lib(0):func(0):reason(0)

FAILED:  HostnameValidationScheme/SSLTestStringParameter.NoVerifyBadCA/1

Error Message:
/tmp/SRC/3rdparty/libprocess/src/tests/ssl_tests.cpp:243
(socket).failure(): Failed to complete SSL connection for 172.17.0.2:47782: error:00000000:lib(0):func(0):reason(0)

Stack Trace:
/tmp/SRC/3rdparty/libprocess/src/tests/ssl_tests.cpp:243
(socket).failure(): Failed to complete SSL connection for 172.17.0.2:47782: error:00000000:lib(0):func(0):reason(0)

FAILED:  HostnameValidationScheme/SSLTestStringParameter.VerifyCertificate/0

Error Message:
/tmp/SRC/3rdparty/libprocess/src/tests/ssl_tests.cpp:364
(socket).failure(): Failed to complete SSL connection for 172.17.0.2:49816: error:00000000:lib(0):func(0):reason(0)

Stack Trace:
/tmp/SRC/3rdparty/libprocess/src/tests/ssl_tests.cpp:364
(socket).failure(): Failed to complete SSL connection for 172.17.0.2:49816: error:00000000:lib(0):func(0):reason(0)

FAILED:  HostnameValidationScheme/SSLTestStringParameter.VerifyCertificate/1

Error Message:
/tmp/SRC/3rdparty/libprocess/src/tests/ssl_tests.cpp:364
(socket).failure(): Failed to complete SSL connection for 172.17.0.2:55860: error:00000000:lib(0):func(0):reason(0)

Stack Trace:
/tmp/SRC/3rdparty/libprocess/src/tests/ssl_tests.cpp:364
(socket).failure(): Failed to complete SSL connection for 172.17.0.2:55860: error:00000000:lib(0):func(0):reason(0)

FAILED:  SSLVerifyIPAdd/SSLVerifyIPAddTest.BasicSameProcess/0

Error Message:
/tmp/SRC/3rdparty/libprocess/src/tests/ssl_tests.cpp:956
(client->connect( address.get(), openssl::create_tls_client_config(None()))).failure(): Failed connect: connection closed

Stack Trace:
/tmp/SRC/3rdparty/libprocess/src/tests/ssl_tests.cpp:956
(client->connect( address.get(), openssl::create_tls_client_config(None()))).failure(): Failed connect: connection closed

FAILED:  SSLVerifyIPAdd/SSLVerifyIPAddTest.RequireCertificate/0

Error Message:
/tmp/SRC/3rdparty/libprocess/src/tests/ssl_tests.cpp:1063
(socket).failure(): Failed to complete SSL connection for 172.17.0.2:49186: error:00000000:lib(0):func(0):reason(0)

Stack Trace:
/tmp/SRC/3rdparty/libprocess/src/tests/ssl_tests.cpp:1063
(socket).failure(): Failed to complete SSL connection for 172.17.0.2:49186: error:00000000:lib(0):func(0):reason(0)

FAILED:  SSLVerifyIPAdd/SSLVerifyIPAddTest.RequireCertificate/1

Error Message:
/tmp/SRC/3rdparty/libprocess/src/tests/ssl_tests.cpp:1063
(socket).failure(): Failed to complete SSL connection for 172.17.0.2:38018: error:00000000:lib(0):func(0):reason(0)

Stack Trace:
/tmp/SRC/3rdparty/libprocess/src/tests/ssl_tests.cpp:1063
(socket).failure(): Failed to complete SSL connection for 172.17.0.2:38018: error:00000000:lib(0):func(0):reason(0)

FAILED:  SSLProtocol/SSLProtocolTest.Mismatch/0

Error Message:
/tmp/SRC/3rdparty/libprocess/src/tests/ssl_tests.cpp:1133
(socket).failure(): Failed to complete SSL connection for 172.17.0.2:54992: error:00000000:lib(0):func(0):reason(0)

Stack Trace:
/tmp/SRC/3rdparty/libprocess/src/tests/ssl_tests.cpp:1133
(socket).failure(): Failed to complete SSL connection for 172.17.0.2:54992: error:00000000:lib(0):func(0):reason(0)

FAILED:  SSLProtocol/SSLProtocolTest.Mismatch/3

Error Message:
/tmp/SRC/3rdparty/libprocess/src/tests/ssl_tests.cpp:1133
(socket).failure(): Failed to complete SSL connection for 172.17.0.2:32804: error:00000000:lib(0):func(0):reason(0)

Stack Trace:
/tmp/SRC/3rdparty/libprocess/src/tests/ssl_tests.cpp:1133
(socket).failure(): Failed to complete SSL connection for 172.17.0.2:32804: error:00000000:lib(0):func(0):reason(0)

FAILED:  SSLTest.SSLSocket

Error Message:
/tmp/SRC/3rdparty/libprocess/src/tests/ssl_tests.cpp:172
(socket).failure(): Failed to complete SSL connection for 172.17.0.2:56980: error:00000000:lib(0):func(0):reason(0)

Stack Trace:
/tmp/SRC/3rdparty/libprocess/src/tests/ssl_tests.cpp:172
(socket).failure(): Failed to complete SSL connection for 172.17.0.2:56980: error:00000000:lib(0):func(0):reason(0)

FAILED:  SSLTest.ECDHESupport

Error Message:
/tmp/SRC/3rdparty/libprocess/src/tests/ssl_tests.cpp:476
(socket).failure(): Failed to complete SSL connection for 172.17.0.2:34316: error:00000000:lib(0):func(0):reason(0)

Stack Trace:
/tmp/SRC/3rdparty/libprocess/src/tests/ssl_tests.cpp:476
(socket).failure(): Failed to complete SSL connection for 172.17.0.2:34316: error:00000000:lib(0):func(0):reason(0)

FAILED:  SSLTest.PeerAddress

Error Message:
/tmp/SRC/3rdparty/libprocess/src/tests/ssl_tests.cpp:654
Failed to wait 15secs for socket

Stack Trace:
/tmp/SRC/3rdparty/libprocess/src/tests/ssl_tests.cpp:654
Failed to wait 15secs for socket

FAILED:  SSLTest.HTTPSPost

Error Message:
/tmp/SRC/3rdparty/libprocess/src/tests/ssl_tests.cpp:734
(socket).failure(): Failed to complete SSL connection for 172.17.0.2:40184: error:00000000:lib(0):func(0):reason(0)

Stack Trace:
/tmp/SRC/3rdparty/libprocess/src/tests/ssl_tests.cpp:734
(socket).failure(): Failed to complete SSL connection for 172.17.0.2:40184: error:00000000:lib(0):func(0):reason(0)

FAILED:  SSLTest.SilentSocket

Error Message:
/tmp/SRC/3rdparty/libprocess/src/tests/ssl_tests.cpp:797
(socket).failure(): Failed to complete SSL connection for 172.17.0.2:44964: error:00000000:lib(0):func(0):reason(0)

Stack Trace:
/tmp/SRC/3rdparty/libprocess/src/tests/ssl_tests.cpp:797
(socket).failure(): Failed to complete SSL connection for 172.17.0.2:44964: error:00000000:lib(0):func(0):reason(0)

FAILED:  SSLTest.CustomSSLContext

Error Message:
/tmp/SRC/3rdparty/libprocess/src/tests/ssl_tests.cpp:1201
Failed to wait 15secs for socket

Stack Trace:
/tmp/SRC/3rdparty/libprocess/src/tests/ssl_tests.cpp:1201
Failed to wait 15secs for socket

FAILED:  Scheme/HTTPTest.Endpoints/0

Error Message:
/tmp/SRC/3rdparty/libprocess/src/tests/http_tests.cpp:319
(response).failure(): Failed connect: connection closed

Stack Trace:
/tmp/SRC/3rdparty/libprocess/src/tests/http_tests.cpp:319
(response).failure(): Failed connect: connection closed

FAILED:  Scheme/HTTPTest.EndpointsHelp/0

Error Message:
/tmp/SRC/3rdparty/libprocess/src/tests/http_tests.cpp:389
(response).failure(): Failed connect: connection closed

Stack Trace:
/tmp/SRC/3rdparty/libprocess/src/tests/http_tests.cpp:389
(response).failure(): Failed connect: connection closed

FAILED:  Scheme/HTTPTest.EndpointsHelpRemoval/0

Error Message:
/tmp/SRC/3rdparty/libprocess/src/tests/http_tests.cpp:445
(response).failure(): Failed connect: connection closed

Stack Trace:
/tmp/SRC/3rdparty/libprocess/src/tests/http_tests.cpp:445
(response).failure(): Failed connect: connection closed

FAILED:  Scheme/HTTPTest.Get/0

Error Message:
/tmp/SRC/3rdparty/libprocess/src/tests/http_tests.cpp:763
(noQueryFuture).failure(): Failed connect: connection closed

Stack Trace:
/tmp/SRC/3rdparty/libprocess/src/tests/http_tests.cpp:763
(noQueryFuture).failure(): Failed connect: connection closed

FAILED:  Scheme/HTTPTest.NestedGet/0

Error Message:
/tmp/SRC/3rdparty/libprocess/src/tests/http_tests.cpp:793
(response).failure(): Failed connect: connection closed

Stack Trace:
/tmp/SRC/3rdparty/libprocess/src/tests/http_tests.cpp:793
(response).failure(): Failed connect: connection closed

FAILED:  Scheme/HTTPTest.Post/0

Error Message:
/tmp/SRC/3rdparty/libprocess/src/tests/http_tests.cpp:1019
(future).failure(): Failed connect: connection closed

Stack Trace:
/tmp/SRC/3rdparty/libprocess/src/tests/http_tests.cpp:1019
(future).failure(): Failed connect: connection closed

FAILED:  HostnameValidationScheme/SSLTestStringParameter.NoVerifyBadCA/0

Error Message:
/tmp/SRC/3rdparty/libprocess/src/tests/ssl_tests.cpp:243
(socket).failure(): Failed to complete SSL connection for 172.17.0.2:47502: error:00000000:lib(0):func(0):reason(0)

Stack Trace:
/tmp/SRC/3rdparty/libprocess/src/tests/ssl_tests.cpp:243
(socket).failure(): Failed to complete SSL connection for 172.17.0.2:47502: error:00000000:lib(0):func(0):reason(0)

FAILED:  HostnameValidationScheme/SSLTestStringParameter.NoVerifyBadCA/1

Error Message:
/tmp/SRC/3rdparty/libprocess/src/tests/ssl_tests.cpp:243
(socket).failure(): Failed to complete SSL connection for 172.17.0.2:34092: error:00000000:lib(0):func(0):reason(0)

Stack Trace:
/tmp/SRC/3rdparty/libprocess/src/tests/ssl_tests.cpp:243
(socket).failure(): Failed to complete SSL connection for 172.17.0.2:34092: error:00000000:lib(0):func(0):reason(0)

FAILED:  HostnameValidationScheme/SSLTestStringParameter.VerifyCertificate/0

Error Message:
/tmp/SRC/3rdparty/libprocess/src/tests/ssl_tests.cpp:364
(socket).failure(): Failed to complete SSL connection for 172.17.0.2:39300: error:00000000:lib(0):func(0):reason(0)

Stack Trace:
/tmp/SRC/3rdparty/libprocess/src/tests/ssl_tests.cpp:364
(socket).failure(): Failed to complete SSL connection for 172.17.0.2:39300: error:00000000:lib(0):func(0):reason(0)

FAILED:  HostnameValidationScheme/SSLTestStringParameter.VerifyCertificate/1

Error Message:
/tmp/SRC/3rdparty/libprocess/src/tests/ssl_tests.cpp:364
(socket).failure(): Failed to complete SSL connection for 172.17.0.2:39856: error:00000000:lib(0):func(0):reason(0)

Stack Trace:
/tmp/SRC/3rdparty/libprocess/src/tests/ssl_tests.cpp:364
(socket).failure(): Failed to complete SSL connection for 172.17.0.2:39856: error:00000000:lib(0):func(0):reason(0)

FAILED:  SSLVerifyIPAdd/SSLVerifyIPAddTest.BasicSameProcess/1

Error Message:
/tmp/SRC/3rdparty/libprocess/src/tests/ssl_tests.cpp:956
(client->connect( address.get(), openssl::create_tls_client_config(None()))).failure(): Failed connect: connection closed

Stack Trace:
/tmp/SRC/3rdparty/libprocess/src/tests/ssl_tests.cpp:956
(client->connect( address.get(), openssl::create_tls_client_config(None()))).failure(): Failed connect: connection closed

FAILED:  SSLVerifyIPAdd/SSLVerifyIPAddTest.BasicSameProcessUnix/0

Error Message:
/tmp/SRC/3rdparty/libprocess/src/tests/ssl_tests.cpp:1014
(client->connect( address.get(), openssl::create_tls_client_config(None()))).failure(): Failed connect: connection closed

Stack Trace:
/tmp/SRC/3rdparty/libprocess/src/tests/ssl_tests.cpp:1014
(client->connect( address.get(), openssl::create_tls_client_config(None()))).failure(): Failed connect: connection closed

FAILED:  SSLVerifyIPAdd/SSLVerifyIPAddTest.BasicSameProcessUnix/1

Error Message:
/tmp/SRC/3rdparty/libprocess/src/tests/ssl_tests.cpp:1014
(client->connect( address.get(), openssl::create_tls_client_config(None()))).failure(): Failed connect: connection closed

Stack Trace:
/tmp/SRC/3rdparty/libprocess/src/tests/ssl_tests.cpp:1014
(client->connect( address.get(), openssl::create_tls_client_config(None()))).failure(): Failed connect: connection closed

FAILED:  SSLVerifyIPAdd/SSLVerifyIPAddTest.RequireCertificate/0

Error Message:
/tmp/SRC/3rdparty/libprocess/src/tests/ssl_tests.cpp:1063
(socket).failure(): Failed to complete SSL connection for 172.17.0.2:33838: error:00000000:lib(0):func(0):reason(0)

Stack Trace:
/tmp/SRC/3rdparty/libprocess/src/tests/ssl_tests.cpp:1063
(socket).failure(): Failed to complete SSL connection for 172.17.0.2:33838: error:00000000:lib(0):func(0):reason(0)

FAILED:  SSLVerifyIPAdd/SSLVerifyIPAddTest.RequireCertificate/1

Error Message:
/tmp/SRC/3rdparty/libprocess/src/tests/ssl_tests.cpp:1063
(socket).failure(): Failed to complete SSL connection for 172.17.0.2:39022: error:00000000:lib(0):func(0):reason(0)

Stack Trace:
/tmp/SRC/3rdparty/libprocess/src/tests/ssl_tests.cpp:1063
(socket).failure(): Failed to complete SSL connection for 172.17.0.2:39022: error:00000000:lib(0):func(0):reason(0)

FAILED:  SSLProtocol/SSLProtocolTest.Mismatch/0

Error Message:
/tmp/SRC/3rdparty/libprocess/src/tests/ssl_tests.cpp:1133
(socket).failure(): Failed to complete SSL connection for 172.17.0.2:58454: error:00000000:lib(0):func(0):reason(0)

Stack Trace:
/tmp/SRC/3rdparty/libprocess/src/tests/ssl_tests.cpp:1133
(socket).failure(): Failed to complete SSL connection for 172.17.0.2:58454: error:00000000:lib(0):func(0):reason(0)

FAILED:  SSLProtocol/SSLProtocolTest.Mismatch/3

Error Message:
/tmp/SRC/3rdparty/libprocess/src/tests/ssl_tests.cpp:1133
(socket).failure(): Failed to complete SSL connection for 172.17.0.2:55830: error:00000000:lib(0):func(0):reason(0)

Stack Trace:
/tmp/SRC/3rdparty/libprocess/src/tests/ssl_tests.cpp:1133
(socket).failure(): Failed to complete SSL connection for 172.17.0.2:55830: error:00000000:lib(0):func(0):reason(0)