You are viewing a plain text version of this content. The canonical link for it is here.
Posted to commits@beam.apache.org by Apache Jenkins Server <je...@builds.apache.org> on 2017/02/16 00:49:16 UTC
Build failed in Jenkins: beam_PostCommit_Java_MavenInstall #2650
See <https://builds.apache.org/job/beam_PostCommit_Java_MavenInstall/2650/changes>
Changes:
[peihe] [BEAM-59] Beam GcsFileSystem: port expand() from GcsUtil for glob
------------------------------------------
[...truncated 4933 lines...]
2017-02-16T00:43:41.074 [INFO] --- findbugs-maven-plugin:3.0.4:findbugs (findbugs) @ beam-sdks-java-io-google-cloud-platform ---
2017-02-16T00:43:41.080 [INFO] Fork Value is true
2017-02-16T00:43:55.828 [INFO] Done FindBugs Analysis....
2017-02-16T00:43:55.947 [INFO]
2017-02-16T00:43:55.947 [INFO] <<< findbugs-maven-plugin:3.0.4:check (default) < :findbugs @ beam-sdks-java-io-google-cloud-platform <<<
2017-02-16T00:43:55.947 [INFO]
2017-02-16T00:43:55.947 [INFO] --- findbugs-maven-plugin:3.0.4:check (default) @ beam-sdks-java-io-google-cloud-platform ---
2017-02-16T00:43:55.952 [INFO] BugInstance size is 0
2017-02-16T00:43:55.952 [INFO] Error size is 0
2017-02-16T00:43:55.955 [INFO] No errors/warnings found
2017-02-16T00:43:56.016 [INFO]
2017-02-16T00:43:56.016 [INFO] --- maven-surefire-plugin:2.19.1:test (default-test) @ beam-sdks-java-io-google-cloud-platform ---
2017-02-16T00:43:56.020 [INFO] Surefire report directory: <https://builds.apache.org/job/beam_PostCommit_Java_MavenInstall/ws/sdks/java/io/google-cloud-platform/target/surefire-reports>
2017-02-16T00:43:56.020 [INFO] Using configured provider org.apache.maven.surefire.junitcore.JUnitCoreProvider
2017-02-16T00:43:56.020 [INFO] parallel='none', perCoreThreadCount=true, threadCount=0, useUnlimitedThreads=false, threadCountSuites=0, threadCountClasses=0, threadCountMethods=0, parallelOptimized=true
-------------------------------------------------------
T E S T S
-------------------------------------------------------
Running org.apache.beam.sdk.io.gcp.GcpApiSurfaceTest
Tests run: 1, Failures: 0, Errors: 0, Skipped: 0, Time elapsed: 1.88 sec - in org.apache.beam.sdk.io.gcp.GcpApiSurfaceTest
Running org.apache.beam.sdk.io.gcp.bigquery.BigQueryTableRowIteratorTest
Tests run: 3, Failures: 0, Errors: 0, Skipped: 0, Time elapsed: 5.451 sec - in org.apache.beam.sdk.io.gcp.bigquery.BigQueryTableRowIteratorTest
Running org.apache.beam.sdk.io.gcp.bigquery.BigQueryAvroUtilsTest
Tests run: 2, Failures: 0, Errors: 0, Skipped: 0, Time elapsed: 1.698 sec - in org.apache.beam.sdk.io.gcp.bigquery.BigQueryAvroUtilsTest
Running org.apache.beam.sdk.io.gcp.bigquery.BigQueryIOTest
Tests run: 75, Failures: 0, Errors: 0, Skipped: 4, Time elapsed: 6.087 sec - in org.apache.beam.sdk.io.gcp.bigquery.BigQueryIOTest
Running org.apache.beam.sdk.io.gcp.bigquery.BigQueryUtilTest
Tests run: 7, Failures: 0, Errors: 0, Skipped: 0, Time elapsed: 3.631 sec - in org.apache.beam.sdk.io.gcp.bigquery.BigQueryUtilTest
Running org.apache.beam.sdk.io.gcp.bigquery.BigQueryServicesImplTest
Tests run: 24, Failures: 0, Errors: 0, Skipped: 0, Time elapsed: 0.19 sec - in org.apache.beam.sdk.io.gcp.bigquery.BigQueryServicesImplTest
Running org.apache.beam.sdk.io.gcp.bigtable.BigtableIOTest
Tests run: 27, Failures: 0, Errors: 0, Skipped: 0, Time elapsed: 4.488 sec - in org.apache.beam.sdk.io.gcp.bigtable.BigtableIOTest
Running org.apache.beam.sdk.io.gcp.datastore.DatastoreV1Test
Tests run: 43, Failures: 0, Errors: 0, Skipped: 0, Time elapsed: 0.265 sec - in org.apache.beam.sdk.io.gcp.datastore.DatastoreV1Test
Running org.apache.beam.sdk.io.gcp.storage.GcsFileSystemRegistrarTest
Tests run: 1, Failures: 0, Errors: 0, Skipped: 0, Time elapsed: 0.004 sec - in org.apache.beam.sdk.io.gcp.storage.GcsFileSystemRegistrarTest
Running org.apache.beam.sdk.io.gcp.storage.GcsResourceIdTest
Tests run: 8, Failures: 0, Errors: 0, Skipped: 0, Time elapsed: 0.004 sec - in org.apache.beam.sdk.io.gcp.storage.GcsResourceIdTest
Running org.apache.beam.sdk.io.gcp.storage.GcsFileSystemTest
Tests run: 3, Failures: 0, Errors: 0, Skipped: 0, Time elapsed: 0.02 sec - in org.apache.beam.sdk.io.gcp.storage.GcsFileSystemTest
Results :
Tests run: 194, Failures: 0, Errors: 0, Skipped: 4
[JENKINS] Recording test results
2017-02-16T00:44:21.409 [INFO]
2017-02-16T00:44:21.409 [INFO] --- maven-jar-plugin:3.0.2:jar (default-jar) @ beam-sdks-java-io-google-cloud-platform ---
2017-02-16T00:44:21.420 [INFO] Building jar: <https://builds.apache.org/job/beam_PostCommit_Java_MavenInstall/ws/sdks/java/io/google-cloud-platform/target/beam-sdks-java-io-google-cloud-platform-0.6.0-SNAPSHOT.jar>
2017-02-16T00:44:21.521 [INFO]
2017-02-16T00:44:21.521 [INFO] --- maven-site-plugin:3.5.1:attach-descriptor (attach-descriptor) @ beam-sdks-java-io-google-cloud-platform ---
2017-02-16T00:44:21.571 [INFO]
2017-02-16T00:44:21.571 [INFO] --- maven-javadoc-plugin:2.10.4:jar (javadoc) @ beam-sdks-java-io-google-cloud-platform ---
2017-02-16T00:44:23.889 [INFO] Building jar: <https://builds.apache.org/job/beam_PostCommit_Java_MavenInstall/ws/sdks/java/io/google-cloud-platform/target/beam-sdks-java-io-google-cloud-platform-0.6.0-SNAPSHOT-javadoc.jar>
2017-02-16T00:44:23.956 [INFO]
2017-02-16T00:44:23.956 [INFO] --- maven-source-plugin:3.0.1:jar-no-fork (attach-sources) @ beam-sdks-java-io-google-cloud-platform ---
2017-02-16T00:44:23.959 [INFO] Building jar: <https://builds.apache.org/job/beam_PostCommit_Java_MavenInstall/ws/sdks/java/io/google-cloud-platform/target/beam-sdks-java-io-google-cloud-platform-0.6.0-SNAPSHOT-sources.jar>
2017-02-16T00:44:24.033 [INFO]
2017-02-16T00:44:24.033 [INFO] --- maven-source-plugin:3.0.1:test-jar-no-fork (attach-test-sources) @ beam-sdks-java-io-google-cloud-platform ---
2017-02-16T00:44:24.037 [INFO] Building jar: <https://builds.apache.org/job/beam_PostCommit_Java_MavenInstall/ws/sdks/java/io/google-cloud-platform/target/beam-sdks-java-io-google-cloud-platform-0.6.0-SNAPSHOT-test-sources.jar>
2017-02-16T00:44:24.157 [INFO]
2017-02-16T00:44:24.157 [INFO] --- maven-jar-plugin:3.0.2:test-jar (default-test-jar) @ beam-sdks-java-io-google-cloud-platform ---
2017-02-16T00:44:24.170 [INFO] Building jar: <https://builds.apache.org/job/beam_PostCommit_Java_MavenInstall/ws/sdks/java/io/google-cloud-platform/target/beam-sdks-java-io-google-cloud-platform-0.6.0-SNAPSHOT-tests.jar>
2017-02-16T00:44:24.243 [INFO]
2017-02-16T00:44:24.243 [INFO] --- maven-failsafe-plugin:2.19.1:integration-test (default) @ beam-sdks-java-io-google-cloud-platform ---
2017-02-16T00:44:24.542 [INFO] Failsafe report directory: <https://builds.apache.org/job/beam_PostCommit_Java_MavenInstall/ws/sdks/java/io/google-cloud-platform/target/failsafe-reports>
2017-02-16T00:44:24.550 [INFO] parallel='all', perCoreThreadCount=true, threadCount=4, useUnlimitedThreads=false, threadCountSuites=0, threadCountClasses=0, threadCountMethods=0, parallelOptimized=true
-------------------------------------------------------
T E S T S
-------------------------------------------------------
Running org.apache.beam.sdk.io.gcp.bigtable.BigtableReadIT
Tests run: 1, Failures: 0, Errors: 0, Skipped: 0, Time elapsed: 259.278 sec - in org.apache.beam.sdk.io.gcp.bigtable.BigtableReadIT
Running org.apache.beam.sdk.io.gcp.datastore.SplitQueryFnIT
Tests run: 2, Failures: 0, Errors: 0, Skipped: 0, Time elapsed: 3.358 sec - in org.apache.beam.sdk.io.gcp.datastore.SplitQueryFnIT
Running org.apache.beam.sdk.io.gcp.datastore.V1WriteIT
Tests run: 1, Failures: 0, Errors: 0, Skipped: 0, Time elapsed: 231.161 sec - in org.apache.beam.sdk.io.gcp.datastore.V1WriteIT
Running org.apache.beam.sdk.io.gcp.bigtable.BigtableWriteIT
Tests run: 1, Failures: 0, Errors: 0, Skipped: 0, Time elapsed: 242.922 sec - in org.apache.beam.sdk.io.gcp.bigtable.BigtableWriteIT
Running org.apache.beam.sdk.io.gcp.datastore.V1ReadIT
Tests run: 1, Failures: 0, Errors: 0, Skipped: 0, Time elapsed: 264.433 sec - in org.apache.beam.sdk.io.gcp.datastore.V1ReadIT
Results :
Tests run: 6, Failures: 0, Errors: 0, Skipped: 0
[WARNING] Cannot calculate digest of mojo class, because mojo wasn't loaded from a jar, but from: <https://builds.apache.org/job/beam_PostCommit_Java_MavenInstall/ws/.repository/org/apache/maven/plugins/maven-failsafe-plugin/2.19.1/maven-failsafe-plugin-2.19.1.jar>
[JENKINS] Recording test results
2017-02-16T00:48:51.052 [INFO]
2017-02-16T00:48:51.052 [INFO] --- maven-dependency-plugin:3.0.0:analyze-only (default) @ beam-sdks-java-io-google-cloud-platform ---
[WARNING] Cannot calculate digest of mojo class, because mojo wasn't loaded from a jar, but from: <https://builds.apache.org/job/beam_PostCommit_Java_MavenInstall/ws/.repository/org/apache/maven/plugins/maven-dependency-plugin/3.0.0/maven-dependency-plugin-3.0.0.jar>
[JENKINS] Archiving disabled
2017-02-16T00:48:51.957 [INFO]
2017-02-16T00:48:51.958 [INFO] ------------------------------------------------------------------------
2017-02-16T00:48:51.958 [INFO] Skipping Apache Beam :: Parent
2017-02-16T00:48:51.958 [INFO] This project has been banned from the build due to previous failures.
2017-02-16T00:48:51.958 [INFO] ------------------------------------------------------------------------
[JENKINS] Archiving disabled
[JENKINS] Archiving disabled
[JENKINS] Archiving disabled
[JENKINS] Archiving disabled
[JENKINS] Archiving disabled
[JENKINS] Archiving disabled
[JENKINS] Archiving disabled
[JENKINS] Archiving disabled
[JENKINS] Archiving disabled
[JENKINS] Archiving disabled
[JENKINS] Archiving disabled
[JENKINS] Archiving disabled
[JENKINS] Archiving disabled
[JENKINS] Archiving disabled
[JENKINS] Archiving disabled
[JENKINS] Archiving disabled
[JENKINS] Archiving disabled
[JENKINS] Archiving disabled
[JENKINS] Archiving disabled
[JENKINS] Archiving disabled
[JENKINS] Archiving disabled
[JENKINS] Archiving disabled
[JENKINS] Archiving disabled
[JENKINS] Archiving disabled
[JENKINS] Archiving disabled
[JENKINS] Archiving disabled
[JENKINS] Archiving disabled
[JENKINS] Archiving disabled
[JENKINS] Archiving disabled
[JENKINS] Archiving disabled
[JENKINS] Archiving disabled
[JENKINS] Archiving disabled
[JENKINS] Archiving disabled
[JENKINS] Archiving disabled
[JENKINS] Archiving disabled
[JENKINS] Archiving disabled
[JENKINS] Archiving disabled
2017-02-16T00:49:03.848 [INFO] ------------------------------------------------------------------------
2017-02-16T00:49:03.848 [INFO] Reactor Summary:
2017-02-16T00:49:03.848 [INFO]
2017-02-16T00:49:03.849 [INFO] Apache Beam :: Parent .............................. SUCCESS [ 29.030 s]
2017-02-16T00:49:03.849 [INFO] Apache Beam :: SDKs :: Java :: Build Tools ......... SUCCESS [ 3.732 s]
2017-02-16T00:49:03.849 [INFO] Apache Beam :: SDKs ................................ SUCCESS [ 10.518 s]
2017-02-16T00:49:03.849 [INFO] Apache Beam :: SDKs :: Common ...................... SUCCESS [ 3.448 s]
2017-02-16T00:49:03.849 [INFO] Apache Beam :: SDKs :: Common :: Fn API ............ SUCCESS [ 26.454 s]
2017-02-16T00:49:03.849 [INFO] Apache Beam :: SDKs :: Common :: Runner API ........ SUCCESS [ 11.469 s]
2017-02-16T00:49:03.849 [INFO] Apache Beam :: SDKs :: Java ........................ SUCCESS [ 1.362 s]
2017-02-16T00:49:03.849 [INFO] Apache Beam :: SDKs :: Java :: Core ................ SUCCESS [02:53 min]
2017-02-16T00:49:03.849 [INFO] Apache Beam :: Runners ............................. SUCCESS [ 2.763 s]
2017-02-16T00:49:03.849 [INFO] Apache Beam :: Runners :: Core Java ................ SUCCESS [ 57.778 s]
[JENKINS] Archiving disabled
2017-02-16T00:49:03.849 [INFO] Apache Beam :: Runners :: Direct Java .............. SUCCESS [02:52 min]
2017-02-16T00:49:03.849 [INFO] Apache Beam :: Runners :: Google Cloud Dataflow .... SUCCESS [ 34.036 s]
2017-02-16T00:49:03.849 [INFO] Apache Beam :: SDKs :: Java :: IO .................. SUCCESS [ 1.795 s]
2017-02-16T00:49:03.849 [INFO] Apache Beam :: SDKs :: Java :: IO :: Google Cloud Platform FAILURE [05:19 min]
2017-02-16T00:49:03.849 [INFO] Apache Beam :: SDKs :: Java :: IO :: HDFS .......... SKIPPED
2017-02-16T00:49:03.849 [INFO] Apache Beam :: SDKs :: Java :: IO :: JMS ........... SKIPPED
2017-02-16T00:49:03.849 [INFO] Apache Beam :: SDKs :: Java :: IO :: Kafka ......... SKIPPED
2017-02-16T00:49:03.849 [INFO] Apache Beam :: SDKs :: Java :: IO :: Kinesis ....... SKIPPED
2017-02-16T00:49:03.849 [INFO] Apache Beam :: SDKs :: Java :: IO :: MongoDB ....... SKIPPED
2017-02-16T00:49:03.849 [INFO] Apache Beam :: SDKs :: Java :: IO :: JDBC .......... SKIPPED
2017-02-16T00:49:03.849 [INFO] Apache Beam :: SDKs :: Java :: IO :: Elasticsearch . SKIPPED
2017-02-16T00:49:03.849 [INFO] Apache Beam :: SDKs :: Java :: IO :: MQTT .......... SKIPPED
2017-02-16T00:49:03.849 [INFO] Apache Beam :: SDKs :: Java :: Maven Archetypes .... SKIPPED
2017-02-16T00:49:03.849 [INFO] Apache Beam :: SDKs :: Java :: Maven Archetypes :: Starter SKIPPED
2017-02-16T00:49:03.849 [INFO] Apache Beam :: SDKs :: Java :: Maven Archetypes :: Examples SKIPPED
2017-02-16T00:49:03.849 [INFO] Apache Beam :: SDKs :: Java :: Maven Archetypes :: Examples - Java 8 SKIPPED
2017-02-16T00:49:03.849 [INFO] Apache Beam :: SDKs :: Java :: Extensions .......... SKIPPED
2017-02-16T00:49:03.849 [INFO] Apache Beam :: SDKs :: Java :: Extensions :: Join library SKIPPED
2017-02-16T00:49:03.849 [INFO] Apache Beam :: SDKs :: Java :: Extensions :: Sorter SKIPPED
2017-02-16T00:49:03.849 [INFO] Apache Beam :: SDKs :: Java :: Harness ............. SKIPPED
2017-02-16T00:49:03.849 [INFO] Apache Beam :: SDKs :: Java :: Java 8 Tests ........ SKIPPED
2017-02-16T00:49:03.849 [INFO] Apache Beam :: SDKs :: Python ...................... SKIPPED
2017-02-16T00:49:03.849 [INFO] Apache Beam :: Runners :: Flink .................... SKIPPED
2017-02-16T00:49:03.849 [INFO] Apache Beam :: Runners :: Flink :: Core ............ SKIPPED
2017-02-16T00:49:03.849 [INFO] Apache Beam :: Runners :: Flink :: Examples ........ SKIPPED
2017-02-16T00:49:03.849 [INFO] Apache Beam :: Runners :: Spark .................... SKIPPED
2017-02-16T00:49:03.849 [INFO] Apache Beam :: Runners :: Apex ..................... SKIPPED
2017-02-16T00:49:03.849 [INFO] Apache Beam :: Examples ............................ SKIPPED
2017-02-16T00:49:03.849 [INFO] Apache Beam :: Examples :: Java .................... SKIPPED
2017-02-16T00:49:03.849 [INFO] Apache Beam :: Examples :: Java 8 .................. SKIPPED
2017-02-16T00:49:03.849 [INFO] Apache Beam :: SDKs :: Java :: Aggregated Javadoc .. SKIPPED
2017-02-16T00:49:03.849 [INFO] ------------------------------------------------------------------------
2017-02-16T00:49:03.849 [INFO] BUILD FAILURE
2017-02-16T00:49:03.849 [INFO] ------------------------------------------------------------------------
2017-02-16T00:49:03.849 [INFO] Total time: 14:37 min
2017-02-16T00:49:03.849 [INFO] Finished at: 2017-02-16T00:49:03+00:00
2017-02-16T00:49:04.627 [INFO] Final Memory: 132M/1488M
2017-02-16T00:49:04.627 [INFO] ------------------------------------------------------------------------
2017-02-16T00:49:04.633 [ERROR] Failed to execute goal org.apache.maven.plugins:maven-dependency-plugin:3.0.0:analyze-only (default) on project beam-sdks-java-io-google-cloud-platform: Cannot analyze dependencies: <https://builds.apache.org/job/beam_PostCommit_Java_MavenInstall/ws/.repository/io/grpc/grpc-auth/1.0.1/grpc-auth-1.0.1.jar> (No such file or directory) -> [Help 1]
org.apache.maven.lifecycle.LifecycleExecutionException: Failed to execute goal org.apache.maven.plugins:maven-dependency-plugin:3.0.0:analyze-only (default) on project beam-sdks-java-io-google-cloud-platform: Cannot analyze dependencies
at org.apache.maven.lifecycle.internal.MojoExecutor.execute(MojoExecutor.java:216)
at org.apache.maven.lifecycle.internal.MojoExecutor.execute(MojoExecutor.java:153)
at org.apache.maven.lifecycle.internal.MojoExecutor.execute(MojoExecutor.java:145)
at org.apache.maven.lifecycle.internal.LifecycleModuleBuilder.buildProject(LifecycleModuleBuilder.java:116)
at org.apache.maven.lifecycle.internal.LifecycleModuleBuilder.buildProject(LifecycleModuleBuilder.java:80)
at org.apache.maven.lifecycle.internal.builder.singlethreaded.SingleThreadedBuilder.build(SingleThreadedBuilder.java:51)
at org.apache.maven.lifecycle.internal.LifecycleStarter.execute(LifecycleStarter.java:128)
at org.apache.maven.DefaultMaven.doExecute(DefaultMaven.java:307)
at org.apache.maven.DefaultMaven.doExecute(DefaultMaven.java:193)
at org.apache.maven.DefaultMaven.execute(DefaultMaven.java:106)
at org.jvnet.hudson.maven3.launcher.Maven32Launcher.main(Maven32Launcher.java:132)
at sun.reflect.NativeMethodAccessorImpl.invoke0(Native Method)
at sun.reflect.NativeMethodAccessorImpl.invoke(NativeMethodAccessorImpl.java:62)
at sun.reflect.DelegatingMethodAccessorImpl.invoke(DelegatingMethodAccessorImpl.java:43)
at java.lang.reflect.Method.invoke(Method.java:498)
at org.codehaus.plexus.classworlds.launcher.Launcher.launchStandard(Launcher.java:330)
at org.codehaus.plexus.classworlds.launcher.Launcher.launch(Launcher.java:238)
at jenkins.maven3.agent.Maven32Main.launch(Maven32Main.java:186)
at sun.reflect.NativeMethodAccessorImpl.invoke0(Native Method)
at sun.reflect.NativeMethodAccessorImpl.invoke(NativeMethodAccessorImpl.java:62)
at sun.reflect.DelegatingMethodAccessorImpl.invoke(DelegatingMethodAccessorImpl.java:43)
at java.lang.reflect.Method.invoke(Method.java:498)
at hudson.maven.Maven3Builder.call(Maven3Builder.java:136)
at hudson.maven.Maven3Builder.call(Maven3Builder.java:71)
at hudson.remoting.UserRequest.perform(UserRequest.java:153)
at hudson.remoting.UserRequest.perform(UserRequest.java:50)
at hudson.remoting.Request$2.run(Request.java:332)
at hudson.remoting.InterceptingExecutorService$1.call(InterceptingExecutorService.java:68)
at java.util.concurrent.FutureTask.run(FutureTask.java:266)
at java.util.concurrent.ThreadPoolExecutor.runWorker(ThreadPoolExecutor.java:1142)
at java.util.concurrent.ThreadPoolExecutor$Worker.run(ThreadPoolExecutor.java:617)
at java.lang.Thread.run(Thread.java:745)
Caused by: org.apache.maven.plugin.MojoExecutionException: Cannot analyze dependencies
at org.apache.maven.plugins.dependency.analyze.AbstractAnalyzeMojo.checkDependencies(AbstractAnalyzeMojo.java:315)
at org.apache.maven.plugins.dependency.analyze.AbstractAnalyzeMojo.execute(AbstractAnalyzeMojo.java:257)
at org.apache.maven.plugin.DefaultBuildPluginManager.executeMojo(DefaultBuildPluginManager.java:134)
at org.apache.maven.lifecycle.internal.MojoExecutor.execute(MojoExecutor.java:208)
... 31 more
Caused by: org.apache.maven.shared.dependency.analyzer.ProjectDependencyAnalyzerException: Cannot analyze dependencies
at org.apache.maven.shared.dependency.analyzer.DefaultProjectDependencyAnalyzer.analyze(DefaultProjectDependencyAnalyzer.java:94)
at org.apache.maven.plugins.dependency.analyze.AbstractAnalyzeMojo.checkDependencies(AbstractAnalyzeMojo.java:306)
... 34 more
Caused by: java.io.FileNotFoundException: <https://builds.apache.org/job/beam_PostCommit_Java_MavenInstall/ws/.repository/io/grpc/grpc-auth/1.0.1/grpc-auth-1.0.1.jar> (No such file or directory)
at java.util.zip.ZipFile.open(Native Method)
at java.util.zip.ZipFile.<init>(ZipFile.java:219)
at java.util.zip.ZipFile.<init>(ZipFile.java:149)
at java.util.jar.JarFile.<init>(JarFile.java:166)
at java.util.jar.JarFile.<init>(JarFile.java:130)
at org.apache.maven.shared.dependency.analyzer.DefaultProjectDependencyAnalyzer.buildArtifactClassMap(DefaultProjectDependencyAnalyzer.java:149)
at org.apache.maven.shared.dependency.analyzer.DefaultProjectDependencyAnalyzer.analyze(DefaultProjectDependencyAnalyzer.java:72)
... 35 more
2017-02-16T00:49:04.634 [ERROR]
2017-02-16T00:49:04.634 [ERROR] Re-run Maven using the -X switch to enable full debug logging.
2017-02-16T00:49:04.634 [ERROR]
2017-02-16T00:49:04.634 [ERROR] For more information about the errors and possible solutions, please read the following articles:
2017-02-16T00:49:04.634 [ERROR] [Help 1] http://cwiki.apache.org/confluence/display/MAVEN/MojoExecutionException
2017-02-16T00:49:04.635 [ERROR]
2017-02-16T00:49:04.635 [ERROR] After correcting the problems, you can resume the build with the command
2017-02-16T00:49:04.635 [ERROR] mvn <goals> -rf :beam-sdks-java-io-google-cloud-platform
channel stopped
Jenkins build is back to normal : beam_PostCommit_Java_MavenInstall
#2651
Posted by Apache Jenkins Server <je...@builds.apache.org>.
See <https://builds.apache.org/job/beam_PostCommit_Java_MavenInstall/2651/changes>