You are viewing a plain text version of this content. The canonical link for it is here.
Posted to commits@sling.apache.org by Apache Jenkins Server <je...@builds.apache.org> on 2016/06/10 12:13:43 UTC

Jenkins build is still unstable: sling-trunk-1.7 #4078

See <https://builds.apache.org/job/sling-trunk-1.7/changes>


Build failed in Jenkins: sling-trunk-1.7 #4099

Posted by Apache Jenkins Server <je...@builds.apache.org>.
See <https://builds.apache.org/job/sling-trunk-1.7/4099/changes>

Changes:

[olli] add null check

------------------------------------------
[...truncated 45955 lines...]
[INFO] Apache Sling Test Tools ........................... SKIPPED
[INFO] Apache Sling Testing Clients ...................... SKIPPED
[INFO] Apache Sling Testing Hamcrest ..................... SKIPPED
[INFO] Apache Sling Server Setup Tools ................... SKIPPED
[INFO] Apache Sling Testing Rules ........................ SKIPPED
[INFO] Apache Sling JUnit Scriptable Tests Provider ...... SKIPPED
[INFO] Apache Sling JUnit Health Checks .................. SKIPPED
[INFO] Apache Sling JUnit Remote Tests Runners ........... SKIPPED
[INFO] Apache Sling JUnit Performance .................... SKIPPED
[INFO] Apache Sling Testing Mock Log Configuration ....... SKIPPED
[INFO] Apache Sling Testing Resource Resolver Mock ....... SKIPPED
[INFO] Apache Sling Testing JCR Mock ..................... SKIPPED
[INFO] Apache Sling Testing OSGi Mock .................... SKIPPED
[INFO] Apache Sling Testing Sling Mock ................... SKIPPED
[INFO] Apache Sling Testing Sling Mock Oak-based Resource Resolver  SKIPPED
[INFO] Apache Sling Testing Mocks Modules Reactor ........ SKIPPED
[INFO] Apache Sling Testing - sample bundle with integration tests  SKIPPED
[INFO] Apache Sling Testing - sample module with integration tests  SKIPPED
[INFO] Apache Sling Testing Modules Reactor .............. SKIPPED
[INFO] Apache Sling Installer ............................ SKIPPED
[INFO] Apache Sling File Installer ....................... SKIPPED
[INFO] Apache Sling JCR Installer ........................ SKIPPED
[INFO] Apache Sling Installer Configuration Admin Support  SKIPPED
[INFO] Apache Sling Deployment Package Installer ......... SKIPPED
[INFO] Apache Sling Subsystems Installer ................. SKIPPED
[INFO] Apache Sling Installer Integration Tests .......... SKIPPED
[INFO] Apache Sling Launchpad API ........................ SKIPPED
[INFO] Apache Sling Launchpad Installer .................. SKIPPED
[INFO] Apache Sling Launchpad Content .................... SKIPPED
[INFO] Apache Sling Launchpad Testing Services ........... SKIPPED
[INFO] Apache Sling Launchpad Testing Services WAR ....... SKIPPED
[INFO] Apache Sling Launchpad Testing Fragment Bundle .... SKIPPED
[INFO] Apache Sling Launchpad Test Bundles ............... SKIPPED
[INFO] Apache Sling Integration Tests .................... SKIPPED
[INFO] Apache Sling Launchpad Testing .................... SKIPPED
[INFO] Apache Sling (Builder) ............................ SKIPPED
[INFO] ------------------------------------------------------------------------
[INFO] BUILD FAILURE
[INFO] ------------------------------------------------------------------------
[INFO] Total time: 28:29.204s
[INFO] Finished at: Tue Jun 14 13:34:15 UTC 2016
[INFO] Final Memory: 128M/274M
[INFO] ------------------------------------------------------------------------
[ERROR] Internal error: java.lang.IllegalStateException: Invalid object ID 131 iota=154: Object was recently deallocated
[ERROR] #131 (ref.0) : object=null type=com.sun.proxy.$Proxy93 interfaces=[hudson.maven.MavenBuildProxy2]
[ERROR] Created at Tue Jun 14 13:05:13 UTC 2016
[ERROR] at hudson.remoting.ExportTable$Entry.<init>(ExportTable.java:99)
[ERROR] at hudson.remoting.ExportTable.export(ExportTable.java:305)
[ERROR] at hudson.remoting.Channel.internalExport(Channel.java:629)
[ERROR] at hudson.remoting.Channel.export(Channel.java:620)
[ERROR] at hudson.remoting.Channel.export(Channel.java:590)
[ERROR] at hudson.maven.MavenBuild$ProxyImpl2.writeReplace(MavenBuild.java:751)
[ERROR] at sun.reflect.GeneratedMethodAccessor5196.invoke(Unknown Source)
[ERROR] at sun.reflect.DelegatingMethodAccessorImpl.invoke(DelegatingMethodAccessorImpl.java:43)
[ERROR] at java.lang.reflect.Method.invoke(Method.java:606)
[ERROR] at java.io.ObjectStreamClass.invokeWriteReplace(ObjectStreamClass.java:1075)
[ERROR] at java.io.ObjectOutputStream.writeObject0(ObjectOutputStream.java:1134)
[ERROR] at java.io.ObjectOutputStream.defaultWriteFields(ObjectOutputStream.java:1547)
[ERROR] at java.io.ObjectOutputStream.writeSerialData(ObjectOutputStream.java:1508)
[ERROR] at java.io.ObjectOutputStream.writeOrdinaryObject(ObjectOutputStream.java:1431)
[ERROR] at java.io.ObjectOutputStream.writeObject0(ObjectOutputStream.java:1177)
[ERROR] at java.io.ObjectOutputStream.writeObject(ObjectOutputStream.java:347)
[ERROR] at java.util.HashMap.writeObject(HashMap.java:1133)
[ERROR] at sun.reflect.GeneratedMethodAccessor73.invoke(Unknown Source)
[ERROR] at sun.reflect.DelegatingMethodAccessorImpl.invoke(DelegatingMethodAccessorImpl.java:43)
[ERROR] at java.lang.reflect.Method.invoke(Method.java:606)
[ERROR] at java.io.ObjectStreamClass.invokeWriteObject(ObjectStreamClass.java:988)
[ERROR] at java.io.ObjectOutputStream.writeSerialData(ObjectOutputStream.java:1495)
[ERROR] at java.io.ObjectOutputStream.writeOrdinaryObject(ObjectOutputStream.java:1431)
[ERROR] at java.io.ObjectOutputStream.writeObject0(ObjectOutputStream.java:1177)
[ERROR] at java.io.ObjectOutputStream.defaultWriteFields(ObjectOutputStream.java:1547)
[ERROR] at java.io.ObjectOutputStream.writeSerialData(ObjectOutputStream.java:1508)
[ERROR] at java.io.ObjectOutputStream.writeOrdinaryObject(ObjectOutputStream.java:1431)
[ERROR] at java.io.ObjectOutputStream.writeObject0(ObjectOutputStream.java:1177)
[ERROR] at java.io.ObjectOutputStream.writeObject(ObjectOutputStream.java:347)
[ERROR] at hudson.remoting.UserRequest._serialize(UserRequest.java:157)
[ERROR] at hudson.remoting.UserRequest.serialize(UserRequest.java:166)
[ERROR] at hudson.remoting.UserRequest.<init>(UserRequest.java:62)
[ERROR] at hudson.remoting.Channel.call(Channel.java:779)
[ERROR] at hudson.maven.ProcessCache$MavenProcess.call(ProcessCache.java:161)
[ERROR] at hudson.maven.MavenModuleSetBuild$MavenModuleSetBuildExecution.doRun(MavenModuleSetBuild.java:853)
[ERROR] at hudson.model.AbstractBuild$AbstractBuildExecution.run(AbstractBuild.java:534)
[ERROR] at hudson.model.Run.execute(Run.java:1738)
[ERROR] at hudson.maven.MavenModuleSetBuild.run(MavenModuleSetBuild.java:531)
[ERROR] at hudson.model.ResourceController.execute(ResourceController.java:98)
[ERROR] at hudson.model.Executor.run(Executor.java:410)
[ERROR] Released at Tue Jun 14 13:34:12 UTC 2016
[ERROR] at hudson.remoting.ExportTable$Entry.release(ExportTable.java:131)
[ERROR] at hudson.remoting.ExportTable$ExportList.release(ExportTable.java:247)
[ERROR] at hudson.remoting.UserRequest.releaseExports(UserRequest.java:192)
[ERROR] at hudson.remoting.UserRequest.releaseExports(UserRequest.java:188)
[ERROR] at hudson.remoting.Channel.call(Channel.java:798)
[ERROR] at hudson.maven.ProcessCache$MavenProcess.call(ProcessCache.java:161)
[ERROR] at hudson.maven.MavenModuleSetBuild$MavenModuleSetBuildExecution.doRun(MavenModuleSetBuild.java:853)
[ERROR] at hudson.model.AbstractBuild$AbstractBuildExecution.run(AbstractBuild.java:534)
[ERROR] at hudson.model.Run.execute(Run.java:1738)
[ERROR] at hudson.maven.MavenModuleSetBuild.run(MavenModuleSetBuild.java:531)
[ERROR] at hudson.model.ResourceController.execute(ResourceController.java:98)
[ERROR] at hudson.model.Executor.run(Executor.java:410): ReleasedAt
[ERROR] -> [Help 1]
org.apache.maven.InternalErrorException: Internal error: java.lang.IllegalStateException: Invalid object ID 131 iota=154
	at org.apache.maven.DefaultMaven.execute(DefaultMaven.java:168)
	at org.jvnet.hudson.maven3.launcher.Maven3Launcher.main(Maven3Launcher.java:117)
	at sun.reflect.NativeMethodAccessorImpl.invoke0(Native Method)
	at sun.reflect.NativeMethodAccessorImpl.invoke(NativeMethodAccessorImpl.java:57)
	at sun.reflect.DelegatingMethodAccessorImpl.invoke(DelegatingMethodAccessorImpl.java:43)
	at java.lang.reflect.Method.invoke(Method.java:606)
	at org.codehaus.plexus.classworlds.launcher.Launcher.launchStandard(Launcher.java:329)
	at org.codehaus.plexus.classworlds.launcher.Launcher.launch(Launcher.java:239)
	at org.jvnet.hudson.maven3.agent.Maven3Main.launch(Maven3Main.java:181)
	at sun.reflect.NativeMethodAccessorImpl.invoke0(Native Method)
	at sun.reflect.NativeMethodAccessorImpl.invoke(NativeMethodAccessorImpl.java:57)
	at sun.reflect.DelegatingMethodAccessorImpl.invoke(DelegatingMethodAccessorImpl.java:43)
	at java.lang.reflect.Method.invoke(Method.java:606)
	at hudson.maven.Maven3Builder.call(Maven3Builder.java:136)
	at hudson.maven.Maven3Builder.call(Maven3Builder.java:71)
	at hudson.remoting.UserRequest.perform(UserRequest.java:120)
	at hudson.remoting.UserRequest.perform(UserRequest.java:48)
	at hudson.remoting.Request$2.run(Request.java:326)
	at hudson.remoting.InterceptingExecutorService$1.call(InterceptingExecutorService.java:68)
	at java.util.concurrent.FutureTask.run(FutureTask.java:262)
	at java.util.concurrent.ThreadPoolExecutor.runWorker(ThreadPoolExecutor.java:1145)
	at java.util.concurrent.ThreadPoolExecutor$Worker.run(ThreadPoolExecutor.java:615)
	at java.lang.Thread.run(Thread.java:745)
Caused by: java.lang.IllegalStateException: Invalid object ID 131 iota=154
	at hudson.remoting.ExportTable.diagnoseInvalidId(ExportTable.java:386)
	at hudson.remoting.ExportTable.get(ExportTable.java:330)
	at hudson.remoting.Channel.getExportedObject(Channel.java:633)
	at hudson.remoting.RemoteInvocationHandler$RPCRequest.perform(RemoteInvocationHandler.java:599)
	at hudson.remoting.RemoteInvocationHandler$RPCRequest.call(RemoteInvocationHandler.java:583)
	at hudson.remoting.RemoteInvocationHandler$RPCRequest.call(RemoteInvocationHandler.java:542)
	at hudson.remoting.UserRequest.perform(UserRequest.java:120)
	at hudson.remoting.UserRequest.perform(UserRequest.java:48)
	at hudson.remoting.Request$2.run(Request.java:326)
	at hudson.remoting.InterceptingExecutorService$1.call(InterceptingExecutorService.java:68)
	at org.jenkinsci.remoting.CallableDecorator.call(CallableDecorator.java:18)
	at hudson.remoting.CallableDecoratorList$1.call(CallableDecoratorList.java:21)
	at jenkins.util.ContextResettingExecutorService$2.call(ContextResettingExecutorService.java:46)
	at java.util.concurrent.FutureTask.run(FutureTask.java:262)
	at java.util.concurrent.ThreadPoolExecutor.runWorker(ThreadPoolExecutor.java:1145)
	at java.util.concurrent.ThreadPoolExecutor$Worker.run(ThreadPoolExecutor.java:615)
	at java.lang.Thread.run(Thread.java:745)
	at ......remote call to channel(Native Method)
	at hudson.remoting.Channel.attachCallSiteStackTrace(Channel.java:1416)
	at hudson.remoting.UserResponse.retrieve(UserRequest.java:220)
	at hudson.remoting.Channel.call(Channel.java:781)
	at hudson.remoting.RemoteInvocationHandler.invoke(RemoteInvocationHandler.java:250)
	at com.sun.proxy.$Proxy5.isArchivingDisabled(Unknown Source)
	at hudson.maven.MavenBuildProxy$Filter.isArchivingDisabled(MavenBuildProxy.java:247)
	at hudson.maven.reporters.MavenArtifact.archive(MavenArtifact.java:328)
	at hudson.maven.reporters.MavenArtifactArchiver.postBuild(MavenArtifactArchiver.java:106)
	at hudson.maven.Maven3Builder$MavenExecutionListener.sessionEnded(Maven3Builder.java:471)
	at org.apache.maven.lifecycle.internal.DefaultExecutionEventCatapult.fire(DefaultExecutionEventCatapult.java:64)
	at org.apache.maven.lifecycle.internal.DefaultExecutionEventCatapult.fire(DefaultExecutionEventCatapult.java:42)
	at org.apache.maven.lifecycle.internal.LifecycleStarter.execute(LifecycleStarter.java:170)
	at org.apache.maven.DefaultMaven.doExecute(DefaultMaven.java:320)
	at org.apache.maven.DefaultMaven.execute(DefaultMaven.java:156)
	... 22 more
Caused by: java.lang.Exception: Object was recently deallocated
    #131 (ref.0) : object=null type=com.sun.proxy.$Proxy93 interfaces=[hudson.maven.MavenBuildProxy2]
      Created at Tue Jun 14 13:05:13 UTC 2016
    	at hudson.remoting.ExportTable$Entry.<init>(ExportTable.java:99)
    	at hudson.remoting.ExportTable.export(ExportTable.java:305)
    	at hudson.remoting.Channel.internalExport(Channel.java:629)
    	at hudson.remoting.Channel.export(Channel.java:620)
    	at hudson.remoting.Channel.export(Channel.java:590)
    	at hudson.maven.MavenBuild$ProxyImpl2.writeReplace(MavenBuild.java:751)
    	at sun.reflect.GeneratedMethodAccessor5196.invoke(Unknown Source)
    	at sun.reflect.DelegatingMethodAccessorImpl.invoke(DelegatingMethodAccessorImpl.java:43)
    	at java.lang.reflect.Method.invoke(Method.java:606)
    	at java.io.ObjectStreamClass.invokeWriteReplace(ObjectStreamClass.java:1075)
    	at java.io.ObjectOutputStream.writeObject0(ObjectOutputStream.java:1134)
    	at java.io.ObjectOutputStream.defaultWriteFields(ObjectOutputStream.java:1547)
    	at java.io.ObjectOutputStream.writeSerialData(ObjectOutputStream.java:1508)
    	at java.io.ObjectOutputStream.writeOrdinaryObject(ObjectOutputStream.java:1431)
    	at java.io.ObjectOutputStream.writeObject0(ObjectOutputStream.java:1177)
    	at java.io.ObjectOutputStream.writeObject(ObjectOutputStream.java:347)
    	at java.util.HashMap.writeObject(HashMap.java:1133)
    	at sun.reflect.GeneratedMethodAccessor73.invoke(Unknown Source)
    	at sun.reflect.DelegatingMethodAccessorImpl.invoke(DelegatingMethodAccessorImpl.java:43)
    	at java.lang.reflect.Method.invoke(Method.java:606)
    	at java.io.ObjectStreamClass.invokeWriteObject(ObjectStreamClass.java:988)
    	at java.io.ObjectOutputStream.writeSerialData(ObjectOutputStream.java:1495)
    	at java.io.ObjectOutputStream.writeOrdinaryObject(ObjectOutputStream.java:1431)
    	at java.io.ObjectOutputStream.writeObject0(ObjectOutputStream.java:1177)
    	at java.io.ObjectOutputStream.defaultWriteFields(ObjectOutputStream.java:1547)
    	at java.io.ObjectOutputStream.writeSerialData(ObjectOutputStream.java:1508)
    	at java.io.ObjectOutputStream.writeOrdinaryObject(ObjectOutputStream.java:1431)
    	at java.io.ObjectOutputStream.writeObject0(ObjectOutputStream.java:1177)
    	at java.io.ObjectOutputStream.writeObject(ObjectOutputStream.java:347)
    	at hudson.remoting.UserRequest._serialize(UserRequest.java:157)
    	at hudson.remoting.UserRequest.serialize(UserRequest.java:166)
    	at hudson.remoting.UserRequest.<init>(UserRequest.java:62)
    	at hudson.remoting.Channel.call(Channel.java:779)
    	at hudson.maven.ProcessCache$MavenProcess.call(ProcessCache.java:161)
    	at hudson.maven.MavenModuleSetBuild$MavenModuleSetBuildExecution.doRun(MavenModuleSetBuild.java:853)
    	at hudson.model.AbstractBuild$AbstractBuildExecution.run(AbstractBuild.java:534)
    	at hudson.model.Run.execute(Run.java:1738)
    	at hudson.maven.MavenModuleSetBuild.run(MavenModuleSetBuild.java:531)
    	at hudson.model.ResourceController.execute(ResourceController.java:98)
    	at hudson.model.Executor.run(Executor.java:410)
      Released at Tue Jun 14 13:34:12 UTC 2016
    	at hudson.remoting.ExportTable$Entry.release(ExportTable.java:131)
    	at hudson.remoting.ExportTable$ExportList.release(ExportTable.java:247)
    	at hudson.remoting.UserRequest.releaseExports(UserRequest.java:192)
    	at hudson.remoting.UserRequest.releaseExports(UserRequest.java:188)
    	at hudson.remoting.Channel.call(Channel.java:798)
    	at hudson.maven.ProcessCache$MavenProcess.call(ProcessCache.java:161)
    	at hudson.maven.MavenModuleSetBuild$MavenModuleSetBuildExecution.doRun(MavenModuleSetBuild.java:853)
    	at hudson.model.AbstractBuild$AbstractBuildExecution.run(AbstractBuild.java:534)
    	at hudson.model.Run.execute(Run.java:1738)
    	at hudson.maven.MavenModuleSetBuild.run(MavenModuleSetBuild.java:531)
    	at hudson.model.ResourceController.execute(ResourceController.java:98)
    	at hudson.model.Executor.run(Executor.java:410)
	at hudson.remoting.ExportTable.diagnoseInvalidId(ExportTable.java:379)
	at hudson.remoting.ExportTable.get(ExportTable.java:330)
	at hudson.remoting.Channel.getExportedObject(Channel.java:633)
	at hudson.remoting.RemoteInvocationHandler$RPCRequest.perform(RemoteInvocationHandler.java:599)
	at hudson.remoting.RemoteInvocationHandler$RPCRequest.call(RemoteInvocationHandler.java:583)
	at hudson.remoting.RemoteInvocationHandler$RPCRequest.call(RemoteInvocationHandler.java:542)
	at hudson.remoting.UserRequest.perform(UserRequest.java:120)
	at hudson.remoting.UserRequest.perform(UserRequest.java:48)
	at hudson.remoting.Request$2.run(Request.java:326)
	at hudson.remoting.InterceptingExecutorService$1.call(InterceptingExecutorService.java:68)
	at org.jenkinsci.remoting.CallableDecorator.call(CallableDecorator.java:18)
	at hudson.remoting.CallableDecoratorList$1.call(CallableDecoratorList.java:21)
	at jenkins.util.ContextResettingExecutorService$2.call(ContextResettingExecutorService.java:46)
	... 4 more
Caused by:   Released at Tue Jun 14 13:34:12 UTC 2016
	at hudson.remoting.ExportTable$Entry.release(ExportTable.java:131)
	at hudson.remoting.ExportTable$ExportList.release(ExportTable.java:247)
	at hudson.remoting.UserRequest.releaseExports(UserRequest.java:192)
	at hudson.remoting.UserRequest.releaseExports(UserRequest.java:188)
	at hudson.remoting.Channel.call(Channel.java:798)
	at hudson.maven.ProcessCache$MavenProcess.call(ProcessCache.java:161)
	at hudson.maven.MavenModuleSetBuild$MavenModuleSetBuildExecution.doRun(MavenModuleSetBuild.java:853)
	at hudson.model.AbstractBuild$AbstractBuildExecution.run(AbstractBuild.java:534)
	at hudson.model.Run.execute(Run.java:1738)
	at hudson.maven.MavenModuleSetBuild.run(MavenModuleSetBuild.java:531)
	at hudson.model.ResourceController.execute(ResourceController.java:98)
	at hudson.model.Executor.run(Executor.java:410)
[ERROR] 
[ERROR] To see the full stack trace of the errors, re-run Maven with the -e switch.
[ERROR] Re-run Maven using the -X switch to enable full debug logging.
[ERROR] 
[ERROR] For more information about the errors and possible solutions, please read the following articles:
[ERROR] [Help 1] http://cwiki.apache.org/confluence/display/MAVEN/InternalErrorException
Build was aborted
channel stopped

Jenkins build is still unstable: sling-trunk-1.7 #4098

Posted by Apache Jenkins Server <je...@builds.apache.org>.
See <https://builds.apache.org/job/sling-trunk-1.7/4098/>


Jenkins build is still unstable: sling-trunk-1.7 #4097

Posted by Apache Jenkins Server <je...@builds.apache.org>.
See <https://builds.apache.org/job/sling-trunk-1.7/4097/>


Jenkins build is still unstable: sling-trunk-1.7 #4096

Posted by Apache Jenkins Server <je...@builds.apache.org>.
See <https://builds.apache.org/job/sling-trunk-1.7/changes>


Jenkins build is still unstable: sling-trunk-1.7 #4095

Posted by Apache Jenkins Server <je...@builds.apache.org>.
See <https://builds.apache.org/job/sling-trunk-1.7/changes>


Jenkins build is still unstable: sling-trunk-1.7 #4094

Posted by Apache Jenkins Server <je...@builds.apache.org>.
See <https://builds.apache.org/job/sling-trunk-1.7/4094/>


Jenkins build is still unstable: sling-trunk-1.7 #4093

Posted by Apache Jenkins Server <je...@builds.apache.org>.
See <https://builds.apache.org/job/sling-trunk-1.7/4093/>


Jenkins build is still unstable: sling-trunk-1.7 #4092

Posted by Apache Jenkins Server <je...@builds.apache.org>.
See <https://builds.apache.org/job/sling-trunk-1.7/4092/>


Jenkins build is still unstable: sling-trunk-1.7 #4091

Posted by Apache Jenkins Server <je...@builds.apache.org>.
See <https://builds.apache.org/job/sling-trunk-1.7/4091/>


Jenkins build is unstable: sling-trunk-1.7 #4090

Posted by Apache Jenkins Server <je...@builds.apache.org>.
See <https://builds.apache.org/job/sling-trunk-1.7/4090/>


Build failed in Jenkins: sling-trunk-1.7 #4089

Posted by Apache Jenkins Server <je...@builds.apache.org>.
See <https://builds.apache.org/job/sling-trunk-1.7/4089/>

------------------------------------------
[...truncated 36219 lines...]
[INFO] Apache Sling Scripting Sightly Models Use Provider  SUCCESS [4.791s]
[INFO] Apache Sling Scripting Sightly Read-Eval-Print Loop Environment  SUCCESS [4.939s]
[INFO] Apache Sling Scripting Sightly Integration Tests Content  SUCCESS [3:53.797s]
[INFO] Apache Sling Launchpad Base ....................... SUCCESS [2:38.733s]
[INFO] Apache Sling Subsystems Base Installer ............ SUCCESS [3:18.366s]
[INFO] Apache Sling RepoInit Parser ...................... SUCCESS [2:09.294s]
[INFO] Apache Sling RepoInit Oak/JCR module .............. SUCCESS [5:18.873s]
[INFO] Apache Sling Filesystem Resource Provider ......... SUCCESS [5.318s]
[INFO] Apache Sling Installer WebConsole Plugin .......... FAILURE [23:43.183s]
[INFO] Apache Sling Launchpad Application Builder ........ SKIPPED
[INFO] Apache Sling Scripting Sightly Integration Tests .. SKIPPED
[INFO] Apache Sling Scripting Sightly Reactor ............ SKIPPED
[INFO] Apache Sling Adapter Manager Implementation ....... SKIPPED
[INFO] Apache Sling Bundle Resource Provider ............. SKIPPED
[INFO] Apache Sling Distributed Event Admin .............. SKIPPED
[INFO] Apache Sling Discovery API ........................ SKIPPED
[INFO] Apache Sling Discovery Commons .................... SKIPPED
[INFO] Apache Sling Discovery Base ....................... SKIPPED
[INFO] Apache Sling Resource-Based Discovery Service ..... SKIPPED
[INFO] Apache Sling Oak-Based Discovery Service .......... SKIPPED
[INFO] Apache Sling Discovery Support Bundle ............. SKIPPED
[INFO] Apache Sling Discovery Standalone Implementation .. SKIPPED
[INFO] Apache Sling Event Support ........................ SKIPPED
[INFO] Apache Sling Feature Flags ........................ SKIPPED
[INFO] Apache Sling javax.activation bundle .............. SKIPPED
[INFO] Apache Sling Service User Mapper .................. SKIPPED
[INFO] Apache Sling Settings ............................. SKIPPED
[INFO] Apache Sling Web Console Branding ................. SKIPPED
[INFO] Apache Sling Web Console Security Provider ........ SKIPPED
[INFO] Apache Sling Explorer ............................. SKIPPED
[INFO] Apache Sling Health Check Core .................... SKIPPED
[INFO] Apache Sling Health Check Samples ................. SKIPPED
[INFO] Apache Sling Health Check Support Components ...... SKIPPED
[INFO] Apache Sling Health Check Webconsole Plugin ....... SKIPPED
[INFO] Apache Sling Health Check JUnit Bridge ............ SKIPPED
[INFO] Apache Sling Health Check Annotations ............. SKIPPED
[INFO] Apache Sling Health Check Integration Tests ....... SKIPPED
[INFO] Apache Sling Health Check Reactor POM ............. SKIPPED
[INFO] Apache Sling Resource Access Security ............. SKIPPED
[INFO] Apache Sling Resource Access Security Integration Tests  SKIPPED
[INFO] Apache Sling Models API ........................... SKIPPED
[INFO] Apache Sling Models Implementation ................ SKIPPED
[INFO] Apache Sling Models Integration Tests ............. SKIPPED
[INFO] Apache Sling Internationalization Support ......... SKIPPED
[INFO] Apache Sling XSS Protection Bundle ................ SKIPPED
[INFO] Apache Sling JUnit Core ........................... SKIPPED
[INFO] Apache Sling JUnit Tests Teleporter ............... SKIPPED
[INFO] Apache Sling Resource Builder ..................... SKIPPED
[INFO] Apache Sling Servlet Helpers ...................... SKIPPED
[INFO] Apache Sling RepoInit Integration Tests ........... SKIPPED
[INFO] Apache Sling RepoInit Reactor ..................... SKIPPED
[INFO] Apache Sling Test Tools ........................... SKIPPED
[INFO] Apache Sling Testing Clients ...................... SKIPPED
[INFO] Apache Sling Testing Hamcrest ..................... SKIPPED
[INFO] Apache Sling Server Setup Tools ................... SKIPPED
[INFO] Apache Sling Testing Rules ........................ SKIPPED
[INFO] Apache Sling JUnit Scriptable Tests Provider ...... SKIPPED
[INFO] Apache Sling JUnit Health Checks .................. SKIPPED
[INFO] Apache Sling JUnit Remote Tests Runners ........... SKIPPED
[INFO] Apache Sling JUnit Performance .................... SKIPPED
[INFO] Apache Sling Testing Mock Log Configuration ....... SKIPPED
[INFO] Apache Sling Testing Resource Resolver Mock ....... SKIPPED
[INFO] Apache Sling Testing JCR Mock ..................... SKIPPED
[INFO] Apache Sling Testing OSGi Mock .................... SKIPPED
[INFO] Apache Sling Testing Sling Mock ................... SKIPPED
[INFO] Apache Sling Testing Sling Mock Oak-based Resource Resolver  SKIPPED
[INFO] Apache Sling Testing Mocks Modules Reactor ........ SKIPPED
[INFO] Apache Sling Testing - sample bundle with integration tests  SKIPPED
[INFO] Apache Sling Testing - sample module with integration tests  SKIPPED
[INFO] Apache Sling Testing Modules Reactor .............. SKIPPED
[INFO] Apache Sling Installer ............................ SKIPPED
[INFO] Apache Sling File Installer ....................... SKIPPED
[INFO] Apache Sling JCR Installer ........................ SKIPPED
[INFO] Apache Sling Installer Configuration Admin Support  SKIPPED
[INFO] Apache Sling Deployment Package Installer ......... SKIPPED
[INFO] Apache Sling Subsystems Installer ................. SKIPPED
[INFO] Apache Sling Installer Integration Tests .......... SKIPPED
[INFO] Apache Sling Launchpad API ........................ SKIPPED
[INFO] Apache Sling Launchpad Installer .................. SKIPPED
[INFO] Apache Sling Launchpad Content .................... SKIPPED
[INFO] Apache Sling Launchpad Testing Services ........... SKIPPED
[INFO] Apache Sling Launchpad Testing Services WAR ....... SKIPPED
[INFO] Apache Sling Launchpad Testing Fragment Bundle .... SKIPPED
[INFO] Apache Sling Launchpad Test Bundles ............... SKIPPED
[INFO] Apache Sling Integration Tests .................... SKIPPED
[INFO] Apache Sling Launchpad Testing .................... SKIPPED
[INFO] Apache Sling (Builder) ............................ SKIPPED
[INFO] ------------------------------------------------------------------------
[INFO] BUILD FAILURE
[INFO] ------------------------------------------------------------------------
[INFO] Total time: 1:24:50.429s
[INFO] Finished at: Sun Jun 12 08:15:31 UTC 2016
[INFO] Final Memory: 147M/385M
[INFO] ------------------------------------------------------------------------
[JENKINS] Archiving disabled
[JENKINS] Archiving disabled
[JENKINS] Archiving disabled
[JENKINS] Archiving disabled
[JENKINS] Archiving disabled
[JENKINS] Archiving disabled
[JENKINS] Archiving disabled
[JENKINS] Archiving disabled
[JENKINS] Archiving disabled
[JENKINS] Archiving disabled
[JENKINS] Archiving disabled
[JENKINS] Archiving disabled
[JENKINS] Archiving disabled
[JENKINS] Archiving disabled
[JENKINS] Archiving disabled
[JENKINS] Archiving disabled
[JENKINS] Archiving disabled
[JENKINS] Archiving disabled
[JENKINS] Archiving disabled
[JENKINS] Archiving disabled
[JENKINS] Archiving disabled
[JENKINS] Archiving disabled
[JENKINS] Archiving disabled
[JENKINS] Archiving disabled
[JENKINS] Archiving disabled
[JENKINS] Archiving disabled
[JENKINS] Archiving disabled
[JENKINS] Archiving disabled
[JENKINS] Archiving disabled
[JENKINS] Archiving disabled
[JENKINS] Archiving disabled
[JENKINS] Archiving disabled
[JENKINS] Archiving disabled
[JENKINS] Archiving disabled
[JENKINS] Archiving disabled
[JENKINS] Archiving disabled
[JENKINS] Archiving disabled
[JENKINS] Archiving disabled
[JENKINS] Archiving disabled
[JENKINS] Archiving disabled
[JENKINS] Archiving disabled
[JENKINS] Archiving disabled
[JENKINS] Archiving disabled
[JENKINS] Archiving disabled
[JENKINS] Archiving disabled
[JENKINS] Archiving disabled
[JENKINS] Archiving disabled
[JENKINS] Archiving disabled
[JENKINS] Archiving disabled
[JENKINS] Archiving disabled
[JENKINS] Archiving disabled
[JENKINS] Archiving disabled
[JENKINS] Archiving disabled
[JENKINS] Archiving disabled
[JENKINS] Archiving disabled
[JENKINS] Archiving disabled
[JENKINS] Archiving disabled
[JENKINS] Archiving disabled
[JENKINS] Archiving disabled
[JENKINS] Archiving disabled
[JENKINS] Archiving disabled
[JENKINS] Archiving disabled
[JENKINS] Archiving disabled
[JENKINS] Archiving disabled
[JENKINS] Archiving disabled
[JENKINS] Archiving disabled
[JENKINS] Archiving disabled
[JENKINS] Archiving disabled
[JENKINS] Archiving disabled
[JENKINS] Archiving disabled
[JENKINS] Archiving disabled
[JENKINS] Archiving disabled
[JENKINS] Archiving disabled
[JENKINS] Archiving disabled
[JENKINS] Archiving disabled
[JENKINS] Archiving disabled
[JENKINS] Archiving disabled
[JENKINS] Archiving disabled
[JENKINS] Archiving disabled
[JENKINS] Archiving disabled
[JENKINS] Archiving disabled
[JENKINS] Archiving disabled
[JENKINS] Archiving disabled
[JENKINS] Archiving disabled
[JENKINS] Archiving disabled
[JENKINS] Archiving disabled
[JENKINS] Archiving disabled
[JENKINS] Archiving disabled
[JENKINS] Archiving disabled
[JENKINS] Archiving disabled
[JENKINS] Archiving disabled
[JENKINS] Archiving disabled
[JENKINS] Archiving disabled
[JENKINS] Archiving disabled
[JENKINS] Archiving disabled
[JENKINS] Archiving disabled
[JENKINS] Archiving disabled
[JENKINS] Archiving disabled
[JENKINS] Archiving disabled
[JENKINS] Archiving disabled
[JENKINS] Archiving disabled
[JENKINS] Archiving disabled
[JENKINS] Archiving disabled
[JENKINS] Archiving disabled
[JENKINS] Archiving disabled
[JENKINS] Archiving disabled
[JENKINS] Archiving disabled
[JENKINS] Archiving disabled
[JENKINS] Archiving disabled
[JENKINS] Archiving disabled
[JENKINS] Archiving disabled
[JENKINS] Archiving disabled
[JENKINS] Archiving disabled
[JENKINS] Archiving disabled
[JENKINS] Archiving disabled
[JENKINS] Archiving disabled
[JENKINS] Archiving disabled
[JENKINS] Archiving disabled
[JENKINS] Archiving disabled
[JENKINS] Archiving disabled
[JENKINS] Archiving disabled
[JENKINS] Archiving disabled
[JENKINS] Archiving disabled
[JENKINS] Archiving disabled
[JENKINS] Archiving disabled
[JENKINS] Archiving disabled
[JENKINS] Archiving disabled
[JENKINS] Archiving disabled
[JENKINS] Archiving disabled
[JENKINS] Archiving disabled
[JENKINS] Archiving disabled
[JENKINS] Archiving disabled
[JENKINS] Archiving disabled
[JENKINS] Archiving disabled
[JENKINS] Archiving disabled
[JENKINS] Archiving disabled
[JENKINS] Archiving disabled
[JENKINS] Archiving disabled
[JENKINS] Archiving disabled
[JENKINS] Archiving disabled
[JENKINS] Archiving disabled
[JENKINS] Archiving disabled
[JENKINS] Archiving disabled
Waiting for Jenkins to finish collecting data
[ERROR] Failed to execute goal org.apache.maven.plugins:maven-deploy-plugin:2.8.2:deploy (default-deploy) on project org.apache.sling.installer.console: Failed to deploy metadata: Could not transfer metadata org.apache.sling:org.apache.sling.installer.console:1.0.1-SNAPSHOT/maven-metadata.xml from/to apache.snapshots.https (https://repository.apache.org/content/repositories/snapshots): Failed to transfer file: https://repository.apache.org/content/repositories/snapshots/org/apache/sling/org.apache.sling.installer.console/1.0.1-SNAPSHOT/maven-metadata.xml. Return code is: 502, ReasonPhrase: Proxy Error. -> [Help 1]
[ERROR] 
[ERROR] To see the full stack trace of the errors, re-run Maven with the -e switch.
[ERROR] Re-run Maven using the -X switch to enable full debug logging.
[ERROR] 
[ERROR] For more information about the errors and possible solutions, please read the following articles:
[ERROR] [Help 1] http://cwiki.apache.org/confluence/display/MAVEN/MojoExecutionException
[ERROR] 
[ERROR] After correcting the problems, you can resume the build with the command
[ERROR]   mvn <goals> -rf :org.apache.sling.installer.console
channel stopped

Build failed in Jenkins: sling-trunk-1.7 #4088

Posted by Apache Jenkins Server <je...@builds.apache.org>.
See <https://builds.apache.org/job/sling-trunk-1.7/4088/>

------------------------------------------
Started by timer
[EnvInject] - Loading node environment variables.
Building remotely on ubuntu-4 (docker Ubuntu ubuntu4 ubuntu yahoo-not-h2) in workspace <https://builds.apache.org/job/sling-trunk-1.7/ws/>
Cleaning up <https://builds.apache.org/job/sling-trunk-1.7/ws/trunk>
Updating http://svn.apache.org/repos/asf/sling/trunk at revision '2016-06-12T00:47:17.772 +0000'
At revision 1747944

No changes for http://svn.apache.org/repos/asf/sling/trunk since the previous build
Parsing POMs
Modules changed, recalculating dependency graph
Established TCP socket on 57942
maven3-agent.jar already up to date
maven3-interceptor.jar already up to date
maven3-interceptor-commons.jar already up to date
[trunk] $ /usr/lib/jvm/java-7-openjdk-amd64//bin/java -Xmx512M -XX:MaxPermSize=256M -enableassertions -cp /home/jenkins/jenkins-slave/maven3-agent.jar:/home/jenkins/jenkins-slave/tools/hudson.tasks.Maven_MavenInstallation/Maven_3.0.5/boot/plexus-classworlds-2.4.jar org.jvnet.hudson.maven3.agent.Maven3Main /home/jenkins/jenkins-slave/tools/hudson.tasks.Maven_MavenInstallation/Maven_3.0.5 /home/jenkins/jenkins-slave/slave.jar /home/jenkins/jenkins-slave/maven3-interceptor.jar /home/jenkins/jenkins-slave/maven3-interceptor-commons.jar 57942
Exception in thread "main" java.lang.ClassNotFoundException: hudson.remoting.Launcher
	at org.codehaus.plexus.classworlds.strategy.SelfFirstStrategy.loadClass(SelfFirstStrategy.java:50)
	at org.codehaus.plexus.classworlds.realm.ClassRealm.loadClass(ClassRealm.java:244)
	at org.codehaus.plexus.classworlds.realm.ClassRealm.loadClass(ClassRealm.java:230)
	at org.jvnet.hudson.maven3.agent.Maven3Main.main(Maven3Main.java:138)
	at org.jvnet.hudson.maven3.agent.Maven3Main.main(Maven3Main.java:70)
ERROR: Failed to parse POMs
java.io.EOFException: unexpected stream termination
	at hudson.remoting.ChannelBuilder.negotiate(ChannelBuilder.java:365)
	at hudson.remoting.ChannelBuilder.build(ChannelBuilder.java:310)
	at hudson.slaves.Channels.forProcess(Channels.java:115)
	at hudson.maven.AbstractMavenProcessFactory.newProcess(AbstractMavenProcessFactory.java:297)
	at hudson.maven.ProcessCache.get(ProcessCache.java:236)
	at hudson.maven.MavenModuleSetBuild$MavenModuleSetBuildExecution.doRun(MavenModuleSetBuild.java:778)
	at hudson.model.AbstractBuild$AbstractBuildExecution.run(AbstractBuild.java:534)
	at hudson.model.Run.execute(Run.java:1738)
	at hudson.maven.MavenModuleSetBuild.run(MavenModuleSetBuild.java:531)
	at hudson.model.ResourceController.execute(ResourceController.java:98)
	at hudson.model.Executor.run(Executor.java:410)

Jenkins build is unstable: sling-trunk-1.7 #4087

Posted by Apache Jenkins Server <je...@builds.apache.org>.
See <https://builds.apache.org/job/sling-trunk-1.7/4087/>


Build failed in Jenkins: sling-trunk-1.7 #4086

Posted by Apache Jenkins Server <je...@builds.apache.org>.
See <https://builds.apache.org/job/sling-trunk-1.7/4086/>

------------------------------------------
[...truncated 12029 lines...]
A         testing/sling-pax-util/src
A         testing/sling-pax-util/src/test
A         testing/sling-pax-util/src/test/java
A         testing/sling-pax-util/src/test/java/org
A         testing/sling-pax-util/src/test/java/org/apache
A         testing/sling-pax-util/src/test/java/org/apache/sling
A         testing/sling-pax-util/src/test/java/org/apache/sling/paxexam
A         testing/sling-pax-util/src/test/java/org/apache/sling/paxexam/util
AU        testing/sling-pax-util/src/test/java/org/apache/sling/paxexam/util/SlingRepositoryTest.java
A         testing/sling-pax-util/src/test/java/org/apache/sling/paxexam/util/SlingSetupTest.java
A         testing/sling-pax-util/src/test/java/org/apache/sling/paxexam/util/IgnoredBundlesTest.java
A         testing/sling-pax-util/src/main
A         testing/sling-pax-util/src/main/java
A         testing/sling-pax-util/src/main/java/org
A         testing/sling-pax-util/src/main/java/org/apache
A         testing/sling-pax-util/src/main/java/org/apache/sling
A         testing/sling-pax-util/src/main/java/org/apache/sling/paxexam
A         testing/sling-pax-util/src/main/java/org/apache/sling/paxexam/util
A         testing/sling-pax-util/src/main/java/org/apache/sling/paxexam/util/SlingPaxOptions.java
A         testing/sling-pax-util/pom.xml
A         testing/http
A         testing/http/clients
A         testing/http/clients/src
A         testing/http/clients/src/test
A         testing/http/clients/src/test/java
A         testing/http/clients/src/test/java/org
A         testing/http/clients/src/test/java/org/apache
A         testing/http/clients/src/test/java/org/apache/sling
A         testing/http/clients/src/test/java/org/apache/sling/testing
A         testing/http/clients/src/test/java/org/apache/sling/testing/util
A         testing/http/clients/src/test/java/org/apache/sling/testing/util/UniquePathsTest.java
A         testing/http/clients/src/test/java/org/apache/sling/testing/util/poller
A         testing/http/clients/src/test/java/org/apache/sling/testing/util/poller/AbstractPollerTest.java
A         testing/http/clients/src/test/java/org/apache/sling/testing/AbstractSlingClientGetUrlTest.java
A         testing/http/clients/src/test/java/org/apache/sling/testing/DelayRequestInterceptorTest.java
A         testing/http/clients/src/test/java/org/apache/sling/testing/AbstractSlingClientGetServerUrlTest.java
A         testing/http/clients/src/test/java/org/apache/sling/testing/AbstractSlingClientGetPathTest.java
A         testing/http/clients/src/main
A         testing/http/clients/src/main/java
A         testing/http/clients/src/main/java/org
A         testing/http/clients/src/main/java/org/apache
A         testing/http/clients/src/main/java/org/apache/sling
A         testing/http/clients/src/main/java/org/apache/sling/testing
A         testing/http/clients/src/main/java/org/apache/sling/testing/timeouts
A         testing/http/clients/src/main/java/org/apache/sling/testing/timeouts/TimeoutsProvider.java
A         testing/http/clients/src/main/java/org/apache/sling/testing/clients
A         testing/http/clients/src/main/java/org/apache/sling/testing/clients/SlingClient.java
A         testing/http/clients/src/main/java/org/apache/sling/testing/clients/SlingHttpResponse.java
A         testing/http/clients/src/main/java/org/apache/sling/testing/clients/Constants.java
A         testing/http/clients/src/main/java/org/apache/sling/testing/clients/ClientException.java
A         testing/http/clients/src/main/java/org/apache/sling/testing/clients/util
A         testing/http/clients/src/main/java/org/apache/sling/testing/clients/util/UniquePaths.java
A         testing/http/clients/src/main/java/org/apache/sling/testing/clients/util/FormEntityBuilder.java
A         testing/http/clients/src/main/java/org/apache/sling/testing/clients/util/InputStreamBodyWithLength.java
A         testing/http/clients/src/main/java/org/apache/sling/testing/clients/util/JsonUtils.java
A         testing/http/clients/src/main/java/org/apache/sling/testing/clients/util/URLParameterBuilder.java
A         testing/http/clients/src/main/java/org/apache/sling/testing/clients/util/SlingParameter.java
A         testing/http/clients/src/main/java/org/apache/sling/testing/clients/util/poller
A         testing/http/clients/src/main/java/org/apache/sling/testing/clients/util/poller/PathPoller.java
A         testing/http/clients/src/main/java/org/apache/sling/testing/clients/util/poller/Poller.java
A         testing/http/clients/src/main/java/org/apache/sling/testing/clients/util/poller/AbstractPoller.java
A         testing/http/clients/src/main/java/org/apache/sling/testing/clients/util/XSSUtils.java
A         testing/http/clients/src/main/java/org/apache/sling/testing/clients/util/HttpUtils.java
A         testing/http/clients/src/main/java/org/apache/sling/testing/clients/util/PortAllocator.java
A         testing/http/clients/src/main/java/org/apache/sling/testing/clients/util/ResourceUtil.java
A         testing/http/clients/src/main/java/org/apache/sling/testing/clients/util/config
A         testing/http/clients/src/main/java/org/apache/sling/testing/clients/util/config/InstanceConfigCache.java
A         testing/http/clients/src/main/java/org/apache/sling/testing/clients/util/config/impl
A         testing/http/clients/src/main/java/org/apache/sling/testing/clients/util/config/impl/InstanceConfigCacheImpl.java
A         testing/http/clients/src/main/java/org/apache/sling/testing/clients/util/config/impl/EmptyInstanceConfig.java
A         testing/http/clients/src/main/java/org/apache/sling/testing/clients/util/config/package-info.java
A         testing/http/clients/src/main/java/org/apache/sling/testing/clients/util/config/InstanceConfigException.java
A         testing/http/clients/src/main/java/org/apache/sling/testing/clients/util/config/InstanceConfig.java
A         testing/http/clients/src/main/java/org/apache/sling/testing/clients/AbstractSlingClient.java
A         testing/http/clients/src/main/java/org/apache/sling/testing/clients/SlingClientConfig.java
A         testing/http/clients/src/main/java/org/apache/sling/testing/clients/interceptors
A         testing/http/clients/src/main/java/org/apache/sling/testing/clients/interceptors/StickyCookieSpec.java
A         testing/http/clients/src/main/java/org/apache/sling/testing/clients/interceptors/StickyCookieHolder.java
A         testing/http/clients/src/main/java/org/apache/sling/testing/clients/interceptors/StickyCookieInterceptor.java
A         testing/http/clients/src/main/java/org/apache/sling/testing/clients/interceptors/TestDescriptionHolder.java
A         testing/http/clients/src/main/java/org/apache/sling/testing/clients/interceptors/TestDescriptionInterceptor.java
A         testing/http/clients/src/main/java/org/apache/sling/testing/clients/interceptors/package-info.java
A         testing/http/clients/src/main/java/org/apache/sling/testing/clients/interceptors/DelayRequestInterceptor.java
A         testing/http/clients/src/main/java/org/apache/sling/testing/clients/osgi
A         testing/http/clients/src/main/java/org/apache/sling/testing/clients/osgi/ComponentInfo.java
A         testing/http/clients/src/main/java/org/apache/sling/testing/clients/osgi/ComponentsInfo.java
A         testing/http/clients/src/main/java/org/apache/sling/testing/clients/osgi/Component.java
A         testing/http/clients/src/main/java/org/apache/sling/testing/clients/osgi/OsgiConsoleClient.java
A         testing/http/clients/src/main/java/org/apache/sling/testing/clients/osgi/package-info.java
A         testing/http/clients/src/main/java/org/apache/sling/testing/clients/osgi/BundleInfo.java
A         testing/http/clients/src/main/java/org/apache/sling/testing/clients/osgi/BundlesInfo.java
A         testing/http/clients/src/main/java/org/apache/sling/testing/clients/osgi/Bundle.java
A         testing/http/clients/src/main/java/org/apache/sling/testing/clients/osgi/BundlesInstaller.java
A         testing/http/clients/src/main/java/org/apache/sling/testing/clients/osgi/OsgiInstanceConfig.java
A         testing/http/clients/src/main/java/org/apache/sling/testing/clients/instance
A         testing/http/clients/src/main/java/org/apache/sling/testing/clients/instance/InstanceConfiguration.java
A         testing/http/clients/src/main/java/org/apache/sling/testing/clients/instance/InstanceSetup.java
A         testing/http/clients/src/main/java/org/apache/sling/testing/clients/package-info.java
A         testing/http/clients/pom.xml
A         testing/http/clients/README.md
A         testing/tools
A         testing/tools/src
A         testing/tools/src/main
A         testing/tools/src/main/java
A         testing/tools/src/main/java/org
A         testing/tools/src/main/java/org/apache
A         testing/tools/src/main/java/org/apache/sling
A         testing/tools/src/main/java/org/apache/sling/testing
A         testing/tools/src/main/java/org/apache/sling/testing/tools
A         testing/tools/src/main/java/org/apache/sling/testing/tools/http
AU        testing/tools/src/main/java/org/apache/sling/testing/tools/http/RetryingContentChecker.java
AU        testing/tools/src/main/java/org/apache/sling/testing/tools/http/package-info.java
AU        testing/tools/src/main/java/org/apache/sling/testing/tools/http/RequestExecutor.java
AU        testing/tools/src/main/java/org/apache/sling/testing/tools/http/Request.java
AU        testing/tools/src/main/java/org/apache/sling/testing/tools/http/RequestDocumentor.java
AU        testing/tools/src/main/java/org/apache/sling/testing/tools/http/RequestCustomizer.java
AU        testing/tools/src/main/java/org/apache/sling/testing/tools/http/RequestBuilder.java
A         testing/tools/src/main/java/org/apache/sling/testing/tools/jarexec
AU        testing/tools/src/main/java/org/apache/sling/testing/tools/jarexec/package-info.java
AU        testing/tools/src/main/java/org/apache/sling/testing/tools/jarexec/JarExecutor.java
AU        testing/tools/src/main/java/org/apache/sling/testing/tools/jarexec/ShutdownHookSingleProcessDestroyer.java
A         testing/tools/src/main/java/org/apache/sling/testing/tools/osgi
AU        testing/tools/src/main/java/org/apache/sling/testing/tools/osgi/WebconsoleClient.java
AU        testing/tools/src/main/java/org/apache/sling/testing/tools/osgi/package-info.java
A         testing/tools/src/main/java/org/apache/sling/testing/tools/retry
AU        testing/tools/src/main/java/org/apache/sling/testing/tools/retry/RetryLoop.java
AU        testing/tools/src/main/java/org/apache/sling/testing/tools/retry/package-info.java
A         testing/tools/src/main/java/org/apache/sling/testing/tools/serversetup
AU        testing/tools/src/main/java/org/apache/sling/testing/tools/serversetup/ServerSetupSingleton.java
AU        testing/tools/src/main/java/org/apache/sling/testing/tools/serversetup/SetupPhase.java
AU        testing/tools/src/main/java/org/apache/sling/testing/tools/serversetup/StartRunnableJarPhase.java
AU        testing/tools/src/main/java/org/apache/sling/testing/tools/serversetup/package-info.java
AU        testing/tools/src/main/java/org/apache/sling/testing/tools/serversetup/ServerSetup.java
A         testing/tools/src/main/java/org/apache/sling/testing/tools/junit
A         testing/tools/src/main/java/org/apache/sling/testing/tools/junit/TestDescriptionInterceptor.java
AU        testing/tools/src/main/java/org/apache/sling/testing/tools/junit/package-info.java
AU        testing/tools/src/main/java/org/apache/sling/testing/tools/junit/RemoteLogDumper.java
A         testing/tools/src/main/java/org/apache/sling/testing/tools/junit/TestDescriptionRule.java
A         testing/tools/src/main/java/org/apache/sling/testing/tools/junit/TestNameLoggingFilter.java
A         testing/tools/src/main/java/org/apache/sling/testing/tools/sling
A         testing/tools/src/main/java/org/apache/sling/testing/tools/sling/SlingInstance.java
A         testing/tools/src/main/java/org/apache/sling/testing/tools/sling/SlingInstanceState.java
AU        testing/tools/src/main/java/org/apache/sling/testing/tools/sling/TimeoutsProvider.java
AU        testing/tools/src/main/java/org/apache/sling/testing/tools/sling/package-info.java
AU        testing/tools/src/main/java/org/apache/sling/testing/tools/sling/SlingTestBase.java
AU        testing/tools/src/main/java/org/apache/sling/testing/tools/sling/BundlesInstaller.java
AU        testing/tools/src/main/java/org/apache/sling/testing/tools/sling/SlingClient.java
A         testing/tools/src/main/java/org/apache/sling/testing/tools/sling/SlingInstanceManager.java
A         testing/tools/src/main/java/org/apache/sling/testing/tools/sling/SlingInstancesRule.java
A         testing/tools/src/test
A         testing/tools/src/test/java
A         testing/tools/src/test/java/org
A         testing/tools/src/test/java/org/apache
A         testing/tools/src/test/java/org/apache/sling
A         testing/tools/src/test/java/org/apache/sling/testing
A         testing/tools/src/test/java/org/apache/sling/testing/tools
A         testing/tools/src/test/java/org/apache/sling/testing/tools/test
AU        testing/tools/src/test/java/org/apache/sling/testing/tools/test/TestServerSetup.java
AU        testing/tools/src/test/java/org/apache/sling/testing/tools/test/ServerSetupSingletonTest.java
AU        testing/tools/src/test/java/org/apache/sling/testing/tools/test/TestSetupPhase.java
A         testing/tools/src/test/java/org/apache/sling/testing/tools/sling
A         testing/tools/src/test/java/org/apache/sling/testing/tools/sling/SlingInstancesRuleTest.java
AU        testing/tools/src/test/java/org/apache/sling/testing/tools/sling/SlingClientTest.java
AU        testing/tools/pom.xml
A         testing/samples
A         testing/samples/module-with-it
A         testing/samples/module-with-it/.gitignore
A         testing/samples/module-with-it/src
A         testing/samples/module-with-it/src/test
A         testing/samples/module-with-it/src/test/java
A         testing/samples/module-with-it/src/test/java/org
A         testing/samples/module-with-it/src/test/java/org/apache
A         testing/samples/module-with-it/src/test/java/org/apache/sling
A         testing/samples/module-with-it/src/test/java/org/apache/sling/testing
A         testing/samples/module-with-it/src/test/java/org/apache/sling/testing/samples
A         testing/samples/module-with-it/src/test/java/org/apache/sling/testing/samples/modulewit
AU        testing/samples/module-with-it/src/test/java/org/apache/sling/testing/samples/modulewit/BasicTeleportedIT.java
A         testing/samples/module-with-it/src/main
A         testing/samples/module-with-it/src/main/provisioning
AU        testing/samples/module-with-it/src/main/provisioning/model.txt
AU        testing/samples/module-with-it/pom.xml
A         testing/samples/bundle-with-it
A         testing/samples/bundle-with-it/src
A         testing/samples/bundle-with-it/src/test
A         testing/samples/bundle-with-it/src/test/java
A         testing/samples/bundle-with-it/src/test/java/org
A         testing/samples/bundle-with-it/src/test/java/org/apache
A         testing/samples/bundle-with-it/src/test/java/org/apache/sling
A         testing/samples/bundle-with-it/src/test/java/org/apache/sling/junit
A         testing/samples/bundle-with-it/src/test/java/org/apache/sling/junit/teleporter
A         testing/samples/bundle-with-it/src/test/java/org/apache/sling/junit/teleporter/customizers
A         testing/samples/bundle-with-it/src/test/java/org/apache/sling/junit/teleporter/customizers/BWIT_TeleporterCustomizer.java
A         testing/samples/bundle-with-it/src/test/java/org/apache/sling/testing
A         testing/samples/bundle-with-it/src/test/java/org/apache/sling/testing/samples
A         testing/samples/bundle-with-it/src/test/java/org/apache/sling/testing/samples/bundlewit
A         testing/samples/bundle-with-it/src/test/java/org/apache/sling/testing/samples/bundlewit/MimeTypeServletHttpIT.java
A         testing/samples/bundle-with-it/src/test/java/org/apache/sling/testing/samples/bundlewit/MockResource.java
A         testing/samples/bundle-with-it/src/test/java/org/apache/sling/testing/samples/bundlewit/OsgiConsoleHttpIT.java
A         testing/samples/bundle-with-it/src/test/java/org/apache/sling/testing/samples/bundlewit/SampleUnitTest.java
A         testing/samples/bundle-with-it/src/test/java/org/apache/sling/testing/samples/bundlewit/FilterIT.java
A         testing/samples/bundle-with-it/src/test/java/org/apache/sling/testing/samples/bundlewit/BasicTeleportedIT.java
A         testing/samples/bundle-with-it/src/test/java/org/apache/sling/testing/samples/bundlewit/ResourceMimeTypeDetectorIT.java
A         testing/samples/bundle-with-it/src/main
A         testing/samples/bundle-with-it/src/main/java
A         testing/samples/bundle-with-it/src/main/java/org
A         testing/samples/bundle-with-it/src/main/java/org/apache
A         testing/samples/bundle-with-it/src/main/java/org/apache/sling
A         testing/samples/bundle-with-it/src/main/java/org/apache/sling/testing
A         testing/samples/bundle-with-it/src/main/java/org/apache/sling/testing/samples
A         testing/samples/bundle-with-it/src/main/java/org/apache/sling/testing/samples/bundlewit
A         testing/samples/bundle-with-it/src/main/java/org/apache/sling/testing/samples/bundlewit/api
A         testing/samples/bundle-with-it/src/main/java/org/apache/sling/testing/samples/bundlewit/api/package-info.java
A         testing/samples/bundle-with-it/src/main/java/org/apache/sling/testing/samples/bundlewit/api/ResourceMimeTypeDetector.java
A         testing/samples/bundle-with-it/src/main/java/org/apache/sling/testing/samples/bundlewit/impl
A         testing/samples/bundle-with-it/src/main/java/org/apache/sling/testing/samples/bundlewit/impl/ResourceMimeTypeDetectorImpl.java
A         testing/samples/bundle-with-it/src/main/java/org/apache/sling/testing/samples/bundlewit/impl/MimeTypeServlet.java
A         testing/samples/bundle-with-it/pom.xml
A         .mvn
A         .mvn/jvm.config
 U        .
At revision 1747890

No changes for http://svn.apache.org/repos/asf/sling/trunk since the previous build
Parsing POMs
Modules changed, recalculating dependency graph
Established TCP socket on 54576
maven3-agent.jar already up to date
maven3-interceptor.jar already up to date
maven3-interceptor-commons.jar already up to date
[trunk] $ /usr/lib/jvm/java-7-openjdk-amd64//bin/java -Xmx512M -XX:MaxPermSize=256M -enableassertions -cp /home/jenkins/jenkins-slave/maven3-agent.jar:/home/jenkins/jenkins-slave/tools/hudson.tasks.Maven_MavenInstallation/Maven_3.0.5/boot/plexus-classworlds-2.4.jar org.jvnet.hudson.maven3.agent.Maven3Main /home/jenkins/jenkins-slave/tools/hudson.tasks.Maven_MavenInstallation/Maven_3.0.5 /home/jenkins/jenkins-slave/slave.jar /home/jenkins/jenkins-slave/maven3-interceptor.jar /home/jenkins/jenkins-slave/maven3-interceptor-commons.jar 54576
Exception in thread "main" java.lang.ClassNotFoundException: hudson.remoting.Launcher
	at org.codehaus.plexus.classworlds.strategy.SelfFirstStrategy.loadClass(SelfFirstStrategy.java:50)
	at org.codehaus.plexus.classworlds.realm.ClassRealm.loadClass(ClassRealm.java:244)
	at org.codehaus.plexus.classworlds.realm.ClassRealm.loadClass(ClassRealm.java:230)
	at org.jvnet.hudson.maven3.agent.Maven3Main.main(Maven3Main.java:138)
	at org.jvnet.hudson.maven3.agent.Maven3Main.main(Maven3Main.java:70)
ERROR: Failed to parse POMs
java.io.EOFException: unexpected stream termination
	at hudson.remoting.ChannelBuilder.negotiate(ChannelBuilder.java:365)
	at hudson.remoting.ChannelBuilder.build(ChannelBuilder.java:310)
	at hudson.slaves.Channels.forProcess(Channels.java:115)
	at hudson.maven.AbstractMavenProcessFactory.newProcess(AbstractMavenProcessFactory.java:297)
	at hudson.maven.ProcessCache.get(ProcessCache.java:236)
	at hudson.maven.MavenModuleSetBuild$MavenModuleSetBuildExecution.doRun(MavenModuleSetBuild.java:778)
	at hudson.model.AbstractBuild$AbstractBuildExecution.run(AbstractBuild.java:534)
	at hudson.model.Run.execute(Run.java:1738)
	at hudson.maven.MavenModuleSetBuild.run(MavenModuleSetBuild.java:531)
	at hudson.model.ResourceController.execute(ResourceController.java:98)
	at hudson.model.Executor.run(Executor.java:410)

Build failed in Jenkins: sling-trunk-1.7 #4085

Posted by Apache Jenkins Server <je...@builds.apache.org>.
See <https://builds.apache.org/job/sling-trunk-1.7/4085/>

------------------------------------------
[...truncated 12032 lines...]
A         contrib/explorers/gwt/src/main/resources/SLING-INF/content/apps/sling/servlet/default/explorer
AU        contrib/explorers/gwt/src/main/resources/SLING-INF/content/apps/sling/servlet/default/explorer/tree-node.json.esp
AU        contrib/explorers/gwt/src/main/resources/SLING-INF/content/apps/sling/servlet/default/explorer/children.json.esp
A         contrib/explorers/gwt/src/main/resources/org
A         contrib/explorers/gwt/src/main/resources/org/apache
A         contrib/explorers/gwt/src/main/resources/org/apache/sling
A         contrib/explorers/gwt/src/main/resources/org/apache/sling/explorer
A         contrib/explorers/gwt/src/main/resources/org/apache/sling/explorer/client
A         contrib/explorers/gwt/src/main/resources/org/apache/sling/explorer/client/ExplorerConstants.properties
A         contrib/explorers/gwt/src/main/resources/org/apache/sling/explorer/client/ExplorerConstants_fr.properties
A         contrib/explorers/gwt/src/main/resources/org/apache/sling/explorer/Explorer.gwt.xml
AU        contrib/explorers/gwt/src/main/resources/org/apache/sling/explorer/Sling.png
A         contrib/explorers/gwt/pom.xml
A         contrib/explorers/gwt/README.txt
A         contrib/explorers/gwt/NOTICE
A         contrib/explorers/gwt/LICENSE
A         contrib/explorers/resourceeditor
A         contrib/explorers/resourceeditor/pom.xml
A         contrib/explorers/resourceeditor/README
A         contrib/explorers/resourceeditor/frontend
A         contrib/explorers/resourceeditor/frontend/Gruntfile.js
A         contrib/explorers/resourceeditor/frontend/karma.conf.js
AU        contrib/explorers/resourceeditor/frontend/npm
AU        contrib/explorers/resourceeditor/frontend/karma
A         contrib/explorers/resourceeditor/frontend/npm.cmd
A         contrib/explorers/resourceeditor/frontend/karma.cmd
AU        contrib/explorers/resourceeditor/frontend/licenselist
AU        contrib/explorers/resourceeditor/frontend/grunt
A         contrib/explorers/resourceeditor/frontend/grunt.cmd
AU        contrib/explorers/resourceeditor/frontend/debug_karma.cmd
A         contrib/explorers/resourceeditor/frontend/package.json
A         contrib/explorers/resourceeditor/LICENSE.txt
A         contrib/explorers/resourceeditor/.gitignore
A         contrib/explorers/resourceeditor/src
A         contrib/explorers/resourceeditor/src/test
A         contrib/explorers/resourceeditor/src/test/javascript
A         contrib/explorers/resourceeditor/src/test/javascript/spec
A         contrib/explorers/resourceeditor/src/test/javascript/spec/resource_editor_spec.js
A         contrib/explorers/resourceeditor/src/test/javascript/e2e
A         contrib/explorers/resourceeditor/src/test/javascript/e2e/spec
A         contrib/explorers/resourceeditor/src/test/javascript/e2e/spec/e2e_spec.js
A         contrib/explorers/resourceeditor/src/main
A         contrib/explorers/resourceeditor/src/main/java
A         contrib/explorers/resourceeditor/src/main/java/org
A         contrib/explorers/resourceeditor/src/main/java/org/apache
A         contrib/explorers/resourceeditor/src/main/java/org/apache/sling
A         contrib/explorers/resourceeditor/src/main/java/org/apache/sling/reseditor
A         contrib/explorers/resourceeditor/src/main/java/org/apache/sling/reseditor/DownloadBinaryProperty.java
A         contrib/explorers/resourceeditor/src/main/java/org/apache/sling/reseditor/ResourceTypeList.java
A         contrib/explorers/resourceeditor/src/main/java/org/apache/sling/reseditor/resource
A         contrib/explorers/resourceeditor/src/main/java/org/apache/sling/reseditor/resource/ResEditorResourceProvider.java
A         contrib/explorers/resourceeditor/src/main/java/org/apache/sling/reseditor/resource/ResourceProviderBasedResourceDecorator.java
A         contrib/explorers/resourceeditor/src/main/java/org/apache/sling/reseditor/resource/ResourceIteratorWrapper.java
A         contrib/explorers/resourceeditor/src/main/java/org/apache/sling/reseditor/resource/ResourceTypeResourceWrapper.java
A         contrib/explorers/resourceeditor/src/main/less
A         contrib/explorers/resourceeditor/src/main/less/forms.less
A         contrib/explorers/resourceeditor/src/main/less/navs.less
A         contrib/explorers/resourceeditor/src/main/less/variables.less
A         contrib/explorers/resourceeditor/src/main/less/alerts.less
A         contrib/explorers/resourceeditor/src/main/less/elements.less
A         contrib/explorers/resourceeditor/src/main/less/buttons.less
A         contrib/explorers/resourceeditor/src/main/less/glyphicons.less
A         contrib/explorers/resourceeditor/src/main/less/modals.less
A         contrib/explorers/resourceeditor/src/main/less/scaffolding.less
AU        contrib/explorers/resourceeditor/src/main/less/reseditor.less
A         contrib/explorers/resourceeditor/src/main/resources
A         contrib/explorers/resourceeditor/src/main/resources/META-INF
A         contrib/explorers/resourceeditor/src/main/resources/META-INF/resource-editor.tld
A         contrib/explorers/resourceeditor/src/main/resources/META-INF/tags
A         contrib/explorers/resourceeditor/src/main/resources/META-INF/tags/string-editor.tag
A         contrib/explorers/resourceeditor/src/main/resources/META-INF/tags/path-viewer.tag
A         contrib/explorers/resourceeditor/src/main/resources/META-INF/tags/path-editor.tag
A         contrib/explorers/resourceeditor/src/main/resources/SLING-INF
A         contrib/explorers/resourceeditor/src/main/resources/SLING-INF/libs
A         contrib/explorers/resourceeditor/src/main/resources/SLING-INF/libs/sling
A         contrib/explorers/resourceeditor/src/main/resources/SLING-INF/libs/sling/resource-editor-static-content
A         contrib/explorers/resourceeditor/src/main/resources/SLING-INF/libs/sling/resource-editor-static-content/3rd_party
A         contrib/explorers/resourceeditor/src/main/resources/SLING-INF/libs/sling/resource-editor-static-content/3rd_party/font
AU        contrib/explorers/resourceeditor/src/main/resources/SLING-INF/libs/sling/resource-editor-static-content/3rd_party/font/Michroma.woff
AU        contrib/explorers/resourceeditor/src/main/resources/SLING-INF/libs/sling/resource-editor-static-content/3rd_party/font/Michroma.eot
A         contrib/explorers/resourceeditor/src/main/resources/SLING-INF/libs/sling/resource-editor-static-content/css
A         contrib/explorers/resourceeditor/src/main/resources/SLING-INF/libs/sling/resource-editor-static-content/css/bootbox.reseditor.css
A         contrib/explorers/resourceeditor/src/main/resources/SLING-INF/libs/sling/resource-editor-static-content/css/jstree.reseditor.css
A         contrib/explorers/resourceeditor/src/main/resources/SLING-INF/libs/sling/resource-editor-static-content/css/ie.css
A         contrib/explorers/resourceeditor/src/main/resources/SLING-INF/libs/sling/resource-editor-static-content/css/browser_ie.css
A         contrib/explorers/resourceeditor/src/main/resources/SLING-INF/libs/sling/resource-editor-static-content/css/select2.reseditor.css
A         contrib/explorers/resourceeditor/src/main/resources/SLING-INF/libs/sling/resource-editor-static-content/css/font_ie.css
A         contrib/explorers/resourceeditor/src/main/resources/SLING-INF/libs/sling/resource-editor-static-content/css/font.css
A         contrib/explorers/resourceeditor/src/main/resources/SLING-INF/libs/sling/resource-editor-static-content/img
AU        contrib/explorers/resourceeditor/src/main/resources/SLING-INF/libs/sling/resource-editor-static-content/img/remove.png
AU        contrib/explorers/resourceeditor/src/main/resources/SLING-INF/libs/sling/resource-editor-static-content/img/info_darkgray.png
AU        contrib/explorers/resourceeditor/src/main/resources/SLING-INF/libs/sling/resource-editor-static-content/img/right_arrow_lightgray.png
AU        contrib/explorers/resourceeditor/src/main/resources/SLING-INF/libs/sling/resource-editor-static-content/img/alu.gif
AU        contrib/explorers/resourceeditor/src/main/resources/SLING-INF/libs/sling/resource-editor-static-content/img/folder_lightgray.png
AU        contrib/explorers/resourceeditor/src/main/resources/SLING-INF/libs/sling/resource-editor-static-content/img/info_lightgray.png
AU        contrib/explorers/resourceeditor/src/main/resources/SLING-INF/libs/sling/resource-editor-static-content/img/info_black.png
AU        contrib/explorers/resourceeditor/src/main/resources/SLING-INF/libs/sling/resource-editor-static-content/img/add.png
A         contrib/explorers/resourceeditor/src/main/resources/SLING-INF/libs/sling/resource-editor-static-content/js
A         contrib/explorers/resourceeditor/src/main/resources/SLING-INF/libs/sling/resource-editor-static-content/js/properties
A         contrib/explorers/resourceeditor/src/main/resources/SLING-INF/libs/sling/resource-editor-static-content/js/properties/PropertyController.js
A         contrib/explorers/resourceeditor/src/main/resources/SLING-INF/libs/sling/resource-editor-static-content/js/tree
A         contrib/explorers/resourceeditor/src/main/resources/SLING-INF/libs/sling/resource-editor-static-content/js/tree/AddNodeController.js
A         contrib/explorers/resourceeditor/src/main/resources/SLING-INF/libs/sling/resource-editor-static-content/js/tree/TreeController.js
A         contrib/explorers/resourceeditor/src/main/resources/SLING-INF/libs/sling/resource-editor-static-content/js/tree/JSTreeAdapter.js
A         contrib/explorers/resourceeditor/src/main/resources/SLING-INF/libs/sling/resource-editor-static-content/js/MainController.js
A         contrib/explorers/resourceeditor/src/main/resources/SLING-INF/libs/sling/resource-editor-static-content/js/LoginController.js
A         contrib/explorers/resourceeditor/src/main/resources/SLING-INF/libs/sling/resource-editor
A         contrib/explorers/resourceeditor/src/main/resources/SLING-INF/libs/sling/resource-editor/content-nodes.json
A         contrib/explorers/resourceeditor/src/main/resources/SLING-INF/libs/sling/resource-editor/node-content.jsp
A         contrib/explorers/resourceeditor/src/main/resources/SLING-INF/libs/sling/resource-editor/nodes.json.jsp
A         contrib/explorers/resourceeditor/src/main/resources/SLING-INF/libs/sling/resource-editor/500.jsp
A         contrib/explorers/resourceeditor/src/main/resources/SLING-INF/libs/sling/resource-editor/html.jsp
A         contrib/explorers/resourceeditor/src/main/resources/SLING-INF/libs/sling/resource-editor/nodes.json.incl.jsp
A         contrib/explorers/resourceeditor/src/main/resources/SLING-INF/libs/sling/resource-editor/rootnodes.json.jsp
A         contrib/explorers/resourceeditor/src/main/resources/SLING-INF/libs/sling/resource-editor/Throwable.jsp
A         contrib/explorers/resourceeditor/src/main/resources/SLING-INF/libs/sling/resource-editor/property-editor.jsp
A         contrib/explorers/resourceeditor/src/main/img
AU        contrib/explorers/resourceeditor/src/main/img/info.png
AU        contrib/explorers/resourceeditor/src/main/img/stainless_steel.xcf
AU        contrib/explorers/resourceeditor/src/main/img/save-bigger_white.xcf
A         performance
AU        performance/plot.sh
A         performance/base
A         performance/base/src
A         performance/base/src/main
A         performance/base/src/main/java
A         performance/base/src/main/java/org
A         performance/base/src/main/java/org/apache
A         performance/base/src/main/java/org/apache/sling
A         performance/base/src/main/java/org/apache/sling/performance
A         performance/base/src/main/java/org/apache/sling/performance/IdentifiableTestClass.java
A         performance/base/src/main/java/org/apache/sling/performance/ParameterizedTestList.java
A         performance/base/src/main/java/org/apache/sling/performance/annotation
A         performance/base/src/main/java/org/apache/sling/performance/annotation/BeforeMethodInvocation.java
A         performance/base/src/main/java/org/apache/sling/performance/annotation/PerformanceTest.java
A         performance/base/src/main/java/org/apache/sling/performance/annotation/AfterSpecificTest.java
A         performance/base/src/main/java/org/apache/sling/performance/annotation/BeforeSpecificTest.java
A         performance/base/src/main/java/org/apache/sling/performance/annotation/PerformanceTestFactory.java
A         performance/base/src/main/java/org/apache/sling/performance/annotation/AfterSuite.java
A         performance/base/src/main/java/org/apache/sling/performance/annotation/PerformanceTestSuite.java
A         performance/base/src/main/java/org/apache/sling/performance/annotation/AfterMethodInvocation.java
A         performance/base/src/main/java/org/apache/sling/performance/annotation/BeforeSuite.java
A         performance/base/src/main/java/org/apache/sling/performance/IdentifiableTestCase.java
A         performance/base/src/main/java/org/apache/sling/performance/PerformanceRunner.java
A         performance/base/src/main/java/org/apache/sling/performance/ReportLogger.java
A         performance/base/src/main/java/org/apache/sling/performance/PerformanceSuiteState.java
AU        performance/base/src/main/java/org/apache/sling/performance/TestHelper.java
A         performance/base/src/main/java/org/apache/sling/performance/FrameworkPerformanceMethod.java
A         performance/base/src/main/java/org/apache/sling/performance/PerformanceRecord.java
AU        performance/base/src/main/java/org/apache/sling/performance/ResourceResolverTestRequest.java
AU        performance/base/src/main/java/org/apache/sling/performance/AbstractRepositoryTest.java
A         performance/base/src/test
A         performance/base/src/test/java
A         performance/base/src/test/java/org
A         performance/base/src/test/java/org/apache
A         performance/base/src/test/java/org/apache/sling
A         performance/base/src/test/java/org/apache/sling/performance
A         performance/base/src/test/java/org/apache/sling/performance/samples
A         performance/base/src/test/java/org/apache/sling/performance/samples/WithParametersTest.java
A         performance/base/src/test/java/org/apache/sling/performance/samples/SimplePerformanceTest.java
AU        performance/base/pom.xml
A         performance/pom.xml
A         performance/jcr-resource-2.0.10
A         performance/jcr-resource-2.0.10/src
A         performance/jcr-resource-2.0.10/src/test
A         performance/jcr-resource-2.0.10/src/test/java
A         performance/jcr-resource-2.0.10/src/test/java/org
A         performance/jcr-resource-2.0.10/src/test/java/org/apache
A         performance/jcr-resource-2.0.10/src/test/java/org/apache/sling
A         performance/jcr-resource-2.0.10/src/test/java/org/apache/sling/performance
AU        performance/jcr-resource-2.0.10/src/test/java/org/apache/sling/performance/PerformanceTest.java
AU        performance/jcr-resource-2.0.10/pom.xml
A         performance/jcr-resource-2.1.0
A         performance/jcr-resource-2.1.0/src
A         performance/jcr-resource-2.1.0/src/test
A         performance/jcr-resource-2.1.0/src/test/java
A         performance/jcr-resource-2.1.0/src/test/java/org
A         performance/jcr-resource-2.1.0/src/test/java/org/apache
A         performance/jcr-resource-2.1.0/src/test/java/org/apache/sling
A         performance/jcr-resource-2.1.0/src/test/java/org/apache/sling/performance
AU        performance/jcr-resource-2.1.0/src/test/java/org/apache/sling/performance/PerformanceTest.java
AU        performance/jcr-resource-2.1.0/pom.xml
A         performance/jcr-resource-2.2.0
A         performance/jcr-resource-2.2.0/src
A         performance/jcr-resource-2.2.0/src/test
A         performance/jcr-resource-2.2.0/src/test/java
A         performance/jcr-resource-2.2.0/src/test/java/org
A         performance/jcr-resource-2.2.0/src/test/java/org/apache
A         performance/jcr-resource-2.2.0/src/test/java/org/apache/sling
A         performance/jcr-resource-2.2.0/src/test/java/org/apache/sling/performance
AU        performance/jcr-resource-2.2.0/src/test/java/org/apache/sling/performance/PerformanceTest.java
AU        performance/jcr-resource-2.2.0/pom.xml
A         performance/jcr-resource-2.2.10
A         performance/jcr-resource-2.2.10/src
A         performance/jcr-resource-2.2.10/src/test
A         performance/jcr-resource-2.2.10/src/test/java
A         performance/jcr-resource-2.2.10/src/test/java/org
A         performance/jcr-resource-2.2.10/src/test/java/org/apache
A         performance/jcr-resource-2.2.10/src/test/java/org/apache/sling
A         performance/jcr-resource-2.2.10/src/test/java/org/apache/sling/performance
A         performance/jcr-resource-2.2.10/src/test/java/org/apache/sling/performance/PerformanceTest.java
A         performance/jcr-resource-2.2.10/pom.xml
A         performance/tests
A         performance/tests/src
A         performance/tests/src/main
A         performance/tests/src/main/java
A         performance/tests/src/main/java/org
A         performance/tests/src/main/java/org/apache
A         performance/tests/src/main/java/org/apache/sling
A         performance/tests/src/main/java/org/apache/sling/performance
A         performance/tests/src/main/java/org/apache/sling/performance/tests
A         performance/tests/src/main/java/org/apache/sling/performance/tests/ResolveNonExistingWithManyVanityPathTest.java
A         performance/tests/src/main/java/org/apache/sling/performance/tests/StartupWithManyVanityTest.java
A         performance/tests/src/main/java/org/apache/sling/performance/tests/ResolveNonExistingWithManyAliasTest.java
A         performance/tests/src/main/java/org/apache/sling/performance/tests/StartupWithManyAliasTest.java
A         performance/tests/pom.xml
 U        .
At revision 1747850

No changes for http://svn.apache.org/repos/asf/sling/trunk since the previous build
Parsing POMs
Downloaded artifact http://repo.maven.apache.org/maven2/org/apache/apache/17/apache-17.pom
Downloaded artifact http://repo.maven.apache.org/maven2/org/apache/sling/sling/26/sling-26.pom
Downloaded artifact http://repo.maven.apache.org/maven2/org/apache/sling/sling/25/sling-25.pom
Modules changed, recalculating dependency graph
Established TCP socket on 50272
maven3-agent.jar already up to date
maven3-interceptor.jar already up to date
maven3-interceptor-commons.jar already up to date
[trunk] $ /usr/lib/jvm/java-7-openjdk-amd64//bin/java -Xmx512M -XX:MaxPermSize=256M -enableassertions -cp /home/jenkins/jenkins-slave/maven3-agent.jar:/home/jenkins/jenkins-slave/tools/hudson.tasks.Maven_MavenInstallation/Maven_3.0.5/boot/plexus-classworlds-2.4.jar org.jvnet.hudson.maven3.agent.Maven3Main /home/jenkins/jenkins-slave/tools/hudson.tasks.Maven_MavenInstallation/Maven_3.0.5 /home/jenkins/jenkins-slave/slave.jar /home/jenkins/jenkins-slave/maven3-interceptor.jar /home/jenkins/jenkins-slave/maven3-interceptor-commons.jar 50272
Exception in thread "main" java.lang.ClassNotFoundException: hudson.remoting.Launcher
	at org.codehaus.plexus.classworlds.strategy.SelfFirstStrategy.loadClass(SelfFirstStrategy.java:50)
	at org.codehaus.plexus.classworlds.realm.ClassRealm.loadClass(ClassRealm.java:244)
	at org.codehaus.plexus.classworlds.realm.ClassRealm.loadClass(ClassRealm.java:230)
	at org.jvnet.hudson.maven3.agent.Maven3Main.main(Maven3Main.java:138)
	at org.jvnet.hudson.maven3.agent.Maven3Main.main(Maven3Main.java:70)
ERROR: Failed to parse POMs
java.io.EOFException: unexpected stream termination
	at hudson.remoting.ChannelBuilder.negotiate(ChannelBuilder.java:365)
	at hudson.remoting.ChannelBuilder.build(ChannelBuilder.java:310)
	at hudson.slaves.Channels.forProcess(Channels.java:115)
	at hudson.maven.AbstractMavenProcessFactory.newProcess(AbstractMavenProcessFactory.java:297)
	at hudson.maven.ProcessCache.get(ProcessCache.java:236)
	at hudson.maven.MavenModuleSetBuild$MavenModuleSetBuildExecution.doRun(MavenModuleSetBuild.java:778)
	at hudson.model.AbstractBuild$AbstractBuildExecution.run(AbstractBuild.java:534)
	at hudson.model.Run.execute(Run.java:1738)
	at hudson.maven.MavenModuleSetBuild.run(MavenModuleSetBuild.java:531)
	at hudson.model.ResourceController.execute(ResourceController.java:98)
	at hudson.model.Executor.run(Executor.java:410)

Jenkins build is still unstable: sling-trunk-1.7 #4084

Posted by Apache Jenkins Server <je...@builds.apache.org>.
See <https://builds.apache.org/job/sling-trunk-1.7/changes>


Jenkins build is still unstable: sling-trunk-1.7 #4083

Posted by Apache Jenkins Server <je...@builds.apache.org>.
See <https://builds.apache.org/job/sling-trunk-1.7/changes>


Jenkins build is still unstable: sling-trunk-1.7 #4082

Posted by Apache Jenkins Server <je...@builds.apache.org>.
See <https://builds.apache.org/job/sling-trunk-1.7/changes>


Jenkins build is still unstable: sling-trunk-1.7 #4081

Posted by Apache Jenkins Server <je...@builds.apache.org>.
See <https://builds.apache.org/job/sling-trunk-1.7/changes>


Jenkins build is still unstable: sling-trunk-1.7 #4080

Posted by Apache Jenkins Server <je...@builds.apache.org>.
See <https://builds.apache.org/job/sling-trunk-1.7/changes>


Jenkins build is still unstable: sling-trunk-1.7 #4079

Posted by Apache Jenkins Server <je...@builds.apache.org>.
See <https://builds.apache.org/job/sling-trunk-1.7/changes>