You are viewing a plain text version of this content. The canonical link for it is here.
Posted to scm-dev@maven.apache.org by Brett Porter <br...@apache.org> on 2006/03/24 08:03:15 UTC
Re: [continuum] BUILD FAILURE: Maven SCM Bazaar Provider
Any ideas on this? bzr 0.7 seems to be properly installed now. Can the
output of the tests be improved?
- Brett
Continuum Build Server wrote:
> Online report : http://ci.codehaus.org/continuum-maven/servlet/continuum/target/ProjectBuild.vm/view/ProjectBuild/id/66/buildId/714
> Build statistics:
> State: Failed
> Previous State: Failed
> Started at: Thu, 23 Mar 2006 22:50:10 -0800
> Finished at: Thu, 23 Mar 2006 22:50:20 -0800
> Total time: 10s
> Build Trigger: Forced
> Exit code: 1
> Building machine hostname: cheddar.simulalabs.com
> Operating system : Linux(unknown)
> Java version : 1.5.0_03(Sun Microsystems Inc.)
>
> Changes
> No files changed
>
> ****************************************************************************
> Output:
> ****************************************************************************
> [INFO] Scanning for projects...
> [INFO] ----------------------------------------------------------------------------
> [INFO] Building Maven SCM Bazaar Provider
> [INFO] task-segment: [clean, install]
> [INFO] ----------------------------------------------------------------------------
> [INFO] [clean:clean]
> [INFO] Deleting directory /home/nobody/continuum-maven/working-directory/66/target
> [INFO] Deleting directory /home/nobody/continuum-maven/working-directory/66/target/classes
> [INFO] Deleting directory /home/nobody/continuum-maven/working-directory/66/target/test-classes
> [INFO] [resources:resources]
> [INFO] Using default encoding to copy filtered resources.
> [INFO] [compiler:compile]
> Compiling 19 source files to /home/nobody/continuum-maven/working-directory/66/target/classes
> [INFO] [resources:testResources]
> [INFO] Using default encoding to copy filtered resources.
> [INFO] [compiler:testCompile]
> Compiling 7 source files to /home/nobody/continuum-maven/working-directory/66/target/test-classes
> [INFO] [surefire:test]
> [INFO] Setting reports dir: /home/nobody/continuum-maven/working-directory/66/target/surefire-reports
>
> -------------------------------------------------------
> T E S T S
> -------------------------------------------------------
> [surefire] Running org.apache.maven.scm.provider.bazaar.command.checkin.BazaarCheckInCommandTest
> EXECUTING: bzr init
> failed to open trace file: [Errno 13] Permission denied: '/.bzr.log'
> [ERROR] exceptions.ImportError: No module named elementtree.ElementTreeBazaar version: Unknown
> Working directory: /home/nobody/continuum-maven/working-directory/66/target/test-branch
> failed to open trace file: [Errno 13] Permission denied: '/.bzr.log'
> [ERROR] exceptions.ImportError: No module named elementtree.ElementTreeEXECUTING: bzr add /home/nobody/continuum-maven/working-directory/66/target/test-branch/pom.xml /home/nobody/continuum-maven/working-directory/66/target/test-branch/readme.txt /home/nobody/continuum-maven/working-directory/66/target/test-branch/src/main/java/Application.java /home/nobody/continuum-maven/working-directory/66/target/test-branch/src/test/java/Test.java
> failed to open trace file: [Errno 13] Permission denied: '/.bzr.log'
> [ERROR] exceptions.ImportError: No module named elementtree.ElementTreeBazaar version: Unknown
> Working directory: /home/nobody/continuum-maven/working-directory/66/target/test-branch
> failed to open trace file: [Errno 13] Permission denied: '/.bzr.log'
> [ERROR] exceptions.ImportError: No module named elementtree.ElementTreeEXECUTING: bzr init
> failed to open trace file: [Errno 13] Permission denied: '/.bzr.log'
> [ERROR] exceptions.ImportError: No module named elementtree.ElementTreeBazaar version: Unknown
> Working directory: /home/nobody/continuum-maven/working-directory/66/target/test-branch
> failed to open trace file: [Errno 13] Permission denied: '/.bzr.log'
> [ERROR] exceptions.ImportError: No module named elementtree.ElementTreeEXECUTING: bzr add /home/nobody/continuum-maven/working-directory/66/target/test-branch/pom.xml /home/nobody/continuum-maven/working-directory/66/target/test-branch/readme.txt /home/nobody/continuum-maven/working-directory/66/target/test-branch/src/main/java/Application.java /home/nobody/continuum-maven/working-directory/66/target/test-branch/src/test/java/Test.java
> failed to open trace file: [Errno 13] Permission denied: '/.bzr.log'
> [ERROR] exceptions.ImportError: No module named elementtree.ElementTreeBazaar version: Unknown
> Working directory: /home/nobody/continuum-maven/working-directory/66/target/test-branch
> failed to open trace file: [Errno 13] Permission denied: '/.bzr.log'
> [ERROR] exceptions.ImportError: No module named elementtree.ElementTree[surefire] Tests run: 2, Failures: 0, Errors: 2, Time elapsed: 1.622 sec <<<<<<<< FAILURE !!
> [surefire] Running org.apache.maven.scm.provider.bazaar.command.checkout.BazaarCheckOutCommandTest
> EXECUTING: bzr init
> failed to open trace file: [Errno 13] Permission denied: '/.bzr.log'
> [ERROR] exceptions.ImportError: No module named elementtree.ElementTreeBazaar version: Unknown
> Working directory: /home/nobody/continuum-maven/working-directory/66/target/test-branch
> failed to open trace file: [Errno 13] Permission denied: '/.bzr.log'
> [ERROR] exceptions.ImportError: No module named elementtree.ElementTreeEXECUTING: bzr add /home/nobody/continuum-maven/working-directory/66/target/test-branch/pom.xml /home/nobody/continuum-maven/working-directory/66/target/test-branch/readme.txt /home/nobody/continuum-maven/working-directory/66/target/test-branch/src/main/java/Application.java /home/nobody/continuum-maven/working-directory/66/target/test-branch/src/test/java/Test.java
> failed to open trace file: [Errno 13] Permission denied: '/.bzr.log'
> [ERROR] exceptions.ImportError: No module named elementtree.ElementTreeBazaar version: Unknown
> Working directory: /home/nobody/continuum-maven/working-directory/66/target/test-branch
> failed to open trace file: [Errno 13] Permission denied: '/.bzr.log'
> [ERROR] exceptions.ImportError: No module named elementtree.ElementTree[surefire] Tests run: 1, Failures: 0, Errors: 1, Time elapsed: 0.641 sec <<<<<<<< FAILURE !!
> [surefire] Running org.apache.maven.scm.provider.bazaar.command.status.BazaarStatusCommandTest
> EXECUTING: bzr init
> failed to open trace file: [Errno 13] Permission denied: '/.bzr.log'
> [ERROR] exceptions.ImportError: No module named elementtree.ElementTreeBazaar version: Unknown
> Working directory: /home/nobody/continuum-maven/working-directory/66/target/test-branch
> failed to open trace file: [Errno 13] Permission denied: '/.bzr.log'
> [ERROR] exceptions.ImportError: No module named elementtree.ElementTreeEXECUTING: bzr add /home/nobody/continuum-maven/working-directory/66/target/test-branch/pom.xml /home/nobody/continuum-maven/working-directory/66/target/test-branch/readme.txt /home/nobody/continuum-maven/working-directory/66/target/test-branch/src/main/java/Application.java /home/nobody/continuum-maven/working-directory/66/target/test-branch/src/test/java/Test.java
> failed to open trace file: [Errno 13] Permission denied: '/.bzr.log'
> [ERROR] exceptions.ImportError: No module named elementtree.ElementTreeBazaar version: Unknown
> Working directory: /home/nobody/continuum-maven/working-directory/66/target/test-branch
> failed to open trace file: [Errno 13] Permission denied: '/.bzr.log'
> [ERROR] exceptions.ImportError: No module named elementtree.ElementTree[surefire] Tests run: 1, Failures: 0, Errors: 1, Time elapsed: 0.606 sec <<<<<<<< FAILURE !!
> [surefire] Running org.apache.maven.scm.provider.bazaar.command.diff.BazaarDiffCommandTest
> EXECUTING: bzr init
> failed to open trace file: [Errno 13] Permission denied: '/.bzr.log'
> [ERROR] exceptions.ImportError: No module named elementtree.ElementTreeBazaar version: Unknown
> Working directory: /home/nobody/continuum-maven/working-directory/66/target/test-branch
> failed to open trace file: [Errno 13] Permission denied: '/.bzr.log'
> [ERROR] exceptions.ImportError: No module named elementtree.ElementTreeEXECUTING: bzr add /home/nobody/continuum-maven/working-directory/66/target/test-branch/pom.xml /home/nobody/continuum-maven/working-directory/66/target/test-branch/readme.txt /home/nobody/continuum-maven/working-directory/66/target/test-branch/src/main/java/Application.java /home/nobody/continuum-maven/working-directory/66/target/test-branch/src/test/java/Test.java
> failed to open trace file: [Errno 13] Permission denied: '/.bzr.log'
> [ERROR] exceptions.ImportError: No module named elementtree.ElementTreeBazaar version: Unknown
> Working directory: /home/nobody/continuum-maven/working-directory/66/target/test-branch
> failed to open trace file: [Errno 13] Permission denied: '/.bzr.log'
> [ERROR] exceptions.ImportError: No module named elementtree.ElementTree[surefire] Tests run: 1, Failures: 0, Errors: 1, Time elapsed: 0.599 sec <<<<<<<< FAILURE !!
> [surefire] Running org.apache.maven.scm.provider.bazaar.command.update.BazaarUpdateCommandTest
> EXECUTING: bzr init
> failed to open trace file: [Errno 13] Permission denied: '/.bzr.log'
> [ERROR] exceptions.ImportError: No module named elementtree.ElementTreeBazaar version: Unknown
> Working directory: /home/nobody/continuum-maven/working-directory/66/target/test-branch
> failed to open trace file: [Errno 13] Permission denied: '/.bzr.log'
> [ERROR] exceptions.ImportError: No module named elementtree.ElementTreeEXECUTING: bzr add /home/nobody/continuum-maven/working-directory/66/target/test-branch/pom.xml /home/nobody/continuum-maven/working-directory/66/target/test-branch/readme.txt /home/nobody/continuum-maven/working-directory/66/target/test-branch/src/main/java/Application.java /home/nobody/continuum-maven/working-directory/66/target/test-branch/src/test/java/Test.java
> failed to open trace file: [Errno 13] Permission denied: '/.bzr.log'
> [ERROR] exceptions.ImportError: No module named elementtree.ElementTreeBazaar version: Unknown
> Working directory: /home/nobody/continuum-maven/working-directory/66/target/test-branch
> failed to open trace file: [Errno 13] Permission denied: '/.bzr.log'
> [ERROR] exceptions.ImportError: No module named elementtree.ElementTree[surefire] Tests run: 1, Failures: 0, Errors: 1, Time elapsed: 0.664 sec <<<<<<<< FAILURE !!
> [surefire] Running org.apache.maven.scm.provider.bazaar.command.changelog.BazaarChangeLogCommandTckTest
> EXECUTING: bzr init
> failed to open trace file: [Errno 13] Permission denied: '/.bzr.log'
> [ERROR] exceptions.ImportError: No module named elementtree.ElementTreeBazaar version: Unknown
> Working directory: /home/nobody/continuum-maven/working-directory/66/target/test-branch
> failed to open trace file: [Errno 13] Permission denied: '/.bzr.log'
> [ERROR] exceptions.ImportError: No module named elementtree.ElementTreeEXECUTING: bzr add /home/nobody/continuum-maven/working-directory/66/target/test-branch/pom.xml /home/nobody/continuum-maven/working-directory/66/target/test-branch/readme.txt /home/nobody/continuum-maven/working-directory/66/target/test-branch/src/main/java/Application.java /home/nobody/continuum-maven/working-directory/66/target/test-branch/src/test/java/Test.java
> failed to open trace file: [Errno 13] Permission denied: '/.bzr.log'
> [ERROR] exceptions.ImportError: No module named elementtree.ElementTreeBazaar version: Unknown
> Working directory: /home/nobody/continuum-maven/working-directory/66/target/test-branch
> failed to open trace file: [Errno 13] Permission denied: '/.bzr.log'
> [ERROR] exceptions.ImportError: No module named elementtree.ElementTree[surefire] Tests run: 1, Failures: 0, Errors: 1, Time elapsed: 0.562 sec <<<<<<<< FAILURE !!
> [INFO] ----------------------------------------------------------------------------
> [ERROR] BUILD ERROR
> [INFO] ----------------------------------------------------------------------------
> [INFO] There are test failures.
> [INFO] ----------------------------------------------------------------------------
> [INFO] For more information, run Maven with the -e switch
> [INFO] ----------------------------------------------------------------------------
> [INFO] Total time: 9 seconds
> [INFO] Finished at: Thu Mar 23 22:50:20 PST 2006
> [INFO] Final Memory: 8M/125M
> [INFO] ----------------------------------------------------------------------------
>
> ****************************************************************************
>
>
RE: [continuum] BUILD FAILURE: Maven SCM Bazaar Provider
Posted by Torbjørn Smørgrav <ts...@stavanger.oilfield.slb.com>.
I'll change the test output to be more spesific about where the error
occured, if its
the bazaar installation or if its due to unexpected response from bazaar.
Torbjørn
-----Original Message-----
From: Brett Porter [mailto:brett@apache.org]
Sent: 24. mars 2006 08:03
To: scm-dev@maven.apache.org
Subject: Re: [continuum] BUILD FAILURE: Maven SCM Bazaar Provider
Any ideas on this? bzr 0.7 seems to be properly installed now. Can the
output of the tests be improved?
- Brett
Continuum Build Server wrote:
> Online report :
http://ci.codehaus.org/continuum-maven/servlet/continuum/target/ProjectBuild
.vm/view/ProjectBuild/id/66/buildId/714
> Build statistics:
> State: Failed
> Previous State: Failed
> Started at: Thu, 23 Mar 2006 22:50:10 -0800
> Finished at: Thu, 23 Mar 2006 22:50:20 -0800
> Total time: 10s
> Build Trigger: Forced
> Exit code: 1
> Building machine hostname: cheddar.simulalabs.com
> Operating system : Linux(unknown)
> Java version : 1.5.0_03(Sun Microsystems Inc.)
>
> Changes
> No files changed
>
>
****************************************************************************
> Output:
>
****************************************************************************
> [INFO] Scanning for projects...
>
[INFO] ---------------------------------------------------------------------
-------
> [INFO] Building Maven SCM Bazaar Provider
> [INFO] task-segment: [clean, install]
>
[INFO] ---------------------------------------------------------------------
-------
> [INFO] [clean:clean]
> [INFO] Deleting directory
/home/nobody/continuum-maven/working-directory/66/target
> [INFO] Deleting directory
/home/nobody/continuum-maven/working-directory/66/target/classes
> [INFO] Deleting directory
/home/nobody/continuum-maven/working-directory/66/target/test-classes
> [INFO] [resources:resources]
> [INFO] Using default encoding to copy filtered resources.
> [INFO] [compiler:compile]
> Compiling 19 source files to
/home/nobody/continuum-maven/working-directory/66/target/classes
> [INFO] [resources:testResources]
> [INFO] Using default encoding to copy filtered resources.
> [INFO] [compiler:testCompile]
> Compiling 7 source files to
/home/nobody/continuum-maven/working-directory/66/target/test-classes
> [INFO] [surefire:test]
> [INFO] Setting reports dir:
/home/nobody/continuum-maven/working-directory/66/target/surefire-reports
>
> -------------------------------------------------------
> T E S T S
> -------------------------------------------------------
> [surefire] Running
org.apache.maven.scm.provider.bazaar.command.checkin.BazaarCheckInCommandTes
t
> EXECUTING: bzr init
> failed to open trace file: [Errno 13] Permission denied: '/.bzr.log'
> [ERROR] exceptions.ImportError: No module named
elementtree.ElementTreeBazaar version: Unknown
> Working directory:
/home/nobody/continuum-maven/working-directory/66/target/test-branch
> failed to open trace file: [Errno 13] Permission denied: '/.bzr.log'
> [ERROR] exceptions.ImportError: No module named
elementtree.ElementTreeEXECUTING: bzr add
/home/nobody/continuum-maven/working-directory/66/target/test-branch/pom.xml
/home/nobody/continuum-maven/working-directory/66/target/test-branch/readme.
txt
/home/nobody/continuum-maven/working-directory/66/target/test-branch/src/mai
n/java/Application.java
/home/nobody/continuum-maven/working-directory/66/target/test-branch/src/tes
t/java/Test.java
> failed to open trace file: [Errno 13] Permission denied: '/.bzr.log'
> [ERROR] exceptions.ImportError: No module named
elementtree.ElementTreeBazaar version: Unknown
> Working directory:
/home/nobody/continuum-maven/working-directory/66/target/test-branch
> failed to open trace file: [Errno 13] Permission denied: '/.bzr.log'
> [ERROR] exceptions.ImportError: No module named
elementtree.ElementTreeEXECUTING: bzr init
> failed to open trace file: [Errno 13] Permission denied: '/.bzr.log'
> [ERROR] exceptions.ImportError: No module named
elementtree.ElementTreeBazaar version: Unknown
> Working directory:
/home/nobody/continuum-maven/working-directory/66/target/test-branch
> failed to open trace file: [Errno 13] Permission denied: '/.bzr.log'
> [ERROR] exceptions.ImportError: No module named
elementtree.ElementTreeEXECUTING: bzr add
/home/nobody/continuum-maven/working-directory/66/target/test-branch/pom.xml
/home/nobody/continuum-maven/working-directory/66/target/test-branch/readme.
txt
/home/nobody/continuum-maven/working-directory/66/target/test-branch/src/mai
n/java/Application.java
/home/nobody/continuum-maven/working-directory/66/target/test-branch/src/tes
t/java/Test.java
> failed to open trace file: [Errno 13] Permission denied: '/.bzr.log'
> [ERROR] exceptions.ImportError: No module named
elementtree.ElementTreeBazaar version: Unknown
> Working directory:
/home/nobody/continuum-maven/working-directory/66/target/test-branch
> failed to open trace file: [Errno 13] Permission denied: '/.bzr.log'
> [ERROR] exceptions.ImportError: No module named
elementtree.ElementTree[surefire] Tests run: 2, Failures: 0, Errors: 2, Time
elapsed: 1.622 sec <<<<<<<< FAILURE !!
> [surefire] Running
org.apache.maven.scm.provider.bazaar.command.checkout.BazaarCheckOutCommandT
est
> EXECUTING: bzr init
> failed to open trace file: [Errno 13] Permission denied: '/.bzr.log'
> [ERROR] exceptions.ImportError: No module named
elementtree.ElementTreeBazaar version: Unknown
> Working directory:
/home/nobody/continuum-maven/working-directory/66/target/test-branch
> failed to open trace file: [Errno 13] Permission denied: '/.bzr.log'
> [ERROR] exceptions.ImportError: No module named
elementtree.ElementTreeEXECUTING: bzr add
/home/nobody/continuum-maven/working-directory/66/target/test-branch/pom.xml
/home/nobody/continuum-maven/working-directory/66/target/test-branch/readme.
txt
/home/nobody/continuum-maven/working-directory/66/target/test-branch/src/mai
n/java/Application.java
/home/nobody/continuum-maven/working-directory/66/target/test-branch/src/tes
t/java/Test.java
> failed to open trace file: [Errno 13] Permission denied: '/.bzr.log'
> [ERROR] exceptions.ImportError: No module named
elementtree.ElementTreeBazaar version: Unknown
> Working directory:
/home/nobody/continuum-maven/working-directory/66/target/test-branch
> failed to open trace file: [Errno 13] Permission denied: '/.bzr.log'
> [ERROR] exceptions.ImportError: No module named
elementtree.ElementTree[surefire] Tests run: 1, Failures: 0, Errors: 1, Time
elapsed: 0.641 sec <<<<<<<< FAILURE !!
> [surefire] Running
org.apache.maven.scm.provider.bazaar.command.status.BazaarStatusCommandTest
> EXECUTING: bzr init
> failed to open trace file: [Errno 13] Permission denied: '/.bzr.log'
> [ERROR] exceptions.ImportError: No module named
elementtree.ElementTreeBazaar version: Unknown
> Working directory:
/home/nobody/continuum-maven/working-directory/66/target/test-branch
> failed to open trace file: [Errno 13] Permission denied: '/.bzr.log'
> [ERROR] exceptions.ImportError: No module named
elementtree.ElementTreeEXECUTING: bzr add
/home/nobody/continuum-maven/working-directory/66/target/test-branch/pom.xml
/home/nobody/continuum-maven/working-directory/66/target/test-branch/readme.
txt
/home/nobody/continuum-maven/working-directory/66/target/test-branch/src/mai
n/java/Application.java
/home/nobody/continuum-maven/working-directory/66/target/test-branch/src/tes
t/java/Test.java
> failed to open trace file: [Errno 13] Permission denied: '/.bzr.log'
> [ERROR] exceptions.ImportError: No module named
elementtree.ElementTreeBazaar version: Unknown
> Working directory:
/home/nobody/continuum-maven/working-directory/66/target/test-branch
> failed to open trace file: [Errno 13] Permission denied: '/.bzr.log'
> [ERROR] exceptions.ImportError: No module named
elementtree.ElementTree[surefire] Tests run: 1, Failures: 0, Errors: 1, Time
elapsed: 0.606 sec <<<<<<<< FAILURE !!
> [surefire] Running
org.apache.maven.scm.provider.bazaar.command.diff.BazaarDiffCommandTest
> EXECUTING: bzr init
> failed to open trace file: [Errno 13] Permission denied: '/.bzr.log'
> [ERROR] exceptions.ImportError: No module named
elementtree.ElementTreeBazaar version: Unknown
> Working directory:
/home/nobody/continuum-maven/working-directory/66/target/test-branch
> failed to open trace file: [Errno 13] Permission denied: '/.bzr.log'
> [ERROR] exceptions.ImportError: No module named
elementtree.ElementTreeEXECUTING: bzr add
/home/nobody/continuum-maven/working-directory/66/target/test-branch/pom.xml
/home/nobody/continuum-maven/working-directory/66/target/test-branch/readme.
txt
/home/nobody/continuum-maven/working-directory/66/target/test-branch/src/mai
n/java/Application.java
/home/nobody/continuum-maven/working-directory/66/target/test-branch/src/tes
t/java/Test.java
> failed to open trace file: [Errno 13] Permission denied: '/.bzr.log'
> [ERROR] exceptions.ImportError: No module named
elementtree.ElementTreeBazaar version: Unknown
> Working directory:
/home/nobody/continuum-maven/working-directory/66/target/test-branch
> failed to open trace file: [Errno 13] Permission denied: '/.bzr.log'
> [ERROR] exceptions.ImportError: No module named
elementtree.ElementTree[surefire] Tests run: 1, Failures: 0, Errors: 1, Time
elapsed: 0.599 sec <<<<<<<< FAILURE !!
> [surefire] Running
org.apache.maven.scm.provider.bazaar.command.update.BazaarUpdateCommandTest
> EXECUTING: bzr init
> failed to open trace file: [Errno 13] Permission denied: '/.bzr.log'
> [ERROR] exceptions.ImportError: No module named
elementtree.ElementTreeBazaar version: Unknown
> Working directory:
/home/nobody/continuum-maven/working-directory/66/target/test-branch
> failed to open trace file: [Errno 13] Permission denied: '/.bzr.log'
> [ERROR] exceptions.ImportError: No module named
elementtree.ElementTreeEXECUTING: bzr add
/home/nobody/continuum-maven/working-directory/66/target/test-branch/pom.xml
/home/nobody/continuum-maven/working-directory/66/target/test-branch/readme.
txt
/home/nobody/continuum-maven/working-directory/66/target/test-branch/src/mai
n/java/Application.java
/home/nobody/continuum-maven/working-directory/66/target/test-branch/src/tes
t/java/Test.java
> failed to open trace file: [Errno 13] Permission denied: '/.bzr.log'
> [ERROR] exceptions.ImportError: No module named
elementtree.ElementTreeBazaar version: Unknown
> Working directory:
/home/nobody/continuum-maven/working-directory/66/target/test-branch
> failed to open trace file: [Errno 13] Permission denied: '/.bzr.log'
> [ERROR] exceptions.ImportError: No module named
elementtree.ElementTree[surefire] Tests run: 1, Failures: 0, Errors: 1, Time
elapsed: 0.664 sec <<<<<<<< FAILURE !!
> [surefire] Running
org.apache.maven.scm.provider.bazaar.command.changelog.BazaarChangeLogComman
dTckTest
> EXECUTING: bzr init
> failed to open trace file: [Errno 13] Permission denied: '/.bzr.log'
> [ERROR] exceptions.ImportError: No module named
elementtree.ElementTreeBazaar version: Unknown
> Working directory:
/home/nobody/continuum-maven/working-directory/66/target/test-branch
> failed to open trace file: [Errno 13] Permission denied: '/.bzr.log'
> [ERROR] exceptions.ImportError: No module named
elementtree.ElementTreeEXECUTING: bzr add
/home/nobody/continuum-maven/working-directory/66/target/test-branch/pom.xml
/home/nobody/continuum-maven/working-directory/66/target/test-branch/readme.
txt
/home/nobody/continuum-maven/working-directory/66/target/test-branch/src/mai
n/java/Application.java
/home/nobody/continuum-maven/working-directory/66/target/test-branch/src/tes
t/java/Test.java
> failed to open trace file: [Errno 13] Permission denied: '/.bzr.log'
> [ERROR] exceptions.ImportError: No module named
elementtree.ElementTreeBazaar version: Unknown
> Working directory:
/home/nobody/continuum-maven/working-directory/66/target/test-branch
> failed to open trace file: [Errno 13] Permission denied: '/.bzr.log'
> [ERROR] exceptions.ImportError: No module named
elementtree.ElementTree[surefire] Tests run: 1, Failures: 0, Errors: 1, Time
elapsed: 0.562 sec <<<<<<<< FAILURE !!
>
[INFO] ---------------------------------------------------------------------
-------
> [ERROR] BUILD ERROR
>
[INFO] ---------------------------------------------------------------------
-------
> [INFO] There are test failures.
>
[INFO] ---------------------------------------------------------------------
-------
> [INFO] For more information, run Maven with the -e switch
>
[INFO] ---------------------------------------------------------------------
-------
> [INFO] Total time: 9 seconds
> [INFO] Finished at: Thu Mar 23 22:50:20 PST 2006
> [INFO] Final Memory: 8M/125M
>
[INFO] ---------------------------------------------------------------------
-------
>
>
****************************************************************************
>
>
Re: [continuum] BUILD FAILURE: Maven SCM Bazaar Provider
Posted by Brett Porter <br...@apache.org>.
That's probaly it, thanks.
- Brett
Torbjørn Smørgrav wrote:
> Have you tested Bazaar manually?
>
> Form the test log it clear that every command fails
> due to an import error in Bazaar.
>
> Check if the cElementTree module is installed properly by running:
> $ python -c "import cElementTree"
>
> Torbjørn
>
>
>
> -----Original Message-----
> From: Brett Porter [mailto:brett@apache.org]
> Sent: 24. mars 2006 08:03
> To: scm-dev@maven.apache.org
> Subject: Re: [continuum] BUILD FAILURE: Maven SCM Bazaar Provider
>
>
> Any ideas on this? bzr 0.7 seems to be properly installed now. Can the
> output of the tests be improved?
>
> - Brett
>
> Continuum Build Server wrote:
>> Online report :
> http://ci.codehaus.org/continuum-maven/servlet/continuum/target/ProjectBuild
> .vm/view/ProjectBuild/id/66/buildId/714
>> Build statistics:
>> State: Failed
>> Previous State: Failed
>> Started at: Thu, 23 Mar 2006 22:50:10 -0800
>> Finished at: Thu, 23 Mar 2006 22:50:20 -0800
>> Total time: 10s
>> Build Trigger: Forced
>> Exit code: 1
>> Building machine hostname: cheddar.simulalabs.com
>> Operating system : Linux(unknown)
>> Java version : 1.5.0_03(Sun Microsystems Inc.)
>>
>> Changes
>> No files changed
>>
>>
> ****************************************************************************
>> Output:
>>
> ****************************************************************************
>> [INFO] Scanning for projects...
>>
> [INFO] ---------------------------------------------------------------------
> -------
>> [INFO] Building Maven SCM Bazaar Provider
>> [INFO] task-segment: [clean, install]
>>
> [INFO] ---------------------------------------------------------------------
> -------
>> [INFO] [clean:clean]
>> [INFO] Deleting directory
> /home/nobody/continuum-maven/working-directory/66/target
>> [INFO] Deleting directory
> /home/nobody/continuum-maven/working-directory/66/target/classes
>> [INFO] Deleting directory
> /home/nobody/continuum-maven/working-directory/66/target/test-classes
>> [INFO] [resources:resources]
>> [INFO] Using default encoding to copy filtered resources.
>> [INFO] [compiler:compile]
>> Compiling 19 source files to
> /home/nobody/continuum-maven/working-directory/66/target/classes
>> [INFO] [resources:testResources]
>> [INFO] Using default encoding to copy filtered resources.
>> [INFO] [compiler:testCompile]
>> Compiling 7 source files to
> /home/nobody/continuum-maven/working-directory/66/target/test-classes
>> [INFO] [surefire:test]
>> [INFO] Setting reports dir:
> /home/nobody/continuum-maven/working-directory/66/target/surefire-reports
>> -------------------------------------------------------
>> T E S T S
>> -------------------------------------------------------
>> [surefire] Running
> org.apache.maven.scm.provider.bazaar.command.checkin.BazaarCheckInCommandTes
> t
>> EXECUTING: bzr init
>> failed to open trace file: [Errno 13] Permission denied: '/.bzr.log'
>> [ERROR] exceptions.ImportError: No module named
> elementtree.ElementTreeBazaar version: Unknown
>> Working directory:
> /home/nobody/continuum-maven/working-directory/66/target/test-branch
>> failed to open trace file: [Errno 13] Permission denied: '/.bzr.log'
>> [ERROR] exceptions.ImportError: No module named
> elementtree.ElementTreeEXECUTING: bzr add
> /home/nobody/continuum-maven/working-directory/66/target/test-branch/pom.xml
> /home/nobody/continuum-maven/working-directory/66/target/test-branch/readme.
> txt
> /home/nobody/continuum-maven/working-directory/66/target/test-branch/src/mai
> n/java/Application.java
> /home/nobody/continuum-maven/working-directory/66/target/test-branch/src/tes
> t/java/Test.java
>> failed to open trace file: [Errno 13] Permission denied: '/.bzr.log'
>> [ERROR] exceptions.ImportError: No module named
> elementtree.ElementTreeBazaar version: Unknown
>> Working directory:
> /home/nobody/continuum-maven/working-directory/66/target/test-branch
>> failed to open trace file: [Errno 13] Permission denied: '/.bzr.log'
>> [ERROR] exceptions.ImportError: No module named
> elementtree.ElementTreeEXECUTING: bzr init
>> failed to open trace file: [Errno 13] Permission denied: '/.bzr.log'
>> [ERROR] exceptions.ImportError: No module named
> elementtree.ElementTreeBazaar version: Unknown
>> Working directory:
> /home/nobody/continuum-maven/working-directory/66/target/test-branch
>> failed to open trace file: [Errno 13] Permission denied: '/.bzr.log'
>> [ERROR] exceptions.ImportError: No module named
> elementtree.ElementTreeEXECUTING: bzr add
> /home/nobody/continuum-maven/working-directory/66/target/test-branch/pom.xml
> /home/nobody/continuum-maven/working-directory/66/target/test-branch/readme.
> txt
> /home/nobody/continuum-maven/working-directory/66/target/test-branch/src/mai
> n/java/Application.java
> /home/nobody/continuum-maven/working-directory/66/target/test-branch/src/tes
> t/java/Test.java
>> failed to open trace file: [Errno 13] Permission denied: '/.bzr.log'
>> [ERROR] exceptions.ImportError: No module named
> elementtree.ElementTreeBazaar version: Unknown
>> Working directory:
> /home/nobody/continuum-maven/working-directory/66/target/test-branch
>> failed to open trace file: [Errno 13] Permission denied: '/.bzr.log'
>> [ERROR] exceptions.ImportError: No module named
> elementtree.ElementTree[surefire] Tests run: 2, Failures: 0, Errors: 2, Time
> elapsed: 1.622 sec <<<<<<<< FAILURE !!
>> [surefire] Running
> org.apache.maven.scm.provider.bazaar.command.checkout.BazaarCheckOutCommandT
> est
>> EXECUTING: bzr init
>> failed to open trace file: [Errno 13] Permission denied: '/.bzr.log'
>> [ERROR] exceptions.ImportError: No module named
> elementtree.ElementTreeBazaar version: Unknown
>> Working directory:
> /home/nobody/continuum-maven/working-directory/66/target/test-branch
>> failed to open trace file: [Errno 13] Permission denied: '/.bzr.log'
>> [ERROR] exceptions.ImportError: No module named
> elementtree.ElementTreeEXECUTING: bzr add
> /home/nobody/continuum-maven/working-directory/66/target/test-branch/pom.xml
> /home/nobody/continuum-maven/working-directory/66/target/test-branch/readme.
> txt
> /home/nobody/continuum-maven/working-directory/66/target/test-branch/src/mai
> n/java/Application.java
> /home/nobody/continuum-maven/working-directory/66/target/test-branch/src/tes
> t/java/Test.java
>> failed to open trace file: [Errno 13] Permission denied: '/.bzr.log'
>> [ERROR] exceptions.ImportError: No module named
> elementtree.ElementTreeBazaar version: Unknown
>> Working directory:
> /home/nobody/continuum-maven/working-directory/66/target/test-branch
>> failed to open trace file: [Errno 13] Permission denied: '/.bzr.log'
>> [ERROR] exceptions.ImportError: No module named
> elementtree.ElementTree[surefire] Tests run: 1, Failures: 0, Errors: 1, Time
> elapsed: 0.641 sec <<<<<<<< FAILURE !!
>> [surefire] Running
> org.apache.maven.scm.provider.bazaar.command.status.BazaarStatusCommandTest
>> EXECUTING: bzr init
>> failed to open trace file: [Errno 13] Permission denied: '/.bzr.log'
>> [ERROR] exceptions.ImportError: No module named
> elementtree.ElementTreeBazaar version: Unknown
>> Working directory:
> /home/nobody/continuum-maven/working-directory/66/target/test-branch
>> failed to open trace file: [Errno 13] Permission denied: '/.bzr.log'
>> [ERROR] exceptions.ImportError: No module named
> elementtree.ElementTreeEXECUTING: bzr add
> /home/nobody/continuum-maven/working-directory/66/target/test-branch/pom.xml
> /home/nobody/continuum-maven/working-directory/66/target/test-branch/readme.
> txt
> /home/nobody/continuum-maven/working-directory/66/target/test-branch/src/mai
> n/java/Application.java
> /home/nobody/continuum-maven/working-directory/66/target/test-branch/src/tes
> t/java/Test.java
>> failed to open trace file: [Errno 13] Permission denied: '/.bzr.log'
>> [ERROR] exceptions.ImportError: No module named
> elementtree.ElementTreeBazaar version: Unknown
>> Working directory:
> /home/nobody/continuum-maven/working-directory/66/target/test-branch
>> failed to open trace file: [Errno 13] Permission denied: '/.bzr.log'
>> [ERROR] exceptions.ImportError: No module named
> elementtree.ElementTree[surefire] Tests run: 1, Failures: 0, Errors: 1, Time
> elapsed: 0.606 sec <<<<<<<< FAILURE !!
>> [surefire] Running
> org.apache.maven.scm.provider.bazaar.command.diff.BazaarDiffCommandTest
>> EXECUTING: bzr init
>> failed to open trace file: [Errno 13] Permission denied: '/.bzr.log'
>> [ERROR] exceptions.ImportError: No module named
> elementtree.ElementTreeBazaar version: Unknown
>> Working directory:
> /home/nobody/continuum-maven/working-directory/66/target/test-branch
>> failed to open trace file: [Errno 13] Permission denied: '/.bzr.log'
>> [ERROR] exceptions.ImportError: No module named
> elementtree.ElementTreeEXECUTING: bzr add
> /home/nobody/continuum-maven/working-directory/66/target/test-branch/pom.xml
> /home/nobody/continuum-maven/working-directory/66/target/test-branch/readme.
> txt
> /home/nobody/continuum-maven/working-directory/66/target/test-branch/src/mai
> n/java/Application.java
> /home/nobody/continuum-maven/working-directory/66/target/test-branch/src/tes
> t/java/Test.java
>> failed to open trace file: [Errno 13] Permission denied: '/.bzr.log'
>> [ERROR] exceptions.ImportError: No module named
> elementtree.ElementTreeBazaar version: Unknown
>> Working directory:
> /home/nobody/continuum-maven/working-directory/66/target/test-branch
>> failed to open trace file: [Errno 13] Permission denied: '/.bzr.log'
>> [ERROR] exceptions.ImportError: No module named
> elementtree.ElementTree[surefire] Tests run: 1, Failures: 0, Errors: 1, Time
> elapsed: 0.599 sec <<<<<<<< FAILURE !!
>> [surefire] Running
> org.apache.maven.scm.provider.bazaar.command.update.BazaarUpdateCommandTest
>> EXECUTING: bzr init
>> failed to open trace file: [Errno 13] Permission denied: '/.bzr.log'
>> [ERROR] exceptions.ImportError: No module named
> elementtree.ElementTreeBazaar version: Unknown
>> Working directory:
> /home/nobody/continuum-maven/working-directory/66/target/test-branch
>> failed to open trace file: [Errno 13] Permission denied: '/.bzr.log'
>> [ERROR] exceptions.ImportError: No module named
> elementtree.ElementTreeEXECUTING: bzr add
> /home/nobody/continuum-maven/working-directory/66/target/test-branch/pom.xml
> /home/nobody/continuum-maven/working-directory/66/target/test-branch/readme.
> txt
> /home/nobody/continuum-maven/working-directory/66/target/test-branch/src/mai
> n/java/Application.java
> /home/nobody/continuum-maven/working-directory/66/target/test-branch/src/tes
> t/java/Test.java
>> failed to open trace file: [Errno 13] Permission denied: '/.bzr.log'
>> [ERROR] exceptions.ImportError: No module named
> elementtree.ElementTreeBazaar version: Unknown
>> Working directory:
> /home/nobody/continuum-maven/working-directory/66/target/test-branch
>> failed to open trace file: [Errno 13] Permission denied: '/.bzr.log'
>> [ERROR] exceptions.ImportError: No module named
> elementtree.ElementTree[surefire] Tests run: 1, Failures: 0, Errors: 1, Time
> elapsed: 0.664 sec <<<<<<<< FAILURE !!
>> [surefire] Running
> org.apache.maven.scm.provider.bazaar.command.changelog.BazaarChangeLogComman
> dTckTest
>> EXECUTING: bzr init
>> failed to open trace file: [Errno 13] Permission denied: '/.bzr.log'
>> [ERROR] exceptions.ImportError: No module named
> elementtree.ElementTreeBazaar version: Unknown
>> Working directory:
> /home/nobody/continuum-maven/working-directory/66/target/test-branch
>> failed to open trace file: [Errno 13] Permission denied: '/.bzr.log'
>> [ERROR] exceptions.ImportError: No module named
> elementtree.ElementTreeEXECUTING: bzr add
> /home/nobody/continuum-maven/working-directory/66/target/test-branch/pom.xml
> /home/nobody/continuum-maven/working-directory/66/target/test-branch/readme.
> txt
> /home/nobody/continuum-maven/working-directory/66/target/test-branch/src/mai
> n/java/Application.java
> /home/nobody/continuum-maven/working-directory/66/target/test-branch/src/tes
> t/java/Test.java
>> failed to open trace file: [Errno 13] Permission denied: '/.bzr.log'
>> [ERROR] exceptions.ImportError: No module named
> elementtree.ElementTreeBazaar version: Unknown
>> Working directory:
> /home/nobody/continuum-maven/working-directory/66/target/test-branch
>> failed to open trace file: [Errno 13] Permission denied: '/.bzr.log'
>> [ERROR] exceptions.ImportError: No module named
> elementtree.ElementTree[surefire] Tests run: 1, Failures: 0, Errors: 1, Time
> elapsed: 0.562 sec <<<<<<<< FAILURE !!
> [INFO] ---------------------------------------------------------------------
> -------
>> [ERROR] BUILD ERROR
>>
> [INFO] ---------------------------------------------------------------------
> -------
>> [INFO] There are test failures.
>>
> [INFO] ---------------------------------------------------------------------
> -------
>> [INFO] For more information, run Maven with the -e switch
>>
> [INFO] ---------------------------------------------------------------------
> -------
>> [INFO] Total time: 9 seconds
>> [INFO] Finished at: Thu Mar 23 22:50:20 PST 2006
>> [INFO] Final Memory: 8M/125M
>>
> [INFO] ---------------------------------------------------------------------
> -------
>>
> ****************************************************************************
>>
>
RE: [continuum] BUILD FAILURE: Maven SCM Bazaar Provider
Posted by Torbjørn Smørgrav <ts...@stavanger.oilfield.slb.com>.
Have you tested Bazaar manually?
Form the test log it clear that every command fails
due to an import error in Bazaar.
Check if the cElementTree module is installed properly by running:
$ python -c "import cElementTree"
Torbjørn
-----Original Message-----
From: Brett Porter [mailto:brett@apache.org]
Sent: 24. mars 2006 08:03
To: scm-dev@maven.apache.org
Subject: Re: [continuum] BUILD FAILURE: Maven SCM Bazaar Provider
Any ideas on this? bzr 0.7 seems to be properly installed now. Can the
output of the tests be improved?
- Brett
Continuum Build Server wrote:
> Online report :
http://ci.codehaus.org/continuum-maven/servlet/continuum/target/ProjectBuild
.vm/view/ProjectBuild/id/66/buildId/714
> Build statistics:
> State: Failed
> Previous State: Failed
> Started at: Thu, 23 Mar 2006 22:50:10 -0800
> Finished at: Thu, 23 Mar 2006 22:50:20 -0800
> Total time: 10s
> Build Trigger: Forced
> Exit code: 1
> Building machine hostname: cheddar.simulalabs.com
> Operating system : Linux(unknown)
> Java version : 1.5.0_03(Sun Microsystems Inc.)
>
> Changes
> No files changed
>
>
****************************************************************************
> Output:
>
****************************************************************************
> [INFO] Scanning for projects...
>
[INFO] ---------------------------------------------------------------------
-------
> [INFO] Building Maven SCM Bazaar Provider
> [INFO] task-segment: [clean, install]
>
[INFO] ---------------------------------------------------------------------
-------
> [INFO] [clean:clean]
> [INFO] Deleting directory
/home/nobody/continuum-maven/working-directory/66/target
> [INFO] Deleting directory
/home/nobody/continuum-maven/working-directory/66/target/classes
> [INFO] Deleting directory
/home/nobody/continuum-maven/working-directory/66/target/test-classes
> [INFO] [resources:resources]
> [INFO] Using default encoding to copy filtered resources.
> [INFO] [compiler:compile]
> Compiling 19 source files to
/home/nobody/continuum-maven/working-directory/66/target/classes
> [INFO] [resources:testResources]
> [INFO] Using default encoding to copy filtered resources.
> [INFO] [compiler:testCompile]
> Compiling 7 source files to
/home/nobody/continuum-maven/working-directory/66/target/test-classes
> [INFO] [surefire:test]
> [INFO] Setting reports dir:
/home/nobody/continuum-maven/working-directory/66/target/surefire-reports
>
> -------------------------------------------------------
> T E S T S
> -------------------------------------------------------
> [surefire] Running
org.apache.maven.scm.provider.bazaar.command.checkin.BazaarCheckInCommandTes
t
> EXECUTING: bzr init
> failed to open trace file: [Errno 13] Permission denied: '/.bzr.log'
> [ERROR] exceptions.ImportError: No module named
elementtree.ElementTreeBazaar version: Unknown
> Working directory:
/home/nobody/continuum-maven/working-directory/66/target/test-branch
> failed to open trace file: [Errno 13] Permission denied: '/.bzr.log'
> [ERROR] exceptions.ImportError: No module named
elementtree.ElementTreeEXECUTING: bzr add
/home/nobody/continuum-maven/working-directory/66/target/test-branch/pom.xml
/home/nobody/continuum-maven/working-directory/66/target/test-branch/readme.
txt
/home/nobody/continuum-maven/working-directory/66/target/test-branch/src/mai
n/java/Application.java
/home/nobody/continuum-maven/working-directory/66/target/test-branch/src/tes
t/java/Test.java
> failed to open trace file: [Errno 13] Permission denied: '/.bzr.log'
> [ERROR] exceptions.ImportError: No module named
elementtree.ElementTreeBazaar version: Unknown
> Working directory:
/home/nobody/continuum-maven/working-directory/66/target/test-branch
> failed to open trace file: [Errno 13] Permission denied: '/.bzr.log'
> [ERROR] exceptions.ImportError: No module named
elementtree.ElementTreeEXECUTING: bzr init
> failed to open trace file: [Errno 13] Permission denied: '/.bzr.log'
> [ERROR] exceptions.ImportError: No module named
elementtree.ElementTreeBazaar version: Unknown
> Working directory:
/home/nobody/continuum-maven/working-directory/66/target/test-branch
> failed to open trace file: [Errno 13] Permission denied: '/.bzr.log'
> [ERROR] exceptions.ImportError: No module named
elementtree.ElementTreeEXECUTING: bzr add
/home/nobody/continuum-maven/working-directory/66/target/test-branch/pom.xml
/home/nobody/continuum-maven/working-directory/66/target/test-branch/readme.
txt
/home/nobody/continuum-maven/working-directory/66/target/test-branch/src/mai
n/java/Application.java
/home/nobody/continuum-maven/working-directory/66/target/test-branch/src/tes
t/java/Test.java
> failed to open trace file: [Errno 13] Permission denied: '/.bzr.log'
> [ERROR] exceptions.ImportError: No module named
elementtree.ElementTreeBazaar version: Unknown
> Working directory:
/home/nobody/continuum-maven/working-directory/66/target/test-branch
> failed to open trace file: [Errno 13] Permission denied: '/.bzr.log'
> [ERROR] exceptions.ImportError: No module named
elementtree.ElementTree[surefire] Tests run: 2, Failures: 0, Errors: 2, Time
elapsed: 1.622 sec <<<<<<<< FAILURE !!
> [surefire] Running
org.apache.maven.scm.provider.bazaar.command.checkout.BazaarCheckOutCommandT
est
> EXECUTING: bzr init
> failed to open trace file: [Errno 13] Permission denied: '/.bzr.log'
> [ERROR] exceptions.ImportError: No module named
elementtree.ElementTreeBazaar version: Unknown
> Working directory:
/home/nobody/continuum-maven/working-directory/66/target/test-branch
> failed to open trace file: [Errno 13] Permission denied: '/.bzr.log'
> [ERROR] exceptions.ImportError: No module named
elementtree.ElementTreeEXECUTING: bzr add
/home/nobody/continuum-maven/working-directory/66/target/test-branch/pom.xml
/home/nobody/continuum-maven/working-directory/66/target/test-branch/readme.
txt
/home/nobody/continuum-maven/working-directory/66/target/test-branch/src/mai
n/java/Application.java
/home/nobody/continuum-maven/working-directory/66/target/test-branch/src/tes
t/java/Test.java
> failed to open trace file: [Errno 13] Permission denied: '/.bzr.log'
> [ERROR] exceptions.ImportError: No module named
elementtree.ElementTreeBazaar version: Unknown
> Working directory:
/home/nobody/continuum-maven/working-directory/66/target/test-branch
> failed to open trace file: [Errno 13] Permission denied: '/.bzr.log'
> [ERROR] exceptions.ImportError: No module named
elementtree.ElementTree[surefire] Tests run: 1, Failures: 0, Errors: 1, Time
elapsed: 0.641 sec <<<<<<<< FAILURE !!
> [surefire] Running
org.apache.maven.scm.provider.bazaar.command.status.BazaarStatusCommandTest
> EXECUTING: bzr init
> failed to open trace file: [Errno 13] Permission denied: '/.bzr.log'
> [ERROR] exceptions.ImportError: No module named
elementtree.ElementTreeBazaar version: Unknown
> Working directory:
/home/nobody/continuum-maven/working-directory/66/target/test-branch
> failed to open trace file: [Errno 13] Permission denied: '/.bzr.log'
> [ERROR] exceptions.ImportError: No module named
elementtree.ElementTreeEXECUTING: bzr add
/home/nobody/continuum-maven/working-directory/66/target/test-branch/pom.xml
/home/nobody/continuum-maven/working-directory/66/target/test-branch/readme.
txt
/home/nobody/continuum-maven/working-directory/66/target/test-branch/src/mai
n/java/Application.java
/home/nobody/continuum-maven/working-directory/66/target/test-branch/src/tes
t/java/Test.java
> failed to open trace file: [Errno 13] Permission denied: '/.bzr.log'
> [ERROR] exceptions.ImportError: No module named
elementtree.ElementTreeBazaar version: Unknown
> Working directory:
/home/nobody/continuum-maven/working-directory/66/target/test-branch
> failed to open trace file: [Errno 13] Permission denied: '/.bzr.log'
> [ERROR] exceptions.ImportError: No module named
elementtree.ElementTree[surefire] Tests run: 1, Failures: 0, Errors: 1, Time
elapsed: 0.606 sec <<<<<<<< FAILURE !!
> [surefire] Running
org.apache.maven.scm.provider.bazaar.command.diff.BazaarDiffCommandTest
> EXECUTING: bzr init
> failed to open trace file: [Errno 13] Permission denied: '/.bzr.log'
> [ERROR] exceptions.ImportError: No module named
elementtree.ElementTreeBazaar version: Unknown
> Working directory:
/home/nobody/continuum-maven/working-directory/66/target/test-branch
> failed to open trace file: [Errno 13] Permission denied: '/.bzr.log'
> [ERROR] exceptions.ImportError: No module named
elementtree.ElementTreeEXECUTING: bzr add
/home/nobody/continuum-maven/working-directory/66/target/test-branch/pom.xml
/home/nobody/continuum-maven/working-directory/66/target/test-branch/readme.
txt
/home/nobody/continuum-maven/working-directory/66/target/test-branch/src/mai
n/java/Application.java
/home/nobody/continuum-maven/working-directory/66/target/test-branch/src/tes
t/java/Test.java
> failed to open trace file: [Errno 13] Permission denied: '/.bzr.log'
> [ERROR] exceptions.ImportError: No module named
elementtree.ElementTreeBazaar version: Unknown
> Working directory:
/home/nobody/continuum-maven/working-directory/66/target/test-branch
> failed to open trace file: [Errno 13] Permission denied: '/.bzr.log'
> [ERROR] exceptions.ImportError: No module named
elementtree.ElementTree[surefire] Tests run: 1, Failures: 0, Errors: 1, Time
elapsed: 0.599 sec <<<<<<<< FAILURE !!
> [surefire] Running
org.apache.maven.scm.provider.bazaar.command.update.BazaarUpdateCommandTest
> EXECUTING: bzr init
> failed to open trace file: [Errno 13] Permission denied: '/.bzr.log'
> [ERROR] exceptions.ImportError: No module named
elementtree.ElementTreeBazaar version: Unknown
> Working directory:
/home/nobody/continuum-maven/working-directory/66/target/test-branch
> failed to open trace file: [Errno 13] Permission denied: '/.bzr.log'
> [ERROR] exceptions.ImportError: No module named
elementtree.ElementTreeEXECUTING: bzr add
/home/nobody/continuum-maven/working-directory/66/target/test-branch/pom.xml
/home/nobody/continuum-maven/working-directory/66/target/test-branch/readme.
txt
/home/nobody/continuum-maven/working-directory/66/target/test-branch/src/mai
n/java/Application.java
/home/nobody/continuum-maven/working-directory/66/target/test-branch/src/tes
t/java/Test.java
> failed to open trace file: [Errno 13] Permission denied: '/.bzr.log'
> [ERROR] exceptions.ImportError: No module named
elementtree.ElementTreeBazaar version: Unknown
> Working directory:
/home/nobody/continuum-maven/working-directory/66/target/test-branch
> failed to open trace file: [Errno 13] Permission denied: '/.bzr.log'
> [ERROR] exceptions.ImportError: No module named
elementtree.ElementTree[surefire] Tests run: 1, Failures: 0, Errors: 1, Time
elapsed: 0.664 sec <<<<<<<< FAILURE !!
> [surefire] Running
org.apache.maven.scm.provider.bazaar.command.changelog.BazaarChangeLogComman
dTckTest
> EXECUTING: bzr init
> failed to open trace file: [Errno 13] Permission denied: '/.bzr.log'
> [ERROR] exceptions.ImportError: No module named
elementtree.ElementTreeBazaar version: Unknown
> Working directory:
/home/nobody/continuum-maven/working-directory/66/target/test-branch
> failed to open trace file: [Errno 13] Permission denied: '/.bzr.log'
> [ERROR] exceptions.ImportError: No module named
elementtree.ElementTreeEXECUTING: bzr add
/home/nobody/continuum-maven/working-directory/66/target/test-branch/pom.xml
/home/nobody/continuum-maven/working-directory/66/target/test-branch/readme.
txt
/home/nobody/continuum-maven/working-directory/66/target/test-branch/src/mai
n/java/Application.java
/home/nobody/continuum-maven/working-directory/66/target/test-branch/src/tes
t/java/Test.java
> failed to open trace file: [Errno 13] Permission denied: '/.bzr.log'
> [ERROR] exceptions.ImportError: No module named
elementtree.ElementTreeBazaar version: Unknown
> Working directory:
/home/nobody/continuum-maven/working-directory/66/target/test-branch
> failed to open trace file: [Errno 13] Permission denied: '/.bzr.log'
> [ERROR] exceptions.ImportError: No module named
elementtree.ElementTree[surefire] Tests run: 1, Failures: 0, Errors: 1, Time
elapsed: 0.562 sec <<<<<<<< FAILURE !!
>
[INFO] ---------------------------------------------------------------------
-------
> [ERROR] BUILD ERROR
>
[INFO] ---------------------------------------------------------------------
-------
> [INFO] There are test failures.
>
[INFO] ---------------------------------------------------------------------
-------
> [INFO] For more information, run Maven with the -e switch
>
[INFO] ---------------------------------------------------------------------
-------
> [INFO] Total time: 9 seconds
> [INFO] Finished at: Thu Mar 23 22:50:20 PST 2006
> [INFO] Final Memory: 8M/125M
>
[INFO] ---------------------------------------------------------------------
-------
>
>
****************************************************************************
>
>