You are viewing a plain text version of this content. The canonical link for it is here.
Posted to builds@cassandra.apache.org by Apache Jenkins Server <je...@builds.apache.org> on 2021/04/26 22:13:51 UTC

Build complete: Cassandra-3.11 #154 [UNSTABLE] 354b87a0f6a9d7da02645627ae4d21feda1286e5

-------------------------------------------------------------------------------
Build Cassandra-3.11 #154 Still Unstable
URL: https://ci-cassandra.apache.org/job/Cassandra-3.11/154/
-------------------------------------------------------------------------------
Changes:
[Brandon Williams] Update README links


-------------------------------------------------------------------------------
Failed Tests:
38 tests failed.
FAILED:  cqlshlib.python2.jdk8.no_cython.test.test_cqlsh_completion.TestCqlshCompletion.test_complete_in_create_columnfamily
FAILED:  cqlshlib.python2.jdk8.no_cython.test.test_cqlsh_completion.TestCqlshCompletion.test_complete_in_create_table
FAILED:  cqlshlib.python2.jdk8.no_cython.test.test_cqlsh_completion.TestCqlshCompletion.test_complete_in_delete
FAILED:  cqlshlib.python2.jdk8.no_cython.test.test_cqlsh_completion.TestCqlshCompletion.test_complete_in_describe
FAILED:  cqlshlib.python2.jdk8.no_cython.test.test_cqlsh_completion.TestCqlshCompletion.test_complete_in_insert
FAILED:  cqlshlib.python2.jdk8.no_cython.test.test_cqlsh_completion.TestCqlshCompletion.test_complete_in_update
FAILED:  dtest-upgrade.upgrade_tests.bootstrap_upgrade_test.TestBootstrap.test_consistent_range_movement_false_with_replica_down_should_succeed
FAILED:  dtest-upgrade.upgrade_tests.upgrade_through_versions_test.TestUpgrade_current_2_1_x_To_indev_3_11_x.test_rolling_upgrade
FAILED:  dtest-upgrade.upgrade_tests.upgrade_through_versions_test.TestUpgrade_current_2_1_x_To_indev_3_11_x.test_rolling_upgrade_with_internode_ssl
FAILED:  dtest.secondary_indexes_test.TestSecondaryIndexes.test_6924_dropping_ks
FAILED:  dtest.thrift_hsha_test.TestThriftHSHA.test_6285
FAILED:  dtest-novnode.secondary_indexes_test.TestSecondaryIndexes.test_6924_dropping_ks
FAILED:  dtest-upgrade.upgrade_tests.upgrade_through_versions_test.TestUpgrade_current_2_1_x_To_indev_3_11_x.test_parallel_upgrade
FAILED:  dtest-upgrade.upgrade_internal_auth_test.TestAuthUpgrade.test_upgrade_legacy_table
FAILED:  org.apache.cassandra.concurrent.LongSharedExecutorPoolTest.testPromptnessOfExecution
FAILED:  org.apache.cassandra.concurrent.LongSharedExecutorPoolTest.testPromptnessOfExecution
FAILED:  org.apache.cassandra.utils.memory.LongBufferPoolTest.testAllocate
FAILED:  org.apache.cassandra.utils.memory.LongBufferPoolTest.testAllocate
FAILED:  org.apache.cassandra.utils.memory.LongBufferPoolTest.testAllocate
FAILED:  org.apache.cassandra.utils.memory.LongBufferPoolTest.testAllocate
FAILED:  dtest-offheap.counter_test.TestCounters.test_13691
FAILED:  dtest-offheap.counter_test.TestCounters.test_13691
FAILED:  dtest-upgrade.upgrade_tests.thrift_upgrade_test.TestUpgradeSuperColumnsThrough.test_dense_supercolumn
FAILED:  dtest-upgrade.upgrade_tests.thrift_upgrade_test.TestUpgradeSuperColumnsThrough.test_sparse_supercolumn
FAILED:  cqlshlib.python2.jdk8.no_cython.test.test_cqlsh_output.TestCqlshOutput.test_boolean_output
FAILED:  cqlshlib.python2.jdk8.no_cython.test.test_cqlsh_output.TestCqlshOutput.test_columnless_key_output
FAILED:  cqlshlib.python2.jdk8.no_cython.test.test_cqlsh_output.TestCqlshOutput.test_count_output
FAILED:  cqlshlib.python2.jdk8.no_cython.test.test_cqlsh_output.TestCqlshOutput.test_null_output
FAILED:  cqlshlib.python2.jdk8.no_cython.test.test_cqlsh_output.TestCqlshOutput.test_numeric_output
FAILED:  cqlshlib.python2.jdk8.no_cython.test.test_cqlsh_output.TestCqlshOutput.test_static_cf_output
FAILED:  cqlshlib.python2.jdk8.no_cython.test.test_cqlsh_output.TestCqlshOutput.test_string_output_ascii
FAILED:  cqlshlib.python2.jdk8.cython.test.test_cqlsh_output.TestCqlshOutput.test_boolean_output
FAILED:  cqlshlib.python2.jdk8.cython.test.test_cqlsh_output.TestCqlshOutput.test_columnless_key_output
FAILED:  cqlshlib.python2.jdk8.cython.test.test_cqlsh_output.TestCqlshOutput.test_count_output
FAILED:  cqlshlib.python2.jdk8.cython.test.test_cqlsh_output.TestCqlshOutput.test_null_output
FAILED:  cqlshlib.python2.jdk8.cython.test.test_cqlsh_output.TestCqlshOutput.test_numeric_output
FAILED:  cqlshlib.python2.jdk8.cython.test.test_cqlsh_output.TestCqlshOutput.test_static_cf_output
FAILED:  cqlshlib.python2.jdk8.cython.test.test_cqlsh_output.TestCqlshOutput.test_string_output_ascii

-------------------------------------------------------------------------------
For complete test report and logs see https://nightlies.apache.org/cassandra/Cassandra-3.11/154/