You are viewing a plain text version of this content. The canonical link for it is here.
Posted to dev@openwebbeans.apache.org by Apache Jenkins Server <je...@builds.apache.org> on 2026/07/28 01:54:47 UTC

Jenkins build is still unstable: OpenWebBeans » OpenWebBeans CI (main) #128

See <https://ci-builds.apache.org/job/OpenWebBeans/job/OpenWebBeans%20CI%20(main)/128/display/redirect?page=changes>


Jenkins build is still unstable: OpenWebBeans » OpenWebBeans CI (main) #136

Posted by Apache Jenkins Server <je...@builds.apache.org>.
See <https://ci-builds.apache.org/job/OpenWebBeans/job/OpenWebBeans%20CI%20(main)/136/display/redirect?page=changes>


Jenkins build is unstable: OpenWebBeans » OpenWebBeans CI (main) #135

Posted by Apache Jenkins Server <je...@builds.apache.org>.
See <https://ci-builds.apache.org/job/OpenWebBeans/job/OpenWebBeans%20CI%20(main)/135/display/redirect>


Build failed in Jenkins: OpenWebBeans » OpenWebBeans CI (main) #134

Posted by Apache Jenkins Server <je...@builds.apache.org>.
See <https://ci-builds.apache.org/job/OpenWebBeans/job/OpenWebBeans%20CI%20(main)/134/display/redirect?page=changes>

Changes:

[Mark Struberg] update to xbean-5.0.0 before the owb release

[Mark Struberg] OWB-1472 update to apache-parent-39

[Mark Struberg] OWB-1460 upgrade tomcat to latest 10.x

[Mark Struberg] [maven-release-plugin] prepare release openwebbeans-4.1.1

[Mark Struberg] [maven-release-plugin] prepare for next development iteration


------------------------------------------
[...truncated 6.35 KiB...]
[INFO] ----------------< org.apache.openwebbeans:openwebbeans >----------------
[INFO] Building Apache OpenWebBeans 4.1.2-SNAPSHOT                       [1/31]
[INFO]   from pom.xml
[INFO] --------------------------------[ pom ]---------------------------------
[INFO] 
[INFO] --- clean:3.5.0:clean (default-clean) @ openwebbeans ---
[INFO] 
[INFO] --- enforcer:3.6.2:enforce (enforce-maven-version) @ openwebbeans ---
[INFO] Rule 0: org.apache.maven.enforcer.rules.version.RequireMavenVersion passed
[INFO] 
[INFO] --- enforcer:3.6.2:enforce (enforce-java-version) @ openwebbeans ---
[INFO] Rule 0: org.apache.maven.enforcer.rules.version.RequireJavaVersion passed
[INFO] 
[INFO] --- remote-resources:3.2.0:process (default) @ openwebbeans ---
[INFO] Preparing remote bundle org.apache:apache-jar-resource-bundle:1.4
[INFO] Copying 3 resources from 1 bundle.
[INFO] 
[INFO] --- remote-resources:3.2.0:process (process-resource-bundles) @ openwebbeans ---
[INFO] Preparing remote bundle org.apache.apache.resources:apache-jar-resource-bundle:1.8
[INFO] Downloading from central: https://repo.maven.apache.org/maven2/org/apache/apache/resources/apache-jar-resource-bundle/1.8/apache-jar-resource-bundle-1.8.jar
[INFO] Downloaded from central: https://repo.maven.apache.org/maven2/org/apache/apache/resources/apache-jar-resource-bundle/1.8/apache-jar-resource-bundle-1.8.jar (13 kB at 33 kB/s)
[INFO] Copying 3 resources from 1 bundle.
[INFO] 
[INFO] --- bundle:5.1.9:manifest (bundle-manifest) @ openwebbeans ---
[WARNING] Ignoring project type pom - supportedProjectTypes = [jar, bundle, war]
[INFO] 
[INFO] --- source:3.4.0:jar-no-fork (attach-sources) @ openwebbeans ---
[INFO] 
[INFO] --- checkstyle:3.6.0:check (verify-style) @ openwebbeans ---
[INFO] Starting audit...
Audit done.
[INFO] You have 0 Checkstyle violations.
[INFO] 
[INFO] --- apache-rat:0.16.1:check (default) @ openwebbeans ---
[INFO] Rat check: Summary over all files. Unapproved: 0, unknown: 0, generated: 0, approved: 1 licenses.
[INFO] 
[INFO] --- install:3.1.4:install (default-install) @ openwebbeans ---
[INFO] Installing <https://ci-builds.apache.org/job/OpenWebBeans/job/OpenWebBeans%20CI%20(main)/ws/pom.xml> to /home/jenkins/maven-repositories/0/org/apache/openwebbeans/openwebbeans/4.1.2-SNAPSHOT/openwebbeans-4.1.2-SNAPSHOT.pom
[WARNING] Attempt to (de-)serialize anonymous class org.jfrog.hudson.maven2.MavenDependenciesRecorder$1; see: https://jenkins.io/redirect/serialization-of-anonymous-classes/
[INFO] 
[INFO] --------------< org.apache.openwebbeans:openwebbeans-spi >--------------
[INFO] Building SPI definition 4.1.2-SNAPSHOT                            [2/31]
[INFO]   from webbeans-spi/pom.xml
[INFO] --------------------------------[ jar ]---------------------------------
[INFO] Downloading from central: https://repo.maven.apache.org/maven2/org/apache/maven/plugins/maven-surefire-plugin/3.5.6/maven-surefire-plugin-3.5.6.pom
[INFO] Downloaded from central: https://repo.maven.apache.org/maven2/org/apache/maven/plugins/maven-surefire-plugin/3.5.6/maven-surefire-plugin-3.5.6.pom (4.9 kB at 111 kB/s)
[INFO] Downloading from central: https://repo.maven.apache.org/maven2/org/apache/maven/surefire/surefire/3.5.6/surefire-3.5.6.pom
[INFO] Downloaded from central: https://repo.maven.apache.org/maven2/org/apache/maven/surefire/surefire/3.5.6/surefire-3.5.6.pom (19 kB at 480 kB/s)
[INFO] Downloading from central: https://repo.maven.apache.org/maven2/org/apache/maven/plugins/maven-surefire-plugin/3.5.6/maven-surefire-plugin-3.5.6.jar
[INFO] Downloaded from central: https://repo.maven.apache.org/maven2/org/apache/maven/plugins/maven-surefire-plugin/3.5.6/maven-surefire-plugin-3.5.6.jar (47 kB at 883 kB/s)
[INFO] 
[INFO] --- clean:3.5.0:clean (default-clean) @ openwebbeans-spi ---
[INFO] 
[INFO] --- enforcer:3.6.2:enforce (enforce-maven-version) @ openwebbeans-spi ---
[INFO] 
[INFO] --- enforcer:3.6.2:enforce (enforce-java-version) @ openwebbeans-spi ---
[INFO] 
[INFO] --- remote-resources:3.2.0:process (default) @ openwebbeans-spi ---
[INFO] Preparing remote bundle org.apache:apache-jar-resource-bundle:1.4
[INFO] Copying 3 resources from 1 bundle.
[INFO] 
[INFO] --- remote-resources:3.2.0:process (process-resource-bundles) @ openwebbeans-spi ---
[INFO] Preparing remote bundle org.apache.apache.resources:apache-jar-resource-bundle:1.8
[INFO] Copying 3 resources from 1 bundle.
[INFO] 
[INFO] --- resources:3.5.0:resources (default-resources) @ openwebbeans-spi ---
[INFO] skip non existing resourceDirectory <https://ci-builds.apache.org/job/OpenWebBeans/job/OpenWebBeans%20CI%20(main)/ws/webbeans-spi/src/main/resources>
[INFO] Copying 3 resources from target/maven-shared-archive-resources to target/classes
[INFO] Copying 3 resources from target/maven-shared-archive-resources to target/classes
[INFO] 
[INFO] --- compiler:3.15.0:compile (default-compile) @ openwebbeans-spi ---
[INFO] Recompiling the module because of changed source code.
[INFO] Compiling 25 source files with javac [debug release 17] to target/classes
[WARNING] <https://ci-builds.apache.org/job/OpenWebBeans/job/OpenWebBeans%20CI%20(main)/ws/webbeans-spi/src/main/java/org/apache/webbeans/spi/BDABeansXmlScanner.java>:[28,8] deprecated item is not annotated with @Deprecated
[WARNING] <https://ci-builds.apache.org/job/OpenWebBeans/job/OpenWebBeans%20CI%20(main)/ws/webbeans-spi/src/main/java/org/apache/webbeans/spi/ResourceInjectionService.java>:[88,22] deprecated item is not annotated with @Deprecated
[WARNING] <https://ci-builds.apache.org/job/OpenWebBeans/job/OpenWebBeans%20CI%20(main)/ws/webbeans-spi/src/main/java/org/apache/webbeans/spi/ResourceInjectionService.java>:[97,19] deprecated item is not annotated with @Deprecated
[WARNING] <https://ci-builds.apache.org/job/OpenWebBeans/job/OpenWebBeans%20CI%20(main)/ws/webbeans-spi/src/main/java/org/apache/webbeans/spi/api/ResourceReference.java>:[93,42] non-varargs call of varargs method with inexact argument type for last parameter;
  cast to java.lang.Class for a varargs call
  cast to java.lang.Class[] for a non-varargs call and to suppress this warning
[WARNING] <https://ci-builds.apache.org/job/OpenWebBeans/job/OpenWebBeans%20CI%20(main)/ws/webbeans-spi/src/main/java/org/apache/webbeans/spi/api/ResourceReference.java>:[109,69] non-varargs call of varargs method with inexact argument type for last parameter;
  cast to java.lang.Object for a varargs call
  cast to java.lang.Object[] for a non-varargs call and to suppress this warning
[INFO] <https://ci-builds.apache.org/job/OpenWebBeans/job/OpenWebBeans%20CI%20(main)/ws/webbeans-spi/src/main/java/org/apache/webbeans/spi/ScannerService.java>: <https://ci-builds.apache.org/job/OpenWebBeans/job/OpenWebBeans%20CI%20(main)/ws/webbeans-spi/src/main/java/org/apache/webbeans/spi/ScannerService.java> uses or overrides a deprecated API.
[INFO] <https://ci-builds.apache.org/job/OpenWebBeans/job/OpenWebBeans%20CI%20(main)/ws/webbeans-spi/src/main/java/org/apache/webbeans/spi/ScannerService.java>: Recompile with -Xlint:deprecation for details.
[INFO] <https://ci-builds.apache.org/job/OpenWebBeans/job/OpenWebBeans%20CI%20(main)/ws/webbeans-spi/src/main/java/org/apache/webbeans/spi/api/ResourceReference.java>: <https://ci-builds.apache.org/job/OpenWebBeans/job/OpenWebBeans%20CI%20(main)/ws/webbeans-spi/src/main/java/org/apache/webbeans/spi/api/ResourceReference.java> uses unchecked or unsafe operations.
[INFO] <https://ci-builds.apache.org/job/OpenWebBeans/job/OpenWebBeans%20CI%20(main)/ws/webbeans-spi/src/main/java/org/apache/webbeans/spi/api/ResourceReference.java>: Recompile with -Xlint:unchecked for details.
[INFO] 
[INFO] --- bundle:5.1.9:manifest (bundle-manifest) @ openwebbeans-spi ---
[INFO] No MANIFEST.MF file found, generating manifest.
[INFO] Writing manifest: <https://ci-builds.apache.org/job/OpenWebBeans/job/OpenWebBeans%20CI%20(main)/ws/webbeans-spi/target/classes/META-INF/MANIFEST.MF>
[INFO] 
[INFO] --- resources:3.5.0:testResources (default-testResources) @ openwebbeans-spi ---
[INFO] skip non existing resourceDirectory <https://ci-builds.apache.org/job/OpenWebBeans/job/OpenWebBeans%20CI%20(main)/ws/webbeans-spi/src/test/resources>
[INFO] Copying 3 resources from target/maven-shared-archive-resources to target/test-classes
[INFO] Copying 3 resources from target/maven-shared-archive-resources to target/test-classes
[INFO] 
[INFO] --- compiler:3.15.0:testCompile (default-testCompile) @ openwebbeans-spi ---
[INFO] No sources to compile
[INFO] 
[INFO] --- surefire:3.5.6:test (default-test) @ openwebbeans-spi ---
[INFO] Downloading from central: https://repo.maven.apache.org/maven2/org/apache/maven/surefire/surefire-api/3.5.6/surefire-api-3.5.6.pom
[INFO] Downloaded from central: https://repo.maven.apache.org/maven2/org/apache/maven/surefire/surefire-api/3.5.6/surefire-api-3.5.6.pom (3.7 kB at 100 kB/s)
[INFO] Downloading from central: https://repo.maven.apache.org/maven2/org/apache/maven/surefire/surefire-logger-api/3.5.6/surefire-logger-api-3.5.6.pom
[INFO] Downloaded from central: https://repo.maven.apache.org/maven2/org/apache/maven/surefire/surefire-logger-api/3.5.6/surefire-logger-api-3.5.6.pom (3.5 kB at 116 kB/s)
[INFO] Downloading from central: https://repo.maven.apache.org/maven2/org/apache/maven/surefire/surefire-shared-utils/3.5.6/surefire-shared-utils-3.5.6.pom
[INFO] Downloaded from central: https://repo.maven.apache.org/maven2/org/apache/maven/surefire/surefire-shared-utils/3.5.6/surefire-shared-utils-3.5.6.pom (4.0 kB at 136 kB/s)
[INFO] Downloading from central: https://repo.maven.apache.org/maven2/org/apache/maven/surefire/surefire-extensions-api/3.5.6/surefire-extensions-api-3.5.6.pom
[INFO] Downloaded from central: https://repo.maven.apache.org/maven2/org/apache/maven/surefire/surefire-extensions-api/3.5.6/surefire-extensions-api-3.5.6.pom (3.6 kB at 115 kB/s)
[INFO] Downloading from central: https://repo.maven.apache.org/maven2/org/apache/maven/surefire/maven-surefire-common/3.5.6/maven-surefire-common-3.5.6.pom
[INFO] Downloaded from central: https://repo.maven.apache.org/maven2/org/apache/maven/surefire/maven-surefire-common/3.5.6/maven-surefire-common-3.5.6.pom (7.3 kB at 227 kB/s)
[INFO] Downloading from central: https://repo.maven.apache.org/maven2/org/apache/maven/surefire/surefire-booter/3.5.6/surefire-booter-3.5.6.pom
[INFO] Downloaded from central: https://repo.maven.apache.org/maven2/org/apache/maven/surefire/surefire-booter/3.5.6/surefire-booter-3.5.6.pom (5.1 kB at 125 kB/s)
[INFO] Downloading from central: https://repo.maven.apache.org/maven2/org/apache/maven/surefire/surefire-extensions-spi/3.5.6/surefire-extensions-spi-3.5.6.pom
[INFO] Downloaded from central: https://repo.maven.apache.org/maven2/org/apache/maven/surefire/surefire-extensions-spi/3.5.6/surefire-extensions-spi-3.5.6.pom (1.7 kB at 57 kB/s)
[INFO] Downloading from central: https://repo.maven.apache.org/maven2/org/apache/maven/surefire/surefire-api/3.5.6/surefire-api-3.5.6.jar
[INFO] Downloaded from central: https://repo.maven.apache.org/maven2/org/apache/maven/surefire/surefire-api/3.5.6/surefire-api-3.5.6.jar (174 kB at 4.0 MB/s)
[INFO] Downloading from central: https://repo.maven.apache.org/maven2/org/apache/maven/surefire/surefire-logger-api/3.5.6/surefire-logger-api-3.5.6.jar
[INFO] Downloading from central: https://repo.maven.apache.org/maven2/org/apache/maven/surefire/surefire-shared-utils/3.5.6/surefire-shared-utils-3.5.6.jar
[INFO] Downloading from central: https://repo.maven.apache.org/maven2/org/apache/maven/surefire/surefire-extensions-api/3.5.6/surefire-extensions-api-3.5.6.jar
[INFO] Downloading from central: https://repo.maven.apache.org/maven2/org/apache/maven/surefire/maven-surefire-common/3.5.6/maven-surefire-common-3.5.6.jar
[INFO] Downloading from central: https://repo.maven.apache.org/maven2/org/apache/maven/surefire/surefire-booter/3.5.6/surefire-booter-3.5.6.jar
[INFO] Downloaded from central: https://repo.maven.apache.org/maven2/org/apache/maven/surefire/surefire-logger-api/3.5.6/surefire-logger-api-3.5.6.jar (14 kB at 437 kB/s)
[INFO] Downloading from central: https://repo.maven.apache.org/maven2/org/apache/maven/surefire/surefire-extensions-spi/3.5.6/surefire-extensions-spi-3.5.6.jar
[INFO] Downloaded from central: https://repo.maven.apache.org/maven2/org/apache/maven/surefire/surefire-extensions-spi/3.5.6/surefire-extensions-spi-3.5.6.jar (8.2 kB at 132 kB/s)
[INFO] Downloaded from central: https://repo.maven.apache.org/maven2/org/apache/maven/surefire/surefire-booter/3.5.6/surefire-booter-3.5.6.jar (123 kB at 1.4 MB/s)
[INFO] Downloaded from central: https://repo.maven.apache.org/maven2/org/apache/maven/surefire/surefire-extensions-api/3.5.6/surefire-extensions-api-3.5.6.jar (26 kB at 283 kB/s)
[INFO] Downloaded from central: https://repo.maven.apache.org/maven2/org/apache/maven/surefire/maven-surefire-common/3.5.6/maven-surefire-common-3.5.6.jar (317 kB at 2.2 MB/s)
[INFO] Downloaded from central: https://repo.maven.apache.org/maven2/org/apache/maven/surefire/surefire-shared-utils/3.5.6/surefire-shared-utils-3.5.6.jar (3.0 MB at 12 MB/s)
[JENKINS] Recording test results
[INFO] 
[INFO] --- jar:3.3.0:jar (default-jar) @ openwebbeans-spi ---
[INFO] Building jar: <https://ci-builds.apache.org/job/OpenWebBeans/job/OpenWebBeans%20CI%20(main)/ws/webbeans-spi/target/openwebbeans-spi-4.1.2-SNAPSHOT.jar>
[INFO] 
[INFO] --- source:3.4.0:jar-no-fork (attach-sources) @ openwebbeans-spi ---
[INFO] Building jar: <https://ci-builds.apache.org/job/OpenWebBeans/job/OpenWebBeans%20CI%20(main)/ws/webbeans-spi/target/openwebbeans-spi-4.1.2-SNAPSHOT-sources.jar>
[INFO] 
[INFO] --- checkstyle:3.6.0:check (verify-style) @ openwebbeans-spi ---
[INFO] Starting audit...
Audit done.
[INFO] You have 0 Checkstyle violations.
[INFO] 
[INFO] --- apache-rat:0.16.1:check (default) @ openwebbeans-spi ---
[INFO] Rat check: Summary over all files. Unapproved: 0, unknown: 0, generated: 0, approved: 29 licenses.
[INFO] 
[INFO] --- install:3.1.4:install (default-install) @ openwebbeans-spi ---
[INFO] Installing <https://ci-builds.apache.org/job/OpenWebBeans/job/OpenWebBeans%20CI%20(main)/ws/webbeans-spi/pom.xml> to /home/jenkins/maven-repositories/0/org/apache/openwebbeans/openwebbeans-spi/4.1.2-SNAPSHOT/openwebbeans-spi-4.1.2-SNAPSHOT.pom
[INFO] Installing <https://ci-builds.apache.org/job/OpenWebBeans/job/OpenWebBeans%20CI%20(main)/ws/webbeans-spi/target/openwebbeans-spi-4.1.2-SNAPSHOT.jar> to /home/jenkins/maven-repositories/0/org/apache/openwebbeans/openwebbeans-spi/4.1.2-SNAPSHOT/openwebbeans-spi-4.1.2-SNAPSHOT.jar
[INFO] Installing <https://ci-builds.apache.org/job/OpenWebBeans/job/OpenWebBeans%20CI%20(main)/ws/webbeans-spi/target/openwebbeans-spi-4.1.2-SNAPSHOT-sources.jar> to /home/jenkins/maven-repositories/0/org/apache/openwebbeans/openwebbeans-spi/4.1.2-SNAPSHOT/openwebbeans-spi-4.1.2-SNAPSHOT-sources.jar
[INFO] 
[INFO] -------------< org.apache.openwebbeans:openwebbeans-impl >--------------
[INFO] Building OpenWebBeans Core 4.1.2-SNAPSHOT                         [3/31]
[INFO]   from webbeans-impl/pom.xml
[INFO] --------------------------------[ jar ]---------------------------------
[INFO] Downloading from central: https://repo.maven.apache.org/maven2/org/apache/xbean/xbean-finder-shaded/5.0.0/xbean-finder-shaded-5.0.0.pom
[WARNING] The POM for org.apache.xbean:xbean-finder-shaded:jar:5.0.0 is missing, no dependency information available
[INFO] Downloading from central: https://repo.maven.apache.org/maven2/org/apache/xbean/xbean-asm9-shaded/5.0.0/xbean-asm9-shaded-5.0.0.pom
[WARNING] The POM for org.apache.xbean:xbean-asm9-shaded:jar:5.0.0 is missing, no dependency information available
[INFO] Downloading from central: https://repo.maven.apache.org/maven2/org/apache/xbean/xbean-finder-shaded/5.0.0/xbean-finder-shaded-5.0.0.jar
[INFO] Downloading from central: https://repo.maven.apache.org/maven2/org/apache/xbean/xbean-asm9-shaded/5.0.0/xbean-asm9-shaded-5.0.0.jar
[INFO] ------------------------------------------------------------------------
[INFO] Reactor Summary for Apache OpenWebBeans 4.1.2-SNAPSHOT:
[INFO] 
[INFO] Apache OpenWebBeans ................................ SUCCESS [ 18.232 s]
[INFO] SPI definition ..................................... SUCCESS [ 14.983 s]
[INFO] OpenWebBeans Core .................................. FAILURE [  1.065 s]
[INFO] EL 2.2 plugin ...................................... SKIPPED
[INFO] Apache OpenWebBeans CDI Java SE Implementation ..... SKIPPED
[INFO] Web plugin ......................................... SKIPPED
[INFO] Tomcat plugin ...................................... SKIPPED
[INFO] EJB plugin ......................................... SKIPPED
[INFO] OWB Arquillian Parent .............................. SKIPPED
[INFO] OpenWebBeans-Standalone Arquillian connector ....... SKIPPED
[INFO] Slf4j Integration .................................. SKIPPED
[INFO] Gradle ShadowJar Plugin Integration ................ SKIPPED
[INFO] OpenWebBeans JUnit5 ................................ SKIPPED
[INFO] TCK Porting Pkg .................................... SKIPPED
[INFO] OWB JSR-330 Jakarta version TCK .................... SKIPPED
[INFO] EE Common plugin ................................... SKIPPED
[INFO] Java EE plugin ..................................... SKIPPED
[INFO] JMS plugin ......................................... SKIPPED
[INFO] JSR-365 TCK runner ................................. SKIPPED
[INFO] JSF-2 plugin ....................................... SKIPPED
[INFO] OSGi plugin ........................................ SKIPPED
[INFO] Distribution Pkg ................................... SKIPPED
[INFO] BOM ................................................ SKIPPED
[INFO] SE BOM ............................................. SKIPPED
[INFO] Web BOM ............................................ SKIPPED
[INFO] OpenWebBeans Java SE Sample ........................ SKIPPED
[INFO] OWB Samples ........................................ SKIPPED
[INFO] Sample Guess Application ........................... SKIPPED
[INFO] JSF Conversation Sample ............................ SKIPPED
[INFO] Sample JSF2 Application ............................ SKIPPED
[INFO] Sample Hotel Reservation Application ............... SKIPPED
[INFO] ------------------------------------------------------------------------
[INFO] BUILD FAILURE
[INFO] ------------------------------------------------------------------------
[INFO] Total time:  01:16 min
[INFO] Finished at: 2026-08-04T01:47:05Z
[INFO] ------------------------------------------------------------------------
Waiting for Jenkins to finish collecting data
[ERROR] Failed to execute goal on project openwebbeans-impl: Could not resolve dependencies for project org.apache.openwebbeans:openwebbeans-impl:jar:4.1.2-SNAPSHOT
[ERROR] dependency: org.apache.xbean:xbean-finder-shaded:jar:5.0.0 (compile)
[ERROR] Could not find artifact org.apache.xbean:xbean-finder-shaded:jar:5.0.0 in central (https://repo.maven.apache.org/maven2)
[ERROR] dependency: org.apache.xbean:xbean-asm9-shaded:jar:5.0.0 (compile)
[ERROR] Could not find artifact org.apache.xbean:xbean-asm9-shaded:jar:5.0.0 in central (https://repo.maven.apache.org/maven2)
[ERROR] -> [Help 1]
[ERROR] 
[ERROR] To see the full stack trace of the errors, re-run Maven with the -e switch.
[ERROR] Re-run Maven using the -X switch to enable full debug logging.
[ERROR] 
[ERROR] For more information about the errors and possible solutions, please read the following articles:
[ERROR] [Help 1] http://cwiki.apache.org/confluence/display/MAVEN/DependencyResolutionException
[ERROR] 
[ERROR] After correcting the problems, you can resume the build with the command
[ERROR]   mvn <goals> -rf :openwebbeans-impl
[JENKINS] Archiving <https://ci-builds.apache.org/job/OpenWebBeans/job/OpenWebBeans%20CI%20(main)/ws/webbeans-impl/pom.xml> to org.apache.openwebbeans/openwebbeans-impl/4.1.2-SNAPSHOT/openwebbeans-impl-4.1.2-SNAPSHOT.pom
[JENKINS] Archiving <https://ci-builds.apache.org/job/OpenWebBeans/job/OpenWebBeans%20CI%20(main)/ws/bom/openwebbeans-se-bom/pom.xml> to org.apache.openwebbeans.bom/openwebbeans-se-bom/4.1.2-SNAPSHOT/openwebbeans-se-bom-4.1.2-SNAPSHOT.pom
[JENKINS] Archiving <https://ci-builds.apache.org/job/OpenWebBeans/job/OpenWebBeans%20CI%20(main)/ws/webbeans-ee-common/pom.xml> to org.apache.openwebbeans/openwebbeans-ee-common/4.1.2-SNAPSHOT/openwebbeans-ee-common-4.1.2-SNAPSHOT.pom
[JENKINS] Archiving <https://ci-builds.apache.org/job/OpenWebBeans/job/OpenWebBeans%20CI%20(main)/ws/webbeans-jsf/pom.xml> to org.apache.openwebbeans/openwebbeans-jsf/4.1.2-SNAPSHOT/openwebbeans-jsf-4.1.2-SNAPSHOT.pom
[JENKINS] Archiving <https://ci-builds.apache.org/job/OpenWebBeans/job/OpenWebBeans%20CI%20(main)/ws/webbeans-arquillian/pom.xml> to org.apache.openwebbeans.arquillian/owb-arquillian-parent/4.1.2-SNAPSHOT/owb-arquillian-parent-4.1.2-SNAPSHOT.pom
[JENKINS] Archiving <https://ci-builds.apache.org/job/OpenWebBeans/job/OpenWebBeans%20CI%20(main)/ws/webbeans-el22/pom.xml> to org.apache.openwebbeans/openwebbeans-el22/4.1.2-SNAPSHOT/openwebbeans-el22-4.1.2-SNAPSHOT.pom
[JENKINS] Archiving <https://ci-builds.apache.org/job/OpenWebBeans/job/OpenWebBeans%20CI%20(main)/ws/samples/reservation/pom.xml> to org.apache.openwebbeans.samples/reservation/4.1.2-SNAPSHOT/reservation-4.1.2-SNAPSHOT.pom
[JENKINS] Archiving <https://ci-builds.apache.org/job/OpenWebBeans/job/OpenWebBeans%20CI%20(main)/ws/samples/standalone-sample/pom.xml> to org.apache.openwebbeans/standalone-sample/4.1.2-SNAPSHOT/standalone-sample-4.1.2-SNAPSHOT.pom
[JENKINS] Archiving <https://ci-builds.apache.org/job/OpenWebBeans/job/OpenWebBeans%20CI%20(main)/ws/webbeans-gradle/pom.xml> to org.apache.openwebbeans/openwebbeans-gradle/4.1.2-SNAPSHOT/openwebbeans-gradle-4.1.2-SNAPSHOT.pom
[JENKINS] Archiving <https://ci-builds.apache.org/job/OpenWebBeans/job/OpenWebBeans%20CI%20(main)/ws/samples/pom.xml> to org.apache.openwebbeans/samples/4.1.2-SNAPSHOT/samples-4.1.2-SNAPSHOT.pom
[JENKINS] Archiving <https://ci-builds.apache.org/job/OpenWebBeans/job/OpenWebBeans%20CI%20(main)/ws/webbeans-spi/pom.xml> to org.apache.openwebbeans/openwebbeans-spi/4.1.2-SNAPSHOT/openwebbeans-spi-4.1.2-SNAPSHOT.pom
[JENKINS] Archiving <https://ci-builds.apache.org/job/OpenWebBeans/job/OpenWebBeans%20CI%20(main)/ws/webbeans-spi/target/openwebbeans-spi-4.1.2-SNAPSHOT.jar> to org.apache.openwebbeans/openwebbeans-spi/4.1.2-SNAPSHOT/openwebbeans-spi-4.1.2-SNAPSHOT.jar
[JENKINS] Archiving <https://ci-builds.apache.org/job/OpenWebBeans/job/OpenWebBeans%20CI%20(main)/ws/webbeans-spi/target/openwebbeans-spi-4.1.2-SNAPSHOT-sources.jar> to org.apache.openwebbeans/openwebbeans-spi/4.1.2-SNAPSHOT/openwebbeans-spi-4.1.2-SNAPSHOT-sources.jar
[JENKINS] Archiving <https://ci-builds.apache.org/job/OpenWebBeans/job/OpenWebBeans%20CI%20(main)/ws/samples/guess/pom.xml> to org.apache.openwebbeans.samples/guess/4.1.2-SNAPSHOT/guess-4.1.2-SNAPSHOT.pom
[JENKINS] Archiving <https://ci-builds.apache.org/job/OpenWebBeans/job/OpenWebBeans%20CI%20(main)/ws/webbeans-se/pom.xml> to org.apache.openwebbeans/openwebbeans-se/4.1.2-SNAPSHOT/openwebbeans-se-4.1.2-SNAPSHOT.pom
[JENKINS] Archiving <https://ci-builds.apache.org/job/OpenWebBeans/job/OpenWebBeans%20CI%20(main)/ws/webbeans-osgi/pom.xml> to org.apache.openwebbeans/openwebbeans-osgi/4.1.2-SNAPSHOT/openwebbeans-osgi-4.1.2-SNAPSHOT.pom
[JENKINS] Archiving <https://ci-builds.apache.org/job/OpenWebBeans/job/OpenWebBeans%20CI%20(main)/ws/samples/jsf2sample/pom.xml> to org.apache.openwebbeans.samples/jsf2sample/4.1.2-SNAPSHOT/jsf2sample-4.1.2-SNAPSHOT.pom
[JENKINS] Archiving <https://ci-builds.apache.org/job/OpenWebBeans/job/OpenWebBeans%20CI%20(main)/ws/pom.xml> to org.apache.openwebbeans/openwebbeans/4.1.2-SNAPSHOT/openwebbeans-4.1.2-SNAPSHOT.pom
[JENKINS] Archiving <https://ci-builds.apache.org/job/OpenWebBeans/job/OpenWebBeans%20CI%20(main)/ws/webbeans-tck/pom.xml> to org.apache.openwebbeans/openwebbeans-tck/4.1.2-SNAPSHOT/openwebbeans-tck-4.1.2-SNAPSHOT.pom
[JENKINS] Archiving <https://ci-builds.apache.org/job/OpenWebBeans/job/OpenWebBeans%20CI%20(main)/ws/webbeans-ee/pom.xml> to org.apache.openwebbeans/openwebbeans-ee/4.1.2-SNAPSHOT/openwebbeans-ee-4.1.2-SNAPSHOT.pom
[JENKINS] Archiving <https://ci-builds.apache.org/job/OpenWebBeans/job/OpenWebBeans%20CI%20(main)/ws/webbeans-slf4j/pom.xml> to org.apache.openwebbeans/openwebbeans-slf4j/4.1.2-SNAPSHOT/openwebbeans-slf4j-4.1.2-SNAPSHOT.pom
[JENKINS] Archiving <https://ci-builds.apache.org/job/OpenWebBeans/job/OpenWebBeans%20CI%20(main)/ws/webbeans-ejb/pom.xml> to org.apache.openwebbeans/openwebbeans-ejb/4.1.2-SNAPSHOT/openwebbeans-ejb-4.1.2-SNAPSHOT.pom
[JENKINS] Archiving <https://ci-builds.apache.org/job/OpenWebBeans/job/OpenWebBeans%20CI%20(main)/ws/webbeans-junit5/pom.xml> to org.apache.openwebbeans/openwebbeans-junit5/4.1.2-SNAPSHOT/openwebbeans-junit5-4.1.2-SNAPSHOT.pom
[JENKINS] Archiving <https://ci-builds.apache.org/job/OpenWebBeans/job/OpenWebBeans%20CI%20(main)/ws/bom/pom.xml> to org.apache.openwebbeans.bom/bom/4.1.2-SNAPSHOT/bom-4.1.2-SNAPSHOT.pom
[JENKINS] Archiving <https://ci-builds.apache.org/job/OpenWebBeans/job/OpenWebBeans%20CI%20(main)/ws/samples/conversation-sample/pom.xml> to org.apache.openwebbeans.samples/conversation-sample/4.1.2-SNAPSHOT/conversation-sample-4.1.2-SNAPSHOT.pom
[JENKINS] Archiving <https://ci-builds.apache.org/job/OpenWebBeans/job/OpenWebBeans%20CI%20(main)/ws/webbeans-web/pom.xml> to org.apache.openwebbeans/openwebbeans-web/4.1.2-SNAPSHOT/openwebbeans-web-4.1.2-SNAPSHOT.pom
[JENKINS] Archiving <https://ci-builds.apache.org/job/OpenWebBeans/job/OpenWebBeans%20CI%20(main)/ws/webbeans-porting/pom.xml> to org.apache.openwebbeans/openwebbeans-porting/4.1.2-SNAPSHOT/openwebbeans-porting-4.1.2-SNAPSHOT.pom
[JENKINS] Archiving <https://ci-builds.apache.org/job/OpenWebBeans/job/OpenWebBeans%20CI%20(main)/ws/webbeans-tomcat/pom.xml> to org.apache.openwebbeans/openwebbeans-tomcat/4.1.2-SNAPSHOT/openwebbeans-tomcat-4.1.2-SNAPSHOT.pom
[JENKINS] Archiving <https://ci-builds.apache.org/job/OpenWebBeans/job/OpenWebBeans%20CI%20(main)/ws/webbeans-jms/pom.xml> to org.apache.openwebbeans/openwebbeans-jms/4.1.2-SNAPSHOT/openwebbeans-jms-4.1.2-SNAPSHOT.pom
[JENKINS] Archiving <https://ci-builds.apache.org/job/OpenWebBeans/job/OpenWebBeans%20CI%20(main)/ws/bom/openwebbeans-web-bom/pom.xml> to org.apache.openwebbeans.bom/openwebbeans-web-bom/4.1.2-SNAPSHOT/openwebbeans-web-bom-4.1.2-SNAPSHOT.pom
[JENKINS] Archiving <https://ci-builds.apache.org/job/OpenWebBeans/job/OpenWebBeans%20CI%20(main)/ws/atinject-tck/pom.xml> to org.apache.openwebbeans/atinject-tck/4.1.2-SNAPSHOT/atinject-tck-4.1.2-SNAPSHOT.pom
[JENKINS] Archiving <https://ci-builds.apache.org/job/OpenWebBeans/job/OpenWebBeans%20CI%20(main)/ws/distribution/pom.xml> to org.apache.openwebbeans/openwebbeans-distribution/4.1.2-SNAPSHOT/openwebbeans-distribution-4.1.2-SNAPSHOT.pom
[JENKINS] Archiving <https://ci-builds.apache.org/job/OpenWebBeans/job/OpenWebBeans%20CI%20(main)/ws/webbeans-arquillian/owb-arquillian-standalone/pom.xml> to org.apache.openwebbeans.arquillian/owb-arquillian-standalone/4.1.2-SNAPSHOT/owb-arquillian-standalone-4.1.2-SNAPSHOT.pom
channel stopped

Build failed in Jenkins: OpenWebBeans » OpenWebBeans CI (main) #133

Posted by Apache Jenkins Server <je...@builds.apache.org>.
See <https://ci-builds.apache.org/job/OpenWebBeans/job/OpenWebBeans%20CI%20(main)/133/display/redirect?page=changes>

Changes:

[Mark Struberg] update doap file


------------------------------------------
[...truncated 3.83 KiB...]
[INFO] Slf4j Integration                                                  [jar]
[INFO] Gradle ShadowJar Plugin Integration                                [jar]
[INFO] OpenWebBeans JUnit5                                                [jar]
[INFO] TCK Porting Pkg                                                    [jar]
[INFO] OWB JSR-330 Jakarta version TCK                                    [jar]
[INFO] EE Common plugin                                                   [jar]
[INFO] Java EE plugin                                                     [jar]
[INFO] JMS plugin                                                         [jar]
[INFO] JSR-365 TCK runner                                                 [jar]
[INFO] JSF-2 plugin                                                       [jar]
[INFO] OSGi plugin                                                        [jar]
[INFO] Distribution Pkg                                                   [pom]
[INFO] BOM                                                                [pom]
[INFO] SE BOM                                                             [pom]
[INFO] Web BOM                                                            [pom]
[INFO] OpenWebBeans Java SE Sample                                        [jar]
[INFO] OWB Samples                                                        [pom]
[INFO] Sample Guess Application                                           [war]
[INFO] JSF Conversation Sample                                            [war]
[INFO] Sample JSF2 Application                                            [war]
[INFO] Sample Hotel Reservation Application                               [war]
[HUDSON] Collecting dependencies info
[HUDSON] Collecting dependencies info
[HUDSON] Collecting dependencies info
[HUDSON] Collecting dependencies info
[HUDSON] Collecting dependencies info
[HUDSON] Collecting dependencies info
[HUDSON] Collecting dependencies info
[HUDSON] Collecting dependencies info
[HUDSON] Collecting dependencies info
[HUDSON] Collecting dependencies info
[HUDSON] Collecting dependencies info
[HUDSON] Collecting dependencies info
[HUDSON] Collecting dependencies info
[HUDSON] Collecting dependencies info
[HUDSON] Collecting dependencies info
[HUDSON] Collecting dependencies info
[HUDSON] Collecting dependencies info
[HUDSON] Collecting dependencies info
[INFO] 
[INFO] ----------------< org.apache.openwebbeans:openwebbeans >----------------
[INFO] Building Apache OpenWebBeans 4.1.1-SNAPSHOT                       [1/31]
[INFO]   from pom.xml
[INFO] --------------------------------[ pom ]---------------------------------
[INFO] 
[INFO] --- clean:3.5.0:clean (default-clean) @ openwebbeans ---
[INFO] 
[INFO] --- enforcer:3.6.2:enforce (enforce-maven-version) @ openwebbeans ---
[INFO] Rule 0: org.apache.maven.enforcer.rules.version.RequireMavenVersion passed
[INFO] 
[INFO] --- enforcer:3.6.2:enforce (enforce-java-version) @ openwebbeans ---
[INFO] Rule 0: org.apache.maven.enforcer.rules.version.RequireJavaVersion passed
[INFO] 
[INFO] --- remote-resources:3.2.0:process (default) @ openwebbeans ---
[INFO] Preparing remote bundle org.apache:apache-jar-resource-bundle:1.4
[INFO] Copying 3 resources from 1 bundle.
[INFO] 
[INFO] --- remote-resources:3.2.0:process (process-resource-bundles) @ openwebbeans ---
[INFO] Preparing remote bundle org.apache.apache.resources:apache-jar-resource-bundle:1.7
[INFO] Copying 3 resources from 1 bundle.
[INFO] 
[INFO] --- bundle:5.1.9:manifest (bundle-manifest) @ openwebbeans ---
[WARNING] Ignoring project type pom - supportedProjectTypes = [jar, bundle, war]
[INFO] 
[INFO] --- source:3.4.0:jar-no-fork (attach-sources) @ openwebbeans ---
[INFO] 
[INFO] --- checkstyle:3.6.0:check (verify-style) @ openwebbeans ---
[INFO] Starting audit...
Audit done.
[INFO] You have 0 Checkstyle violations.
[INFO] 
[INFO] --- apache-rat:0.16.1:check (default) @ openwebbeans ---
[INFO] Rat check: Summary over all files. Unapproved: 0, unknown: 0, generated: 0, approved: 1 licenses.
[INFO] 
[INFO] --- install:3.1.4:install (default-install) @ openwebbeans ---
[INFO] Installing <https://ci-builds.apache.org/job/OpenWebBeans/job/OpenWebBeans%20CI%20(main)/ws/pom.xml> to /home/jenkins/maven-repositories/0/org/apache/openwebbeans/openwebbeans/4.1.1-SNAPSHOT/openwebbeans-4.1.1-SNAPSHOT.pom
[WARNING] Attempt to (de-)serialize anonymous class org.jfrog.hudson.maven2.MavenDependenciesRecorder$1; see: https://jenkins.io/redirect/serialization-of-anonymous-classes/
[INFO] 
[INFO] --------------< org.apache.openwebbeans:openwebbeans-spi >--------------
[INFO] Building SPI definition 4.1.1-SNAPSHOT                            [2/31]
[INFO]   from webbeans-spi/pom.xml
[INFO] --------------------------------[ jar ]---------------------------------
[INFO] 
[INFO] --- clean:3.5.0:clean (default-clean) @ openwebbeans-spi ---
[INFO] 
[INFO] --- enforcer:3.6.2:enforce (enforce-maven-version) @ openwebbeans-spi ---
[INFO] 
[INFO] --- enforcer:3.6.2:enforce (enforce-java-version) @ openwebbeans-spi ---
[INFO] 
[INFO] --- remote-resources:3.2.0:process (default) @ openwebbeans-spi ---
[INFO] Preparing remote bundle org.apache:apache-jar-resource-bundle:1.4
[INFO] Copying 3 resources from 1 bundle.
[INFO] 
[INFO] --- remote-resources:3.2.0:process (process-resource-bundles) @ openwebbeans-spi ---
[INFO] Preparing remote bundle org.apache.apache.resources:apache-jar-resource-bundle:1.7
[INFO] Copying 3 resources from 1 bundle.
[INFO] 
[INFO] --- resources:3.4.0:resources (default-resources) @ openwebbeans-spi ---
[INFO] skip non existing resourceDirectory <https://ci-builds.apache.org/job/OpenWebBeans/job/OpenWebBeans%20CI%20(main)/ws/webbeans-spi/src/main/resources>
[INFO] Copying 3 resources from target/maven-shared-archive-resources to target/classes
[INFO] Copying 3 resources from target/maven-shared-archive-resources to target/classes
[INFO] 
[INFO] --- compiler:3.15.0:compile (default-compile) @ openwebbeans-spi ---
[INFO] Recompiling the module because of changed source code.
[INFO] Compiling 25 source files with javac [debug release 17] to target/classes
[WARNING] <https://ci-builds.apache.org/job/OpenWebBeans/job/OpenWebBeans%20CI%20(main)/ws/webbeans-spi/src/main/java/org/apache/webbeans/spi/BDABeansXmlScanner.java>:[28,8] deprecated item is not annotated with @Deprecated
[WARNING] <https://ci-builds.apache.org/job/OpenWebBeans/job/OpenWebBeans%20CI%20(main)/ws/webbeans-spi/src/main/java/org/apache/webbeans/spi/ResourceInjectionService.java>:[88,22] deprecated item is not annotated with @Deprecated
[WARNING] <https://ci-builds.apache.org/job/OpenWebBeans/job/OpenWebBeans%20CI%20(main)/ws/webbeans-spi/src/main/java/org/apache/webbeans/spi/ResourceInjectionService.java>:[97,19] deprecated item is not annotated with @Deprecated
[WARNING] <https://ci-builds.apache.org/job/OpenWebBeans/job/OpenWebBeans%20CI%20(main)/ws/webbeans-spi/src/main/java/org/apache/webbeans/spi/api/ResourceReference.java>:[93,42] non-varargs call of varargs method with inexact argument type for last parameter;
  cast to java.lang.Class for a varargs call
  cast to java.lang.Class[] for a non-varargs call and to suppress this warning
[WARNING] <https://ci-builds.apache.org/job/OpenWebBeans/job/OpenWebBeans%20CI%20(main)/ws/webbeans-spi/src/main/java/org/apache/webbeans/spi/api/ResourceReference.java>:[109,69] non-varargs call of varargs method with inexact argument type for last parameter;
  cast to java.lang.Object for a varargs call
  cast to java.lang.Object[] for a non-varargs call and to suppress this warning
[INFO] <https://ci-builds.apache.org/job/OpenWebBeans/job/OpenWebBeans%20CI%20(main)/ws/webbeans-spi/src/main/java/org/apache/webbeans/spi/ScannerService.java>: <https://ci-builds.apache.org/job/OpenWebBeans/job/OpenWebBeans%20CI%20(main)/ws/webbeans-spi/src/main/java/org/apache/webbeans/spi/ScannerService.java> uses or overrides a deprecated API.
[INFO] <https://ci-builds.apache.org/job/OpenWebBeans/job/OpenWebBeans%20CI%20(main)/ws/webbeans-spi/src/main/java/org/apache/webbeans/spi/ScannerService.java>: Recompile with -Xlint:deprecation for details.
[INFO] <https://ci-builds.apache.org/job/OpenWebBeans/job/OpenWebBeans%20CI%20(main)/ws/webbeans-spi/src/main/java/org/apache/webbeans/spi/api/ResourceReference.java>: <https://ci-builds.apache.org/job/OpenWebBeans/job/OpenWebBeans%20CI%20(main)/ws/webbeans-spi/src/main/java/org/apache/webbeans/spi/api/ResourceReference.java> uses unchecked or unsafe operations.
[INFO] <https://ci-builds.apache.org/job/OpenWebBeans/job/OpenWebBeans%20CI%20(main)/ws/webbeans-spi/src/main/java/org/apache/webbeans/spi/api/ResourceReference.java>: Recompile with -Xlint:unchecked for details.
[INFO] 
[INFO] --- bundle:5.1.9:manifest (bundle-manifest) @ openwebbeans-spi ---
[INFO] No MANIFEST.MF file found, generating manifest.
[INFO] Writing manifest: <https://ci-builds.apache.org/job/OpenWebBeans/job/OpenWebBeans%20CI%20(main)/ws/webbeans-spi/target/classes/META-INF/MANIFEST.MF>
[INFO] 
[INFO] --- resources:3.4.0:testResources (default-testResources) @ openwebbeans-spi ---
[INFO] skip non existing resourceDirectory <https://ci-builds.apache.org/job/OpenWebBeans/job/OpenWebBeans%20CI%20(main)/ws/webbeans-spi/src/test/resources>
[INFO] Copying 3 resources from target/maven-shared-archive-resources to target/test-classes
[INFO] Copying 3 resources from target/maven-shared-archive-resources to target/test-classes
[INFO] 
[INFO] --- compiler:3.15.0:testCompile (default-testCompile) @ openwebbeans-spi ---
[INFO] No sources to compile
[INFO] 
[INFO] --- surefire:3.2.2:test (default-test) @ openwebbeans-spi ---
[JENKINS] Recording test results
[INFO] 
[INFO] --- jar:3.3.0:jar (default-jar) @ openwebbeans-spi ---
[INFO] Building jar: <https://ci-builds.apache.org/job/OpenWebBeans/job/OpenWebBeans%20CI%20(main)/ws/webbeans-spi/target/openwebbeans-spi-4.1.1-SNAPSHOT.jar>
[INFO] 
[INFO] --- source:3.4.0:jar-no-fork (attach-sources) @ openwebbeans-spi ---
[INFO] Building jar: <https://ci-builds.apache.org/job/OpenWebBeans/job/OpenWebBeans%20CI%20(main)/ws/webbeans-spi/target/openwebbeans-spi-4.1.1-SNAPSHOT-sources.jar>
[INFO] 
[INFO] --- checkstyle:3.6.0:check (verify-style) @ openwebbeans-spi ---
[INFO] Starting audit...
Audit done.
[INFO] You have 0 Checkstyle violations.
[INFO] 
[INFO] --- apache-rat:0.16.1:check (default) @ openwebbeans-spi ---
[INFO] Rat check: Summary over all files. Unapproved: 0, unknown: 0, generated: 0, approved: 29 licenses.
[INFO] 
[INFO] --- install:3.1.4:install (default-install) @ openwebbeans-spi ---
[INFO] Installing <https://ci-builds.apache.org/job/OpenWebBeans/job/OpenWebBeans%20CI%20(main)/ws/webbeans-spi/pom.xml> to /home/jenkins/maven-repositories/0/org/apache/openwebbeans/openwebbeans-spi/4.1.1-SNAPSHOT/openwebbeans-spi-4.1.1-SNAPSHOT.pom
[INFO] Installing <https://ci-builds.apache.org/job/OpenWebBeans/job/OpenWebBeans%20CI%20(main)/ws/webbeans-spi/target/openwebbeans-spi-4.1.1-SNAPSHOT.jar> to /home/jenkins/maven-repositories/0/org/apache/openwebbeans/openwebbeans-spi/4.1.1-SNAPSHOT/openwebbeans-spi-4.1.1-SNAPSHOT.jar
[INFO] Installing <https://ci-builds.apache.org/job/OpenWebBeans/job/OpenWebBeans%20CI%20(main)/ws/webbeans-spi/target/openwebbeans-spi-4.1.1-SNAPSHOT-sources.jar> to /home/jenkins/maven-repositories/0/org/apache/openwebbeans/openwebbeans-spi/4.1.1-SNAPSHOT/openwebbeans-spi-4.1.1-SNAPSHOT-sources.jar
[INFO] 
[INFO] -------------< org.apache.openwebbeans:openwebbeans-impl >--------------
[INFO] Building OpenWebBeans Core 4.1.1-SNAPSHOT                         [3/31]
[INFO]   from webbeans-impl/pom.xml
[INFO] --------------------------------[ jar ]---------------------------------
[WARNING] The POM for org.apache.xbean:xbean-finder-shaded:jar:5.0.0-SNAPSHOT is missing, no dependency information available
[WARNING] The POM for org.apache.xbean:xbean-asm9-shaded:jar:5.0.0-SNAPSHOT is missing, no dependency information available
[INFO] ------------------------------------------------------------------------
[INFO] Reactor Summary for Apache OpenWebBeans 4.1.1-SNAPSHOT:
[INFO] 
[INFO] Apache OpenWebBeans ................................ SUCCESS [ 16.761 s]
[INFO] SPI definition ..................................... SUCCESS [ 15.280 s]
[INFO] OpenWebBeans Core .................................. FAILURE [  0.881 s]
[INFO] EL 2.2 plugin ...................................... SKIPPED
[INFO] Apache OpenWebBeans CDI Java SE Implementation ..... SKIPPED
[INFO] Web plugin ......................................... SKIPPED
[INFO] Tomcat plugin ...................................... SKIPPED
[INFO] EJB plugin ......................................... SKIPPED
[INFO] OWB Arquillian Parent .............................. SKIPPED
[INFO] OpenWebBeans-Standalone Arquillian connector ....... SKIPPED
[INFO] Slf4j Integration .................................. SKIPPED
[INFO] Gradle ShadowJar Plugin Integration ................ SKIPPED
[INFO] OpenWebBeans JUnit5 ................................ SKIPPED
[INFO] TCK Porting Pkg .................................... SKIPPED
[INFO] OWB JSR-330 Jakarta version TCK .................... SKIPPED
[INFO] EE Common plugin ................................... SKIPPED
[INFO] Java EE plugin ..................................... SKIPPED
[INFO] JMS plugin ......................................... SKIPPED
[INFO] JSR-365 TCK runner ................................. SKIPPED
[INFO] JSF-2 plugin ....................................... SKIPPED
[INFO] OSGi plugin ........................................ SKIPPED
[INFO] Distribution Pkg ................................... SKIPPED
[INFO] BOM ................................................ SKIPPED
[INFO] SE BOM ............................................. SKIPPED
[INFO] Web BOM ............................................ SKIPPED
[INFO] OpenWebBeans Java SE Sample ........................ SKIPPED
[INFO] OWB Samples ........................................ SKIPPED
[INFO] Sample Guess Application ........................... SKIPPED
[INFO] JSF Conversation Sample ............................ SKIPPED
[INFO] Sample JSF2 Application ............................ SKIPPED
[INFO] Sample Hotel Reservation Application ............... SKIPPED
[INFO] ------------------------------------------------------------------------
[INFO] BUILD FAILURE
[INFO] ------------------------------------------------------------------------
[INFO] Total time:  01:17 min
[INFO] Finished at: 2026-08-01T01:47:07Z
[INFO] ------------------------------------------------------------------------
Waiting for Jenkins to finish collecting data
[ERROR] Failed to execute goal on project openwebbeans-impl: Could not resolve dependencies for project org.apache.openwebbeans:openwebbeans-impl:jar:4.1.1-SNAPSHOT
[ERROR] dependency: org.apache.xbean:xbean-finder-shaded:jar:5.0.0-SNAPSHOT (compile)
[ERROR] Could not find artifact org.apache.xbean:xbean-finder-shaded:jar:5.0.0-SNAPSHOT
[ERROR] dependency: org.apache.xbean:xbean-asm9-shaded:jar:5.0.0-SNAPSHOT (compile)
[ERROR] Could not find artifact org.apache.xbean:xbean-asm9-shaded:jar:5.0.0-SNAPSHOT
[ERROR] -> [Help 1]
[ERROR] 
[ERROR] To see the full stack trace of the errors, re-run Maven with the -e switch.
[ERROR] Re-run Maven using the -X switch to enable full debug logging.
[ERROR] 
[ERROR] For more information about the errors and possible solutions, please read the following articles:
[ERROR] [Help 1] http://cwiki.apache.org/confluence/display/MAVEN/DependencyResolutionException
[ERROR] 
[ERROR] After correcting the problems, you can resume the build with the command
[ERROR]   mvn <goals> -rf :openwebbeans-impl
[JENKINS] Archiving <https://ci-builds.apache.org/job/OpenWebBeans/job/OpenWebBeans%20CI%20(main)/ws/webbeans-impl/pom.xml> to org.apache.openwebbeans/openwebbeans-impl/4.1.1-SNAPSHOT/openwebbeans-impl-4.1.1-SNAPSHOT.pom
[JENKINS] Archiving <https://ci-builds.apache.org/job/OpenWebBeans/job/OpenWebBeans%20CI%20(main)/ws/bom/openwebbeans-se-bom/pom.xml> to org.apache.openwebbeans.bom/openwebbeans-se-bom/4.1.1-SNAPSHOT/openwebbeans-se-bom-4.1.1-SNAPSHOT.pom
[JENKINS] Archiving <https://ci-builds.apache.org/job/OpenWebBeans/job/OpenWebBeans%20CI%20(main)/ws/webbeans-ee-common/pom.xml> to org.apache.openwebbeans/openwebbeans-ee-common/4.1.1-SNAPSHOT/openwebbeans-ee-common-4.1.1-SNAPSHOT.pom
[JENKINS] Archiving <https://ci-builds.apache.org/job/OpenWebBeans/job/OpenWebBeans%20CI%20(main)/ws/webbeans-jsf/pom.xml> to org.apache.openwebbeans/openwebbeans-jsf/4.1.1-SNAPSHOT/openwebbeans-jsf-4.1.1-SNAPSHOT.pom
[JENKINS] Archiving <https://ci-builds.apache.org/job/OpenWebBeans/job/OpenWebBeans%20CI%20(main)/ws/webbeans-arquillian/pom.xml> to org.apache.openwebbeans.arquillian/owb-arquillian-parent/4.1.1-SNAPSHOT/owb-arquillian-parent-4.1.1-SNAPSHOT.pom
[JENKINS] Archiving <https://ci-builds.apache.org/job/OpenWebBeans/job/OpenWebBeans%20CI%20(main)/ws/webbeans-el22/pom.xml> to org.apache.openwebbeans/openwebbeans-el22/4.1.1-SNAPSHOT/openwebbeans-el22-4.1.1-SNAPSHOT.pom
[JENKINS] Archiving <https://ci-builds.apache.org/job/OpenWebBeans/job/OpenWebBeans%20CI%20(main)/ws/samples/reservation/pom.xml> to org.apache.openwebbeans.samples/reservation/4.1.1-SNAPSHOT/reservation-4.1.1-SNAPSHOT.pom
[JENKINS] Archiving <https://ci-builds.apache.org/job/OpenWebBeans/job/OpenWebBeans%20CI%20(main)/ws/samples/standalone-sample/pom.xml> to org.apache.openwebbeans/standalone-sample/4.1.1-SNAPSHOT/standalone-sample-4.1.1-SNAPSHOT.pom
[JENKINS] Archiving <https://ci-builds.apache.org/job/OpenWebBeans/job/OpenWebBeans%20CI%20(main)/ws/webbeans-gradle/pom.xml> to org.apache.openwebbeans/openwebbeans-gradle/4.1.1-SNAPSHOT/openwebbeans-gradle-4.1.1-SNAPSHOT.pom
[JENKINS] Archiving <https://ci-builds.apache.org/job/OpenWebBeans/job/OpenWebBeans%20CI%20(main)/ws/samples/pom.xml> to org.apache.openwebbeans/samples/4.1.1-SNAPSHOT/samples-4.1.1-SNAPSHOT.pom
[JENKINS] Archiving <https://ci-builds.apache.org/job/OpenWebBeans/job/OpenWebBeans%20CI%20(main)/ws/webbeans-spi/pom.xml> to org.apache.openwebbeans/openwebbeans-spi/4.1.1-SNAPSHOT/openwebbeans-spi-4.1.1-SNAPSHOT.pom
[JENKINS] Archiving <https://ci-builds.apache.org/job/OpenWebBeans/job/OpenWebBeans%20CI%20(main)/ws/webbeans-spi/target/openwebbeans-spi-4.1.1-SNAPSHOT.jar> to org.apache.openwebbeans/openwebbeans-spi/4.1.1-SNAPSHOT/openwebbeans-spi-4.1.1-SNAPSHOT.jar
[JENKINS] Archiving <https://ci-builds.apache.org/job/OpenWebBeans/job/OpenWebBeans%20CI%20(main)/ws/webbeans-spi/target/openwebbeans-spi-4.1.1-SNAPSHOT-sources.jar> to org.apache.openwebbeans/openwebbeans-spi/4.1.1-SNAPSHOT/openwebbeans-spi-4.1.1-SNAPSHOT-sources.jar
[JENKINS] Archiving <https://ci-builds.apache.org/job/OpenWebBeans/job/OpenWebBeans%20CI%20(main)/ws/samples/guess/pom.xml> to org.apache.openwebbeans.samples/guess/4.1.1-SNAPSHOT/guess-4.1.1-SNAPSHOT.pom
[JENKINS] Archiving <https://ci-builds.apache.org/job/OpenWebBeans/job/OpenWebBeans%20CI%20(main)/ws/webbeans-se/pom.xml> to org.apache.openwebbeans/openwebbeans-se/4.1.1-SNAPSHOT/openwebbeans-se-4.1.1-SNAPSHOT.pom
[JENKINS] Archiving <https://ci-builds.apache.org/job/OpenWebBeans/job/OpenWebBeans%20CI%20(main)/ws/webbeans-osgi/pom.xml> to org.apache.openwebbeans/openwebbeans-osgi/4.1.1-SNAPSHOT/openwebbeans-osgi-4.1.1-SNAPSHOT.pom
[JENKINS] Archiving <https://ci-builds.apache.org/job/OpenWebBeans/job/OpenWebBeans%20CI%20(main)/ws/samples/jsf2sample/pom.xml> to org.apache.openwebbeans.samples/jsf2sample/4.1.1-SNAPSHOT/jsf2sample-4.1.1-SNAPSHOT.pom
[JENKINS] Archiving <https://ci-builds.apache.org/job/OpenWebBeans/job/OpenWebBeans%20CI%20(main)/ws/pom.xml> to org.apache.openwebbeans/openwebbeans/4.1.1-SNAPSHOT/openwebbeans-4.1.1-SNAPSHOT.pom
[JENKINS] Archiving <https://ci-builds.apache.org/job/OpenWebBeans/job/OpenWebBeans%20CI%20(main)/ws/webbeans-tck/pom.xml> to org.apache.openwebbeans/openwebbeans-tck/4.1.1-SNAPSHOT/openwebbeans-tck-4.1.1-SNAPSHOT.pom
[JENKINS] Archiving <https://ci-builds.apache.org/job/OpenWebBeans/job/OpenWebBeans%20CI%20(main)/ws/webbeans-ee/pom.xml> to org.apache.openwebbeans/openwebbeans-ee/4.1.1-SNAPSHOT/openwebbeans-ee-4.1.1-SNAPSHOT.pom
[JENKINS] Archiving <https://ci-builds.apache.org/job/OpenWebBeans/job/OpenWebBeans%20CI%20(main)/ws/webbeans-slf4j/pom.xml> to org.apache.openwebbeans/openwebbeans-slf4j/4.1.1-SNAPSHOT/openwebbeans-slf4j-4.1.1-SNAPSHOT.pom
[JENKINS] Archiving <https://ci-builds.apache.org/job/OpenWebBeans/job/OpenWebBeans%20CI%20(main)/ws/webbeans-ejb/pom.xml> to org.apache.openwebbeans/openwebbeans-ejb/4.1.1-SNAPSHOT/openwebbeans-ejb-4.1.1-SNAPSHOT.pom
[JENKINS] Archiving <https://ci-builds.apache.org/job/OpenWebBeans/job/OpenWebBeans%20CI%20(main)/ws/webbeans-junit5/pom.xml> to org.apache.openwebbeans/openwebbeans-junit5/4.1.1-SNAPSHOT/openwebbeans-junit5-4.1.1-SNAPSHOT.pom
[JENKINS] Archiving <https://ci-builds.apache.org/job/OpenWebBeans/job/OpenWebBeans%20CI%20(main)/ws/bom/pom.xml> to org.apache.openwebbeans.bom/bom/4.1.1-SNAPSHOT/bom-4.1.1-SNAPSHOT.pom
[JENKINS] Archiving <https://ci-builds.apache.org/job/OpenWebBeans/job/OpenWebBeans%20CI%20(main)/ws/samples/conversation-sample/pom.xml> to org.apache.openwebbeans.samples/conversation-sample/4.1.1-SNAPSHOT/conversation-sample-4.1.1-SNAPSHOT.pom
[JENKINS] Archiving <https://ci-builds.apache.org/job/OpenWebBeans/job/OpenWebBeans%20CI%20(main)/ws/webbeans-web/pom.xml> to org.apache.openwebbeans/openwebbeans-web/4.1.1-SNAPSHOT/openwebbeans-web-4.1.1-SNAPSHOT.pom
[JENKINS] Archiving <https://ci-builds.apache.org/job/OpenWebBeans/job/OpenWebBeans%20CI%20(main)/ws/webbeans-porting/pom.xml> to org.apache.openwebbeans/openwebbeans-porting/4.1.1-SNAPSHOT/openwebbeans-porting-4.1.1-SNAPSHOT.pom
[JENKINS] Archiving <https://ci-builds.apache.org/job/OpenWebBeans/job/OpenWebBeans%20CI%20(main)/ws/webbeans-tomcat/pom.xml> to org.apache.openwebbeans/openwebbeans-tomcat/4.1.1-SNAPSHOT/openwebbeans-tomcat-4.1.1-SNAPSHOT.pom
[JENKINS] Archiving <https://ci-builds.apache.org/job/OpenWebBeans/job/OpenWebBeans%20CI%20(main)/ws/webbeans-jms/pom.xml> to org.apache.openwebbeans/openwebbeans-jms/4.1.1-SNAPSHOT/openwebbeans-jms-4.1.1-SNAPSHOT.pom
[JENKINS] Archiving <https://ci-builds.apache.org/job/OpenWebBeans/job/OpenWebBeans%20CI%20(main)/ws/bom/openwebbeans-web-bom/pom.xml> to org.apache.openwebbeans.bom/openwebbeans-web-bom/4.1.1-SNAPSHOT/openwebbeans-web-bom-4.1.1-SNAPSHOT.pom
[JENKINS] Archiving <https://ci-builds.apache.org/job/OpenWebBeans/job/OpenWebBeans%20CI%20(main)/ws/atinject-tck/pom.xml> to org.apache.openwebbeans/atinject-tck/4.1.1-SNAPSHOT/atinject-tck-4.1.1-SNAPSHOT.pom
[JENKINS] Archiving <https://ci-builds.apache.org/job/OpenWebBeans/job/OpenWebBeans%20CI%20(main)/ws/distribution/pom.xml> to org.apache.openwebbeans/openwebbeans-distribution/4.1.1-SNAPSHOT/openwebbeans-distribution-4.1.1-SNAPSHOT.pom
[JENKINS] Archiving <https://ci-builds.apache.org/job/OpenWebBeans/job/OpenWebBeans%20CI%20(main)/ws/webbeans-arquillian/owb-arquillian-standalone/pom.xml> to org.apache.openwebbeans.arquillian/owb-arquillian-standalone/4.1.1-SNAPSHOT/owb-arquillian-standalone-4.1.1-SNAPSHOT.pom
channel stopped

Build failed in Jenkins: OpenWebBeans » OpenWebBeans CI (main) #132

Posted by Apache Jenkins Server <je...@builds.apache.org>.
See <https://ci-builds.apache.org/job/OpenWebBeans/job/OpenWebBeans%20CI%20(main)/132/display/redirect?page=changes>

Changes:

[Mark Struberg] OWB-1463 use (beanDeploymentUrls.size() / 2) for thread size

[Mark Struberg] OWB-1471 Create an annotation to mark implementations as @ThreadSafe

[Mark Struberg] Context is not used, remove it.


------------------------------------------
[...truncated 3.76 KiB...]
[INFO] Web plugin                                                         [jar]
[INFO] Tomcat plugin                                                      [jar]
[INFO] EJB plugin                                                         [jar]
[INFO] OWB Arquillian Parent                                              [pom]
[INFO] OpenWebBeans-Standalone Arquillian connector                       [jar]
[INFO] Slf4j Integration                                                  [jar]
[INFO] Gradle ShadowJar Plugin Integration                                [jar]
[INFO] OpenWebBeans JUnit5                                                [jar]
[INFO] TCK Porting Pkg                                                    [jar]
[INFO] OWB JSR-330 Jakarta version TCK                                    [jar]
[INFO] EE Common plugin                                                   [jar]
[INFO] Java EE plugin                                                     [jar]
[INFO] JMS plugin                                                         [jar]
[INFO] JSR-365 TCK runner                                                 [jar]
[INFO] JSF-2 plugin                                                       [jar]
[INFO] OSGi plugin                                                        [jar]
[INFO] Distribution Pkg                                                   [pom]
[INFO] BOM                                                                [pom]
[INFO] SE BOM                                                             [pom]
[INFO] Web BOM                                                            [pom]
[INFO] OpenWebBeans Java SE Sample                                        [jar]
[INFO] OWB Samples                                                        [pom]
[INFO] Sample Guess Application                                           [war]
[INFO] JSF Conversation Sample                                            [war]
[INFO] Sample JSF2 Application                                            [war]
[INFO] Sample Hotel Reservation Application                               [war]
[HUDSON] Collecting dependencies info
[HUDSON] Collecting dependencies info
[HUDSON] Collecting dependencies info
[HUDSON] Collecting dependencies info
[HUDSON] Collecting dependencies info
[HUDSON] Collecting dependencies info
[HUDSON] Collecting dependencies info
[HUDSON] Collecting dependencies info
[HUDSON] Collecting dependencies info
[HUDSON] Collecting dependencies info
[HUDSON] Collecting dependencies info
[HUDSON] Collecting dependencies info
[HUDSON] Collecting dependencies info
[INFO] 
[INFO] ----------------< org.apache.openwebbeans:openwebbeans >----------------
[INFO] Building Apache OpenWebBeans 4.1.1-SNAPSHOT                       [1/31]
[INFO]   from pom.xml
[INFO] --------------------------------[ pom ]---------------------------------
[INFO] 
[INFO] --- clean:3.5.0:clean (default-clean) @ openwebbeans ---
[INFO] 
[INFO] --- enforcer:3.6.2:enforce (enforce-maven-version) @ openwebbeans ---
[INFO] Rule 0: org.apache.maven.enforcer.rules.version.RequireMavenVersion passed
[INFO] 
[INFO] --- enforcer:3.6.2:enforce (enforce-java-version) @ openwebbeans ---
[INFO] Rule 0: org.apache.maven.enforcer.rules.version.RequireJavaVersion passed
[INFO] 
[INFO] --- remote-resources:3.2.0:process (default) @ openwebbeans ---
[INFO] Preparing remote bundle org.apache:apache-jar-resource-bundle:1.4
[INFO] Copying 3 resources from 1 bundle.
[INFO] 
[INFO] --- remote-resources:3.2.0:process (process-resource-bundles) @ openwebbeans ---
[INFO] Preparing remote bundle org.apache.apache.resources:apache-jar-resource-bundle:1.7
[INFO] Copying 3 resources from 1 bundle.
[INFO] 
[INFO] --- bundle:5.1.9:manifest (bundle-manifest) @ openwebbeans ---
[WARNING] Ignoring project type pom - supportedProjectTypes = [jar, bundle, war]
[INFO] 
[INFO] --- source:3.4.0:jar-no-fork (attach-sources) @ openwebbeans ---
[INFO] 
[INFO] --- checkstyle:3.6.0:check (verify-style) @ openwebbeans ---
[INFO] Starting audit...
Audit done.
[INFO] You have 0 Checkstyle violations.
[INFO] 
[INFO] --- apache-rat:0.16.1:check (default) @ openwebbeans ---
[INFO] Rat check: Summary over all files. Unapproved: 0, unknown: 0, generated: 0, approved: 1 licenses.
[INFO] 
[INFO] --- install:3.1.4:install (default-install) @ openwebbeans ---
[INFO] Installing <https://ci-builds.apache.org/job/OpenWebBeans/job/OpenWebBeans%20CI%20(main)/ws/pom.xml> to /home/jenkins/jenkins-agent/maven-repositories/1/org/apache/openwebbeans/openwebbeans/4.1.1-SNAPSHOT/openwebbeans-4.1.1-SNAPSHOT.pom
[WARNING] Attempt to (de-)serialize anonymous class org.jfrog.hudson.maven2.MavenDependenciesRecorder$1; see: https://jenkins.io/redirect/serialization-of-anonymous-classes/
[INFO] 
[INFO] --------------< org.apache.openwebbeans:openwebbeans-spi >--------------
[INFO] Building SPI definition 4.1.1-SNAPSHOT                            [2/31]
[INFO]   from webbeans-spi/pom.xml
[INFO] --------------------------------[ jar ]---------------------------------
[INFO] 
[INFO] --- clean:3.5.0:clean (default-clean) @ openwebbeans-spi ---
[INFO] 
[INFO] --- enforcer:3.6.2:enforce (enforce-maven-version) @ openwebbeans-spi ---
[INFO] 
[INFO] --- enforcer:3.6.2:enforce (enforce-java-version) @ openwebbeans-spi ---
[INFO] 
[INFO] --- remote-resources:3.2.0:process (default) @ openwebbeans-spi ---
[INFO] Preparing remote bundle org.apache:apache-jar-resource-bundle:1.4
[INFO] Copying 3 resources from 1 bundle.
[INFO] 
[INFO] --- remote-resources:3.2.0:process (process-resource-bundles) @ openwebbeans-spi ---
[INFO] Preparing remote bundle org.apache.apache.resources:apache-jar-resource-bundle:1.7
[INFO] Copying 3 resources from 1 bundle.
[INFO] 
[INFO] --- resources:3.4.0:resources (default-resources) @ openwebbeans-spi ---
[INFO] skip non existing resourceDirectory <https://ci-builds.apache.org/job/OpenWebBeans/job/OpenWebBeans%20CI%20(main)/ws/webbeans-spi/src/main/resources>
[INFO] Copying 3 resources from target/maven-shared-archive-resources to target/classes
[INFO] Copying 3 resources from target/maven-shared-archive-resources to target/classes
[INFO] 
[INFO] --- compiler:3.15.0:compile (default-compile) @ openwebbeans-spi ---
[INFO] Recompiling the module because of changed source code.
[INFO] Compiling 25 source files with javac [debug release 17] to target/classes
[WARNING] <https://ci-builds.apache.org/job/OpenWebBeans/job/OpenWebBeans%20CI%20(main)/ws/webbeans-spi/src/main/java/org/apache/webbeans/spi/BDABeansXmlScanner.java>:[28,8] deprecated item is not annotated with @Deprecated
[WARNING] <https://ci-builds.apache.org/job/OpenWebBeans/job/OpenWebBeans%20CI%20(main)/ws/webbeans-spi/src/main/java/org/apache/webbeans/spi/ResourceInjectionService.java>:[88,22] deprecated item is not annotated with @Deprecated
[WARNING] <https://ci-builds.apache.org/job/OpenWebBeans/job/OpenWebBeans%20CI%20(main)/ws/webbeans-spi/src/main/java/org/apache/webbeans/spi/ResourceInjectionService.java>:[97,19] deprecated item is not annotated with @Deprecated
[WARNING] <https://ci-builds.apache.org/job/OpenWebBeans/job/OpenWebBeans%20CI%20(main)/ws/webbeans-spi/src/main/java/org/apache/webbeans/spi/api/ResourceReference.java>:[93,42] non-varargs call of varargs method with inexact argument type for last parameter;
  cast to java.lang.Class for a varargs call
  cast to java.lang.Class[] for a non-varargs call and to suppress this warning
[WARNING] <https://ci-builds.apache.org/job/OpenWebBeans/job/OpenWebBeans%20CI%20(main)/ws/webbeans-spi/src/main/java/org/apache/webbeans/spi/api/ResourceReference.java>:[109,69] non-varargs call of varargs method with inexact argument type for last parameter;
  cast to java.lang.Object for a varargs call
  cast to java.lang.Object[] for a non-varargs call and to suppress this warning
[INFO] <https://ci-builds.apache.org/job/OpenWebBeans/job/OpenWebBeans%20CI%20(main)/ws/webbeans-spi/src/main/java/org/apache/webbeans/spi/ScannerService.java>: <https://ci-builds.apache.org/job/OpenWebBeans/job/OpenWebBeans%20CI%20(main)/ws/webbeans-spi/src/main/java/org/apache/webbeans/spi/ScannerService.java> uses or overrides a deprecated API.
[INFO] <https://ci-builds.apache.org/job/OpenWebBeans/job/OpenWebBeans%20CI%20(main)/ws/webbeans-spi/src/main/java/org/apache/webbeans/spi/ScannerService.java>: Recompile with -Xlint:deprecation for details.
[INFO] <https://ci-builds.apache.org/job/OpenWebBeans/job/OpenWebBeans%20CI%20(main)/ws/webbeans-spi/src/main/java/org/apache/webbeans/spi/api/ResourceReference.java>: <https://ci-builds.apache.org/job/OpenWebBeans/job/OpenWebBeans%20CI%20(main)/ws/webbeans-spi/src/main/java/org/apache/webbeans/spi/api/ResourceReference.java> uses unchecked or unsafe operations.
[INFO] <https://ci-builds.apache.org/job/OpenWebBeans/job/OpenWebBeans%20CI%20(main)/ws/webbeans-spi/src/main/java/org/apache/webbeans/spi/api/ResourceReference.java>: Recompile with -Xlint:unchecked for details.
[INFO] 
[INFO] --- bundle:5.1.9:manifest (bundle-manifest) @ openwebbeans-spi ---
[INFO] No MANIFEST.MF file found, generating manifest.
[INFO] Writing manifest: <https://ci-builds.apache.org/job/OpenWebBeans/job/OpenWebBeans%20CI%20(main)/ws/webbeans-spi/target/classes/META-INF/MANIFEST.MF>
[INFO] 
[INFO] --- resources:3.4.0:testResources (default-testResources) @ openwebbeans-spi ---
[INFO] skip non existing resourceDirectory <https://ci-builds.apache.org/job/OpenWebBeans/job/OpenWebBeans%20CI%20(main)/ws/webbeans-spi/src/test/resources>
[INFO] Copying 3 resources from target/maven-shared-archive-resources to target/test-classes
[INFO] Copying 3 resources from target/maven-shared-archive-resources to target/test-classes
[INFO] 
[INFO] --- compiler:3.15.0:testCompile (default-testCompile) @ openwebbeans-spi ---
[INFO] No sources to compile
[INFO] 
[INFO] --- surefire:3.2.2:test (default-test) @ openwebbeans-spi ---
[JENKINS] Recording test results
[INFO] 
[INFO] --- jar:3.3.0:jar (default-jar) @ openwebbeans-spi ---
[INFO] Building jar: <https://ci-builds.apache.org/job/OpenWebBeans/job/OpenWebBeans%20CI%20(main)/ws/webbeans-spi/target/openwebbeans-spi-4.1.1-SNAPSHOT.jar>
[INFO] 
[INFO] --- source:3.4.0:jar-no-fork (attach-sources) @ openwebbeans-spi ---
[INFO] Building jar: <https://ci-builds.apache.org/job/OpenWebBeans/job/OpenWebBeans%20CI%20(main)/ws/webbeans-spi/target/openwebbeans-spi-4.1.1-SNAPSHOT-sources.jar>
[INFO] 
[INFO] --- checkstyle:3.6.0:check (verify-style) @ openwebbeans-spi ---
[INFO] Starting audit...
Audit done.
[INFO] You have 0 Checkstyle violations.
[INFO] 
[INFO] --- apache-rat:0.16.1:check (default) @ openwebbeans-spi ---
[INFO] Rat check: Summary over all files. Unapproved: 0, unknown: 0, generated: 0, approved: 29 licenses.
[INFO] 
[INFO] --- install:3.1.4:install (default-install) @ openwebbeans-spi ---
[INFO] Installing <https://ci-builds.apache.org/job/OpenWebBeans/job/OpenWebBeans%20CI%20(main)/ws/webbeans-spi/pom.xml> to /home/jenkins/jenkins-agent/maven-repositories/1/org/apache/openwebbeans/openwebbeans-spi/4.1.1-SNAPSHOT/openwebbeans-spi-4.1.1-SNAPSHOT.pom
[INFO] Installing <https://ci-builds.apache.org/job/OpenWebBeans/job/OpenWebBeans%20CI%20(main)/ws/webbeans-spi/target/openwebbeans-spi-4.1.1-SNAPSHOT.jar> to /home/jenkins/jenkins-agent/maven-repositories/1/org/apache/openwebbeans/openwebbeans-spi/4.1.1-SNAPSHOT/openwebbeans-spi-4.1.1-SNAPSHOT.jar
[INFO] Installing <https://ci-builds.apache.org/job/OpenWebBeans/job/OpenWebBeans%20CI%20(main)/ws/webbeans-spi/target/openwebbeans-spi-4.1.1-SNAPSHOT-sources.jar> to /home/jenkins/jenkins-agent/maven-repositories/1/org/apache/openwebbeans/openwebbeans-spi/4.1.1-SNAPSHOT/openwebbeans-spi-4.1.1-SNAPSHOT-sources.jar
[INFO] 
[INFO] -------------< org.apache.openwebbeans:openwebbeans-impl >--------------
[INFO] Building OpenWebBeans Core 4.1.1-SNAPSHOT                         [3/31]
[INFO]   from webbeans-impl/pom.xml
[INFO] --------------------------------[ jar ]---------------------------------
[WARNING] The POM for org.apache.xbean:xbean-finder-shaded:jar:5.0.0-SNAPSHOT is missing, no dependency information available
[WARNING] The POM for org.apache.xbean:xbean-asm9-shaded:jar:5.0.0-SNAPSHOT is missing, no dependency information available
[INFO] ------------------------------------------------------------------------
[INFO] Reactor Summary for Apache OpenWebBeans 4.1.1-SNAPSHOT:
[INFO] 
[INFO] Apache OpenWebBeans ................................ SUCCESS [ 13.223 s]
[INFO] SPI definition ..................................... SUCCESS [ 13.090 s]
[INFO] OpenWebBeans Core .................................. FAILURE [  0.726 s]
[INFO] EL 2.2 plugin ...................................... SKIPPED
[INFO] Apache OpenWebBeans CDI Java SE Implementation ..... SKIPPED
[INFO] Web plugin ......................................... SKIPPED
[INFO] Tomcat plugin ...................................... SKIPPED
[INFO] EJB plugin ......................................... SKIPPED
[INFO] OWB Arquillian Parent .............................. SKIPPED
[INFO] OpenWebBeans-Standalone Arquillian connector ....... SKIPPED
[INFO] Slf4j Integration .................................. SKIPPED
[INFO] Gradle ShadowJar Plugin Integration ................ SKIPPED
[INFO] OpenWebBeans JUnit5 ................................ SKIPPED
[INFO] TCK Porting Pkg .................................... SKIPPED
[INFO] OWB JSR-330 Jakarta version TCK .................... SKIPPED
[INFO] EE Common plugin ................................... SKIPPED
[INFO] Java EE plugin ..................................... SKIPPED
[INFO] JMS plugin ......................................... SKIPPED
[INFO] JSR-365 TCK runner ................................. SKIPPED
[INFO] JSF-2 plugin ....................................... SKIPPED
[INFO] OSGi plugin ........................................ SKIPPED
[INFO] Distribution Pkg ................................... SKIPPED
[INFO] BOM ................................................ SKIPPED
[INFO] SE BOM ............................................. SKIPPED
[INFO] Web BOM ............................................ SKIPPED
[INFO] OpenWebBeans Java SE Sample ........................ SKIPPED
[INFO] OWB Samples ........................................ SKIPPED
[INFO] Sample Guess Application ........................... SKIPPED
[INFO] JSF Conversation Sample ............................ SKIPPED
[INFO] Sample JSF2 Application ............................ SKIPPED
[INFO] Sample Hotel Reservation Application ............... SKIPPED
[INFO] ------------------------------------------------------------------------
[INFO] BUILD FAILURE
[INFO] ------------------------------------------------------------------------
[INFO] Total time:  01:19 min
[INFO] Finished at: 2026-07-31T01:47:18Z
[INFO] ------------------------------------------------------------------------
Waiting for Jenkins to finish collecting data
[ERROR] Failed to execute goal on project openwebbeans-impl: Could not resolve dependencies for project org.apache.openwebbeans:openwebbeans-impl:jar:4.1.1-SNAPSHOT
[ERROR] dependency: org.apache.xbean:xbean-finder-shaded:jar:5.0.0-SNAPSHOT (compile)
[ERROR] Could not find artifact org.apache.xbean:xbean-finder-shaded:jar:5.0.0-SNAPSHOT
[ERROR] dependency: org.apache.xbean:xbean-asm9-shaded:jar:5.0.0-SNAPSHOT (compile)
[ERROR] Could not find artifact org.apache.xbean:xbean-asm9-shaded:jar:5.0.0-SNAPSHOT
[ERROR] -> [Help 1]
[ERROR] 
[ERROR] To see the full stack trace of the errors, re-run Maven with the -e switch.
[ERROR] Re-run Maven using the -X switch to enable full debug logging.
[ERROR] 
[ERROR] For more information about the errors and possible solutions, please read the following articles:
[ERROR] [Help 1] http://cwiki.apache.org/confluence/display/MAVEN/DependencyResolutionException
[ERROR] 
[ERROR] After correcting the problems, you can resume the build with the command
[ERROR]   mvn <goals> -rf :openwebbeans-impl
[JENKINS] Archiving <https://ci-builds.apache.org/job/OpenWebBeans/job/OpenWebBeans%20CI%20(main)/ws/webbeans-impl/pom.xml> to org.apache.openwebbeans/openwebbeans-impl/4.1.1-SNAPSHOT/openwebbeans-impl-4.1.1-SNAPSHOT.pom
[JENKINS] Archiving <https://ci-builds.apache.org/job/OpenWebBeans/job/OpenWebBeans%20CI%20(main)/ws/bom/openwebbeans-se-bom/pom.xml> to org.apache.openwebbeans.bom/openwebbeans-se-bom/4.1.1-SNAPSHOT/openwebbeans-se-bom-4.1.1-SNAPSHOT.pom
[JENKINS] Archiving <https://ci-builds.apache.org/job/OpenWebBeans/job/OpenWebBeans%20CI%20(main)/ws/webbeans-ee-common/pom.xml> to org.apache.openwebbeans/openwebbeans-ee-common/4.1.1-SNAPSHOT/openwebbeans-ee-common-4.1.1-SNAPSHOT.pom
[JENKINS] Archiving <https://ci-builds.apache.org/job/OpenWebBeans/job/OpenWebBeans%20CI%20(main)/ws/webbeans-jsf/pom.xml> to org.apache.openwebbeans/openwebbeans-jsf/4.1.1-SNAPSHOT/openwebbeans-jsf-4.1.1-SNAPSHOT.pom
[JENKINS] Archiving <https://ci-builds.apache.org/job/OpenWebBeans/job/OpenWebBeans%20CI%20(main)/ws/webbeans-arquillian/pom.xml> to org.apache.openwebbeans.arquillian/owb-arquillian-parent/4.1.1-SNAPSHOT/owb-arquillian-parent-4.1.1-SNAPSHOT.pom
[JENKINS] Archiving <https://ci-builds.apache.org/job/OpenWebBeans/job/OpenWebBeans%20CI%20(main)/ws/webbeans-el22/pom.xml> to org.apache.openwebbeans/openwebbeans-el22/4.1.1-SNAPSHOT/openwebbeans-el22-4.1.1-SNAPSHOT.pom
[JENKINS] Archiving <https://ci-builds.apache.org/job/OpenWebBeans/job/OpenWebBeans%20CI%20(main)/ws/samples/reservation/pom.xml> to org.apache.openwebbeans.samples/reservation/4.1.1-SNAPSHOT/reservation-4.1.1-SNAPSHOT.pom
[JENKINS] Archiving <https://ci-builds.apache.org/job/OpenWebBeans/job/OpenWebBeans%20CI%20(main)/ws/samples/standalone-sample/pom.xml> to org.apache.openwebbeans/standalone-sample/4.1.1-SNAPSHOT/standalone-sample-4.1.1-SNAPSHOT.pom
[JENKINS] Archiving <https://ci-builds.apache.org/job/OpenWebBeans/job/OpenWebBeans%20CI%20(main)/ws/webbeans-gradle/pom.xml> to org.apache.openwebbeans/openwebbeans-gradle/4.1.1-SNAPSHOT/openwebbeans-gradle-4.1.1-SNAPSHOT.pom
[JENKINS] Archiving <https://ci-builds.apache.org/job/OpenWebBeans/job/OpenWebBeans%20CI%20(main)/ws/samples/pom.xml> to org.apache.openwebbeans/samples/4.1.1-SNAPSHOT/samples-4.1.1-SNAPSHOT.pom
[JENKINS] Archiving <https://ci-builds.apache.org/job/OpenWebBeans/job/OpenWebBeans%20CI%20(main)/ws/webbeans-spi/pom.xml> to org.apache.openwebbeans/openwebbeans-spi/4.1.1-SNAPSHOT/openwebbeans-spi-4.1.1-SNAPSHOT.pom
[JENKINS] Archiving <https://ci-builds.apache.org/job/OpenWebBeans/job/OpenWebBeans%20CI%20(main)/ws/webbeans-spi/target/openwebbeans-spi-4.1.1-SNAPSHOT.jar> to org.apache.openwebbeans/openwebbeans-spi/4.1.1-SNAPSHOT/openwebbeans-spi-4.1.1-SNAPSHOT.jar
[JENKINS] Archiving <https://ci-builds.apache.org/job/OpenWebBeans/job/OpenWebBeans%20CI%20(main)/ws/webbeans-spi/target/openwebbeans-spi-4.1.1-SNAPSHOT-sources.jar> to org.apache.openwebbeans/openwebbeans-spi/4.1.1-SNAPSHOT/openwebbeans-spi-4.1.1-SNAPSHOT-sources.jar
[JENKINS] Archiving <https://ci-builds.apache.org/job/OpenWebBeans/job/OpenWebBeans%20CI%20(main)/ws/samples/guess/pom.xml> to org.apache.openwebbeans.samples/guess/4.1.1-SNAPSHOT/guess-4.1.1-SNAPSHOT.pom
[JENKINS] Archiving <https://ci-builds.apache.org/job/OpenWebBeans/job/OpenWebBeans%20CI%20(main)/ws/webbeans-se/pom.xml> to org.apache.openwebbeans/openwebbeans-se/4.1.1-SNAPSHOT/openwebbeans-se-4.1.1-SNAPSHOT.pom
[JENKINS] Archiving <https://ci-builds.apache.org/job/OpenWebBeans/job/OpenWebBeans%20CI%20(main)/ws/webbeans-osgi/pom.xml> to org.apache.openwebbeans/openwebbeans-osgi/4.1.1-SNAPSHOT/openwebbeans-osgi-4.1.1-SNAPSHOT.pom
[JENKINS] Archiving <https://ci-builds.apache.org/job/OpenWebBeans/job/OpenWebBeans%20CI%20(main)/ws/samples/jsf2sample/pom.xml> to org.apache.openwebbeans.samples/jsf2sample/4.1.1-SNAPSHOT/jsf2sample-4.1.1-SNAPSHOT.pom
[JENKINS] Archiving <https://ci-builds.apache.org/job/OpenWebBeans/job/OpenWebBeans%20CI%20(main)/ws/pom.xml> to org.apache.openwebbeans/openwebbeans/4.1.1-SNAPSHOT/openwebbeans-4.1.1-SNAPSHOT.pom
[JENKINS] Archiving <https://ci-builds.apache.org/job/OpenWebBeans/job/OpenWebBeans%20CI%20(main)/ws/webbeans-tck/pom.xml> to org.apache.openwebbeans/openwebbeans-tck/4.1.1-SNAPSHOT/openwebbeans-tck-4.1.1-SNAPSHOT.pom
[JENKINS] Archiving <https://ci-builds.apache.org/job/OpenWebBeans/job/OpenWebBeans%20CI%20(main)/ws/webbeans-ee/pom.xml> to org.apache.openwebbeans/openwebbeans-ee/4.1.1-SNAPSHOT/openwebbeans-ee-4.1.1-SNAPSHOT.pom
[JENKINS] Archiving <https://ci-builds.apache.org/job/OpenWebBeans/job/OpenWebBeans%20CI%20(main)/ws/webbeans-slf4j/pom.xml> to org.apache.openwebbeans/openwebbeans-slf4j/4.1.1-SNAPSHOT/openwebbeans-slf4j-4.1.1-SNAPSHOT.pom
[JENKINS] Archiving <https://ci-builds.apache.org/job/OpenWebBeans/job/OpenWebBeans%20CI%20(main)/ws/webbeans-ejb/pom.xml> to org.apache.openwebbeans/openwebbeans-ejb/4.1.1-SNAPSHOT/openwebbeans-ejb-4.1.1-SNAPSHOT.pom
[JENKINS] Archiving <https://ci-builds.apache.org/job/OpenWebBeans/job/OpenWebBeans%20CI%20(main)/ws/webbeans-junit5/pom.xml> to org.apache.openwebbeans/openwebbeans-junit5/4.1.1-SNAPSHOT/openwebbeans-junit5-4.1.1-SNAPSHOT.pom
[JENKINS] Archiving <https://ci-builds.apache.org/job/OpenWebBeans/job/OpenWebBeans%20CI%20(main)/ws/bom/pom.xml> to org.apache.openwebbeans.bom/bom/4.1.1-SNAPSHOT/bom-4.1.1-SNAPSHOT.pom
[JENKINS] Archiving <https://ci-builds.apache.org/job/OpenWebBeans/job/OpenWebBeans%20CI%20(main)/ws/samples/conversation-sample/pom.xml> to org.apache.openwebbeans.samples/conversation-sample/4.1.1-SNAPSHOT/conversation-sample-4.1.1-SNAPSHOT.pom
[JENKINS] Archiving <https://ci-builds.apache.org/job/OpenWebBeans/job/OpenWebBeans%20CI%20(main)/ws/webbeans-web/pom.xml> to org.apache.openwebbeans/openwebbeans-web/4.1.1-SNAPSHOT/openwebbeans-web-4.1.1-SNAPSHOT.pom
[JENKINS] Archiving <https://ci-builds.apache.org/job/OpenWebBeans/job/OpenWebBeans%20CI%20(main)/ws/webbeans-porting/pom.xml> to org.apache.openwebbeans/openwebbeans-porting/4.1.1-SNAPSHOT/openwebbeans-porting-4.1.1-SNAPSHOT.pom
[JENKINS] Archiving <https://ci-builds.apache.org/job/OpenWebBeans/job/OpenWebBeans%20CI%20(main)/ws/webbeans-tomcat/pom.xml> to org.apache.openwebbeans/openwebbeans-tomcat/4.1.1-SNAPSHOT/openwebbeans-tomcat-4.1.1-SNAPSHOT.pom
[JENKINS] Archiving <https://ci-builds.apache.org/job/OpenWebBeans/job/OpenWebBeans%20CI%20(main)/ws/webbeans-jms/pom.xml> to org.apache.openwebbeans/openwebbeans-jms/4.1.1-SNAPSHOT/openwebbeans-jms-4.1.1-SNAPSHOT.pom
[JENKINS] Archiving <https://ci-builds.apache.org/job/OpenWebBeans/job/OpenWebBeans%20CI%20(main)/ws/bom/openwebbeans-web-bom/pom.xml> to org.apache.openwebbeans.bom/openwebbeans-web-bom/4.1.1-SNAPSHOT/openwebbeans-web-bom-4.1.1-SNAPSHOT.pom
[JENKINS] Archiving <https://ci-builds.apache.org/job/OpenWebBeans/job/OpenWebBeans%20CI%20(main)/ws/atinject-tck/pom.xml> to org.apache.openwebbeans/atinject-tck/4.1.1-SNAPSHOT/atinject-tck-4.1.1-SNAPSHOT.pom
[JENKINS] Archiving <https://ci-builds.apache.org/job/OpenWebBeans/job/OpenWebBeans%20CI%20(main)/ws/distribution/pom.xml> to org.apache.openwebbeans/openwebbeans-distribution/4.1.1-SNAPSHOT/openwebbeans-distribution-4.1.1-SNAPSHOT.pom
[JENKINS] Archiving <https://ci-builds.apache.org/job/OpenWebBeans/job/OpenWebBeans%20CI%20(main)/ws/webbeans-arquillian/owb-arquillian-standalone/pom.xml> to org.apache.openwebbeans.arquillian/owb-arquillian-standalone/4.1.1-SNAPSHOT/owb-arquillian-standalone-4.1.1-SNAPSHOT.pom
channel stopped

Build failed in Jenkins: OpenWebBeans » OpenWebBeans CI (main) #131

Posted by Apache Jenkins Server <je...@builds.apache.org>.
See <https://ci-builds.apache.org/job/OpenWebBeans/job/OpenWebBeans%20CI%20(main)/131/display/redirect?page=changes>

Changes:

[Romain Manni-Bucau] [OWB-1463] enable to scan per slide the apps, on my ref machine it moves from 440ms (serial) to 160ms (LPT 8 threads) to 57ms (sliced 16 threads)


------------------------------------------
[...truncated 4.11 KiB...]
[INFO] Gradle ShadowJar Plugin Integration                                [jar]
[INFO] OpenWebBeans JUnit5                                                [jar]
[INFO] TCK Porting Pkg                                                    [jar]
[INFO] OWB JSR-330 Jakarta version TCK                                    [jar]
[INFO] EE Common plugin                                                   [jar]
[INFO] Java EE plugin                                                     [jar]
[INFO] JMS plugin                                                         [jar]
[INFO] JSR-365 TCK runner                                                 [jar]
[INFO] JSF-2 plugin                                                       [jar]
[INFO] OSGi plugin                                                        [jar]
[INFO] Distribution Pkg                                                   [pom]
[INFO] BOM                                                                [pom]
[INFO] SE BOM                                                             [pom]
[INFO] Web BOM                                                            [pom]
[INFO] OpenWebBeans Java SE Sample                                        [jar]
[INFO] OWB Samples                                                        [pom]
[INFO] Sample Guess Application                                           [war]
[INFO] JSF Conversation Sample                                            [war]
[INFO] Sample JSF2 Application                                            [war]
[INFO] Sample Hotel Reservation Application                               [war]
[HUDSON] Collecting dependencies info
[HUDSON] Collecting dependencies info
[HUDSON] Collecting dependencies info
[HUDSON] Collecting dependencies info
[HUDSON] Collecting dependencies info
[HUDSON] Collecting dependencies info
[HUDSON] Collecting dependencies info
[HUDSON] Collecting dependencies info
[HUDSON] Collecting dependencies info
[HUDSON] Collecting dependencies info
[HUDSON] Collecting dependencies info
[HUDSON] Collecting dependencies info
[HUDSON] Collecting dependencies info
[HUDSON] Collecting dependencies info
[HUDSON] Collecting dependencies info
[HUDSON] Collecting dependencies info
[HUDSON] Collecting dependencies info
[HUDSON] Collecting dependencies info
[HUDSON] Collecting dependencies info
[INFO] 
[INFO] ----------------< org.apache.openwebbeans:openwebbeans >----------------
[INFO] Building Apache OpenWebBeans 4.1.1-SNAPSHOT                       [1/31]
[INFO]   from pom.xml
[INFO] --------------------------------[ pom ]---------------------------------
[INFO] 
[INFO] --- clean:3.5.0:clean (default-clean) @ openwebbeans ---
[INFO] 
[INFO] --- enforcer:3.6.2:enforce (enforce-maven-version) @ openwebbeans ---
[INFO] Rule 0: org.apache.maven.enforcer.rules.version.RequireMavenVersion passed
[INFO] 
[INFO] --- enforcer:3.6.2:enforce (enforce-java-version) @ openwebbeans ---
[INFO] Rule 0: org.apache.maven.enforcer.rules.version.RequireJavaVersion passed
[INFO] 
[INFO] --- remote-resources:3.2.0:process (default) @ openwebbeans ---
[INFO] Preparing remote bundle org.apache:apache-jar-resource-bundle:1.4
[INFO] Copying 3 resources from 1 bundle.
[INFO] 
[INFO] --- remote-resources:3.2.0:process (process-resource-bundles) @ openwebbeans ---
[INFO] Preparing remote bundle org.apache.apache.resources:apache-jar-resource-bundle:1.7
[INFO] Copying 3 resources from 1 bundle.
[INFO] 
[INFO] --- bundle:5.1.9:manifest (bundle-manifest) @ openwebbeans ---
[WARNING] Ignoring project type pom - supportedProjectTypes = [jar, bundle, war]
[INFO] 
[INFO] --- source:3.4.0:jar-no-fork (attach-sources) @ openwebbeans ---
[INFO] 
[INFO] --- checkstyle:3.6.0:check (verify-style) @ openwebbeans ---
[INFO] Starting audit...
Audit done.
[INFO] You have 0 Checkstyle violations.
[INFO] 
[INFO] --- apache-rat:0.16.1:check (default) @ openwebbeans ---
[INFO] Rat check: Summary over all files. Unapproved: 0, unknown: 0, generated: 0, approved: 1 licenses.
[INFO] 
[INFO] --- install:3.1.4:install (default-install) @ openwebbeans ---
[INFO] Installing <https://ci-builds.apache.org/job/OpenWebBeans/job/OpenWebBeans%20CI%20(main)/ws/pom.xml> to /home/jenkins/jenkins-agent/maven-repositories/0/org/apache/openwebbeans/openwebbeans/4.1.1-SNAPSHOT/openwebbeans-4.1.1-SNAPSHOT.pom
[WARNING] Attempt to (de-)serialize anonymous class org.jfrog.hudson.maven2.MavenDependenciesRecorder$1; see: https://jenkins.io/redirect/serialization-of-anonymous-classes/
[INFO] 
[INFO] --------------< org.apache.openwebbeans:openwebbeans-spi >--------------
[INFO] Building SPI definition 4.1.1-SNAPSHOT                            [2/31]
[INFO]   from webbeans-spi/pom.xml
[INFO] --------------------------------[ jar ]---------------------------------
[INFO] 
[INFO] --- clean:3.5.0:clean (default-clean) @ openwebbeans-spi ---
[INFO] 
[INFO] --- enforcer:3.6.2:enforce (enforce-maven-version) @ openwebbeans-spi ---
[INFO] 
[INFO] --- enforcer:3.6.2:enforce (enforce-java-version) @ openwebbeans-spi ---
[INFO] 
[INFO] --- remote-resources:3.2.0:process (default) @ openwebbeans-spi ---
[INFO] Preparing remote bundle org.apache:apache-jar-resource-bundle:1.4
[INFO] Copying 3 resources from 1 bundle.
[INFO] 
[INFO] --- remote-resources:3.2.0:process (process-resource-bundles) @ openwebbeans-spi ---
[INFO] Preparing remote bundle org.apache.apache.resources:apache-jar-resource-bundle:1.7
[INFO] Copying 3 resources from 1 bundle.
[INFO] 
[INFO] --- resources:3.4.0:resources (default-resources) @ openwebbeans-spi ---
[INFO] skip non existing resourceDirectory <https://ci-builds.apache.org/job/OpenWebBeans/job/OpenWebBeans%20CI%20(main)/ws/webbeans-spi/src/main/resources>
[INFO] Copying 3 resources from target/maven-shared-archive-resources to target/classes
[INFO] Copying 3 resources from target/maven-shared-archive-resources to target/classes
[INFO] 
[INFO] --- compiler:3.15.0:compile (default-compile) @ openwebbeans-spi ---
[INFO] Recompiling the module because of changed source code.
[INFO] Compiling 24 source files with javac [debug release 17] to target/classes
[WARNING] <https://ci-builds.apache.org/job/OpenWebBeans/job/OpenWebBeans%20CI%20(main)/ws/webbeans-spi/src/main/java/org/apache/webbeans/spi/BDABeansXmlScanner.java>:[28,8] deprecated item is not annotated with @Deprecated
[WARNING] <https://ci-builds.apache.org/job/OpenWebBeans/job/OpenWebBeans%20CI%20(main)/ws/webbeans-spi/src/main/java/org/apache/webbeans/spi/ResourceInjectionService.java>:[88,22] deprecated item is not annotated with @Deprecated
[WARNING] <https://ci-builds.apache.org/job/OpenWebBeans/job/OpenWebBeans%20CI%20(main)/ws/webbeans-spi/src/main/java/org/apache/webbeans/spi/ResourceInjectionService.java>:[97,19] deprecated item is not annotated with @Deprecated
[WARNING] <https://ci-builds.apache.org/job/OpenWebBeans/job/OpenWebBeans%20CI%20(main)/ws/webbeans-spi/src/main/java/org/apache/webbeans/spi/api/ResourceReference.java>:[93,42] non-varargs call of varargs method with inexact argument type for last parameter;
  cast to java.lang.Class for a varargs call
  cast to java.lang.Class[] for a non-varargs call and to suppress this warning
[WARNING] <https://ci-builds.apache.org/job/OpenWebBeans/job/OpenWebBeans%20CI%20(main)/ws/webbeans-spi/src/main/java/org/apache/webbeans/spi/api/ResourceReference.java>:[109,69] non-varargs call of varargs method with inexact argument type for last parameter;
  cast to java.lang.Object for a varargs call
  cast to java.lang.Object[] for a non-varargs call and to suppress this warning
[INFO] <https://ci-builds.apache.org/job/OpenWebBeans/job/OpenWebBeans%20CI%20(main)/ws/webbeans-spi/src/main/java/org/apache/webbeans/spi/ScannerService.java>: <https://ci-builds.apache.org/job/OpenWebBeans/job/OpenWebBeans%20CI%20(main)/ws/webbeans-spi/src/main/java/org/apache/webbeans/spi/ScannerService.java> uses or overrides a deprecated API.
[INFO] <https://ci-builds.apache.org/job/OpenWebBeans/job/OpenWebBeans%20CI%20(main)/ws/webbeans-spi/src/main/java/org/apache/webbeans/spi/ScannerService.java>: Recompile with -Xlint:deprecation for details.
[INFO] <https://ci-builds.apache.org/job/OpenWebBeans/job/OpenWebBeans%20CI%20(main)/ws/webbeans-spi/src/main/java/org/apache/webbeans/spi/api/ResourceReference.java>: <https://ci-builds.apache.org/job/OpenWebBeans/job/OpenWebBeans%20CI%20(main)/ws/webbeans-spi/src/main/java/org/apache/webbeans/spi/api/ResourceReference.java> uses unchecked or unsafe operations.
[INFO] <https://ci-builds.apache.org/job/OpenWebBeans/job/OpenWebBeans%20CI%20(main)/ws/webbeans-spi/src/main/java/org/apache/webbeans/spi/api/ResourceReference.java>: Recompile with -Xlint:unchecked for details.
[INFO] 
[INFO] --- bundle:5.1.9:manifest (bundle-manifest) @ openwebbeans-spi ---
[INFO] No MANIFEST.MF file found, generating manifest.
[INFO] Writing manifest: <https://ci-builds.apache.org/job/OpenWebBeans/job/OpenWebBeans%20CI%20(main)/ws/webbeans-spi/target/classes/META-INF/MANIFEST.MF>
[INFO] 
[INFO] --- resources:3.4.0:testResources (default-testResources) @ openwebbeans-spi ---
[INFO] skip non existing resourceDirectory <https://ci-builds.apache.org/job/OpenWebBeans/job/OpenWebBeans%20CI%20(main)/ws/webbeans-spi/src/test/resources>
[INFO] Copying 3 resources from target/maven-shared-archive-resources to target/test-classes
[INFO] Copying 3 resources from target/maven-shared-archive-resources to target/test-classes
[INFO] 
[INFO] --- compiler:3.15.0:testCompile (default-testCompile) @ openwebbeans-spi ---
[INFO] No sources to compile
[INFO] 
[INFO] --- surefire:3.2.2:test (default-test) @ openwebbeans-spi ---
[JENKINS] Recording test results
[INFO] 
[INFO] --- jar:3.3.0:jar (default-jar) @ openwebbeans-spi ---
[INFO] Building jar: <https://ci-builds.apache.org/job/OpenWebBeans/job/OpenWebBeans%20CI%20(main)/ws/webbeans-spi/target/openwebbeans-spi-4.1.1-SNAPSHOT.jar>
[INFO] 
[INFO] --- source:3.4.0:jar-no-fork (attach-sources) @ openwebbeans-spi ---
[INFO] Building jar: <https://ci-builds.apache.org/job/OpenWebBeans/job/OpenWebBeans%20CI%20(main)/ws/webbeans-spi/target/openwebbeans-spi-4.1.1-SNAPSHOT-sources.jar>
[INFO] 
[INFO] --- checkstyle:3.6.0:check (verify-style) @ openwebbeans-spi ---
[INFO] Starting audit...
Audit done.
[INFO] You have 0 Checkstyle violations.
[INFO] 
[INFO] --- apache-rat:0.16.1:check (default) @ openwebbeans-spi ---
[INFO] Rat check: Summary over all files. Unapproved: 0, unknown: 0, generated: 0, approved: 28 licenses.
[INFO] 
[INFO] --- install:3.1.4:install (default-install) @ openwebbeans-spi ---
[INFO] Installing <https://ci-builds.apache.org/job/OpenWebBeans/job/OpenWebBeans%20CI%20(main)/ws/webbeans-spi/pom.xml> to /home/jenkins/jenkins-agent/maven-repositories/0/org/apache/openwebbeans/openwebbeans-spi/4.1.1-SNAPSHOT/openwebbeans-spi-4.1.1-SNAPSHOT.pom
[INFO] Installing <https://ci-builds.apache.org/job/OpenWebBeans/job/OpenWebBeans%20CI%20(main)/ws/webbeans-spi/target/openwebbeans-spi-4.1.1-SNAPSHOT.jar> to /home/jenkins/jenkins-agent/maven-repositories/0/org/apache/openwebbeans/openwebbeans-spi/4.1.1-SNAPSHOT/openwebbeans-spi-4.1.1-SNAPSHOT.jar
[INFO] Installing <https://ci-builds.apache.org/job/OpenWebBeans/job/OpenWebBeans%20CI%20(main)/ws/webbeans-spi/target/openwebbeans-spi-4.1.1-SNAPSHOT-sources.jar> to /home/jenkins/jenkins-agent/maven-repositories/0/org/apache/openwebbeans/openwebbeans-spi/4.1.1-SNAPSHOT/openwebbeans-spi-4.1.1-SNAPSHOT-sources.jar
[INFO] 
[INFO] -------------< org.apache.openwebbeans:openwebbeans-impl >--------------
[INFO] Building OpenWebBeans Core 4.1.1-SNAPSHOT                         [3/31]
[INFO]   from webbeans-impl/pom.xml
[INFO] --------------------------------[ jar ]---------------------------------
[WARNING] The POM for org.apache.xbean:xbean-finder-shaded:jar:5.0.0-SNAPSHOT is missing, no dependency information available
[WARNING] The POM for org.apache.xbean:xbean-asm9-shaded:jar:5.0.0-SNAPSHOT is missing, no dependency information available
[INFO] ------------------------------------------------------------------------
[INFO] Reactor Summary for Apache OpenWebBeans 4.1.1-SNAPSHOT:
[INFO] 
[INFO] Apache OpenWebBeans ................................ SUCCESS [ 14.352 s]
[INFO] SPI definition ..................................... SUCCESS [ 13.885 s]
[INFO] OpenWebBeans Core .................................. FAILURE [  0.735 s]
[INFO] EL 2.2 plugin ...................................... SKIPPED
[INFO] Apache OpenWebBeans CDI Java SE Implementation ..... SKIPPED
[INFO] Web plugin ......................................... SKIPPED
[INFO] Tomcat plugin ...................................... SKIPPED
[INFO] EJB plugin ......................................... SKIPPED
[INFO] OWB Arquillian Parent .............................. SKIPPED
[INFO] OpenWebBeans-Standalone Arquillian connector ....... SKIPPED
[INFO] Slf4j Integration .................................. SKIPPED
[INFO] Gradle ShadowJar Plugin Integration ................ SKIPPED
[INFO] OpenWebBeans JUnit5 ................................ SKIPPED
[INFO] TCK Porting Pkg .................................... SKIPPED
[INFO] OWB JSR-330 Jakarta version TCK .................... SKIPPED
[INFO] EE Common plugin ................................... SKIPPED
[INFO] Java EE plugin ..................................... SKIPPED
[INFO] JMS plugin ......................................... SKIPPED
[INFO] JSR-365 TCK runner ................................. SKIPPED
[INFO] JSF-2 plugin ....................................... SKIPPED
[INFO] OSGi plugin ........................................ SKIPPED
[INFO] Distribution Pkg ................................... SKIPPED
[INFO] BOM ................................................ SKIPPED
[INFO] SE BOM ............................................. SKIPPED
[INFO] Web BOM ............................................ SKIPPED
[INFO] OpenWebBeans Java SE Sample ........................ SKIPPED
[INFO] OWB Samples ........................................ SKIPPED
[INFO] Sample Guess Application ........................... SKIPPED
[INFO] JSF Conversation Sample ............................ SKIPPED
[INFO] Sample JSF2 Application ............................ SKIPPED
[INFO] Sample Hotel Reservation Application ............... SKIPPED
[INFO] ------------------------------------------------------------------------
[INFO] BUILD FAILURE
[INFO] ------------------------------------------------------------------------
[INFO] Total time:  01:12 min
[INFO] Finished at: 2026-07-30T01:47:02Z
[INFO] ------------------------------------------------------------------------
Waiting for Jenkins to finish collecting data
[ERROR] Failed to execute goal on project openwebbeans-impl: Could not resolve dependencies for project org.apache.openwebbeans:openwebbeans-impl:jar:4.1.1-SNAPSHOT
[ERROR] dependency: org.apache.xbean:xbean-finder-shaded:jar:5.0.0-SNAPSHOT (compile)
[ERROR] Could not find artifact org.apache.xbean:xbean-finder-shaded:jar:5.0.0-SNAPSHOT
[ERROR] dependency: org.apache.xbean:xbean-asm9-shaded:jar:5.0.0-SNAPSHOT (compile)
[ERROR] Could not find artifact org.apache.xbean:xbean-asm9-shaded:jar:5.0.0-SNAPSHOT
[ERROR] -> [Help 1]
[ERROR] 
[ERROR] To see the full stack trace of the errors, re-run Maven with the -e switch.
[ERROR] Re-run Maven using the -X switch to enable full debug logging.
[ERROR] 
[ERROR] For more information about the errors and possible solutions, please read the following articles:
[ERROR] [Help 1] http://cwiki.apache.org/confluence/display/MAVEN/DependencyResolutionException
[ERROR] 
[ERROR] After correcting the problems, you can resume the build with the command
[ERROR]   mvn <goals> -rf :openwebbeans-impl
[JENKINS] Archiving <https://ci-builds.apache.org/job/OpenWebBeans/job/OpenWebBeans%20CI%20(main)/ws/webbeans-impl/pom.xml> to org.apache.openwebbeans/openwebbeans-impl/4.1.1-SNAPSHOT/openwebbeans-impl-4.1.1-SNAPSHOT.pom
[JENKINS] Archiving <https://ci-builds.apache.org/job/OpenWebBeans/job/OpenWebBeans%20CI%20(main)/ws/bom/openwebbeans-se-bom/pom.xml> to org.apache.openwebbeans.bom/openwebbeans-se-bom/4.1.1-SNAPSHOT/openwebbeans-se-bom-4.1.1-SNAPSHOT.pom
[JENKINS] Archiving <https://ci-builds.apache.org/job/OpenWebBeans/job/OpenWebBeans%20CI%20(main)/ws/webbeans-ee-common/pom.xml> to org.apache.openwebbeans/openwebbeans-ee-common/4.1.1-SNAPSHOT/openwebbeans-ee-common-4.1.1-SNAPSHOT.pom
[JENKINS] Archiving <https://ci-builds.apache.org/job/OpenWebBeans/job/OpenWebBeans%20CI%20(main)/ws/webbeans-jsf/pom.xml> to org.apache.openwebbeans/openwebbeans-jsf/4.1.1-SNAPSHOT/openwebbeans-jsf-4.1.1-SNAPSHOT.pom
[JENKINS] Archiving <https://ci-builds.apache.org/job/OpenWebBeans/job/OpenWebBeans%20CI%20(main)/ws/webbeans-arquillian/pom.xml> to org.apache.openwebbeans.arquillian/owb-arquillian-parent/4.1.1-SNAPSHOT/owb-arquillian-parent-4.1.1-SNAPSHOT.pom
[JENKINS] Archiving <https://ci-builds.apache.org/job/OpenWebBeans/job/OpenWebBeans%20CI%20(main)/ws/webbeans-el22/pom.xml> to org.apache.openwebbeans/openwebbeans-el22/4.1.1-SNAPSHOT/openwebbeans-el22-4.1.1-SNAPSHOT.pom
[JENKINS] Archiving <https://ci-builds.apache.org/job/OpenWebBeans/job/OpenWebBeans%20CI%20(main)/ws/samples/reservation/pom.xml> to org.apache.openwebbeans.samples/reservation/4.1.1-SNAPSHOT/reservation-4.1.1-SNAPSHOT.pom
[JENKINS] Archiving <https://ci-builds.apache.org/job/OpenWebBeans/job/OpenWebBeans%20CI%20(main)/ws/samples/standalone-sample/pom.xml> to org.apache.openwebbeans/standalone-sample/4.1.1-SNAPSHOT/standalone-sample-4.1.1-SNAPSHOT.pom
[JENKINS] Archiving <https://ci-builds.apache.org/job/OpenWebBeans/job/OpenWebBeans%20CI%20(main)/ws/webbeans-gradle/pom.xml> to org.apache.openwebbeans/openwebbeans-gradle/4.1.1-SNAPSHOT/openwebbeans-gradle-4.1.1-SNAPSHOT.pom
[JENKINS] Archiving <https://ci-builds.apache.org/job/OpenWebBeans/job/OpenWebBeans%20CI%20(main)/ws/samples/pom.xml> to org.apache.openwebbeans/samples/4.1.1-SNAPSHOT/samples-4.1.1-SNAPSHOT.pom
[JENKINS] Archiving <https://ci-builds.apache.org/job/OpenWebBeans/job/OpenWebBeans%20CI%20(main)/ws/webbeans-spi/pom.xml> to org.apache.openwebbeans/openwebbeans-spi/4.1.1-SNAPSHOT/openwebbeans-spi-4.1.1-SNAPSHOT.pom
[JENKINS] Archiving <https://ci-builds.apache.org/job/OpenWebBeans/job/OpenWebBeans%20CI%20(main)/ws/webbeans-spi/target/openwebbeans-spi-4.1.1-SNAPSHOT.jar> to org.apache.openwebbeans/openwebbeans-spi/4.1.1-SNAPSHOT/openwebbeans-spi-4.1.1-SNAPSHOT.jar
[JENKINS] Archiving <https://ci-builds.apache.org/job/OpenWebBeans/job/OpenWebBeans%20CI%20(main)/ws/webbeans-spi/target/openwebbeans-spi-4.1.1-SNAPSHOT-sources.jar> to org.apache.openwebbeans/openwebbeans-spi/4.1.1-SNAPSHOT/openwebbeans-spi-4.1.1-SNAPSHOT-sources.jar
[JENKINS] Archiving <https://ci-builds.apache.org/job/OpenWebBeans/job/OpenWebBeans%20CI%20(main)/ws/samples/guess/pom.xml> to org.apache.openwebbeans.samples/guess/4.1.1-SNAPSHOT/guess-4.1.1-SNAPSHOT.pom
[JENKINS] Archiving <https://ci-builds.apache.org/job/OpenWebBeans/job/OpenWebBeans%20CI%20(main)/ws/webbeans-se/pom.xml> to org.apache.openwebbeans/openwebbeans-se/4.1.1-SNAPSHOT/openwebbeans-se-4.1.1-SNAPSHOT.pom
[JENKINS] Archiving <https://ci-builds.apache.org/job/OpenWebBeans/job/OpenWebBeans%20CI%20(main)/ws/webbeans-osgi/pom.xml> to org.apache.openwebbeans/openwebbeans-osgi/4.1.1-SNAPSHOT/openwebbeans-osgi-4.1.1-SNAPSHOT.pom
[JENKINS] Archiving <https://ci-builds.apache.org/job/OpenWebBeans/job/OpenWebBeans%20CI%20(main)/ws/samples/jsf2sample/pom.xml> to org.apache.openwebbeans.samples/jsf2sample/4.1.1-SNAPSHOT/jsf2sample-4.1.1-SNAPSHOT.pom
[JENKINS] Archiving <https://ci-builds.apache.org/job/OpenWebBeans/job/OpenWebBeans%20CI%20(main)/ws/pom.xml> to org.apache.openwebbeans/openwebbeans/4.1.1-SNAPSHOT/openwebbeans-4.1.1-SNAPSHOT.pom
[JENKINS] Archiving <https://ci-builds.apache.org/job/OpenWebBeans/job/OpenWebBeans%20CI%20(main)/ws/webbeans-tck/pom.xml> to org.apache.openwebbeans/openwebbeans-tck/4.1.1-SNAPSHOT/openwebbeans-tck-4.1.1-SNAPSHOT.pom
[JENKINS] Archiving <https://ci-builds.apache.org/job/OpenWebBeans/job/OpenWebBeans%20CI%20(main)/ws/webbeans-ee/pom.xml> to org.apache.openwebbeans/openwebbeans-ee/4.1.1-SNAPSHOT/openwebbeans-ee-4.1.1-SNAPSHOT.pom
[JENKINS] Archiving <https://ci-builds.apache.org/job/OpenWebBeans/job/OpenWebBeans%20CI%20(main)/ws/webbeans-slf4j/pom.xml> to org.apache.openwebbeans/openwebbeans-slf4j/4.1.1-SNAPSHOT/openwebbeans-slf4j-4.1.1-SNAPSHOT.pom
[JENKINS] Archiving <https://ci-builds.apache.org/job/OpenWebBeans/job/OpenWebBeans%20CI%20(main)/ws/webbeans-ejb/pom.xml> to org.apache.openwebbeans/openwebbeans-ejb/4.1.1-SNAPSHOT/openwebbeans-ejb-4.1.1-SNAPSHOT.pom
[JENKINS] Archiving <https://ci-builds.apache.org/job/OpenWebBeans/job/OpenWebBeans%20CI%20(main)/ws/webbeans-junit5/pom.xml> to org.apache.openwebbeans/openwebbeans-junit5/4.1.1-SNAPSHOT/openwebbeans-junit5-4.1.1-SNAPSHOT.pom
[JENKINS] Archiving <https://ci-builds.apache.org/job/OpenWebBeans/job/OpenWebBeans%20CI%20(main)/ws/bom/pom.xml> to org.apache.openwebbeans.bom/bom/4.1.1-SNAPSHOT/bom-4.1.1-SNAPSHOT.pom
[JENKINS] Archiving <https://ci-builds.apache.org/job/OpenWebBeans/job/OpenWebBeans%20CI%20(main)/ws/samples/conversation-sample/pom.xml> to org.apache.openwebbeans.samples/conversation-sample/4.1.1-SNAPSHOT/conversation-sample-4.1.1-SNAPSHOT.pom
[JENKINS] Archiving <https://ci-builds.apache.org/job/OpenWebBeans/job/OpenWebBeans%20CI%20(main)/ws/webbeans-web/pom.xml> to org.apache.openwebbeans/openwebbeans-web/4.1.1-SNAPSHOT/openwebbeans-web-4.1.1-SNAPSHOT.pom
[JENKINS] Archiving <https://ci-builds.apache.org/job/OpenWebBeans/job/OpenWebBeans%20CI%20(main)/ws/webbeans-porting/pom.xml> to org.apache.openwebbeans/openwebbeans-porting/4.1.1-SNAPSHOT/openwebbeans-porting-4.1.1-SNAPSHOT.pom
[JENKINS] Archiving <https://ci-builds.apache.org/job/OpenWebBeans/job/OpenWebBeans%20CI%20(main)/ws/webbeans-tomcat/pom.xml> to org.apache.openwebbeans/openwebbeans-tomcat/4.1.1-SNAPSHOT/openwebbeans-tomcat-4.1.1-SNAPSHOT.pom
[JENKINS] Archiving <https://ci-builds.apache.org/job/OpenWebBeans/job/OpenWebBeans%20CI%20(main)/ws/webbeans-jms/pom.xml> to org.apache.openwebbeans/openwebbeans-jms/4.1.1-SNAPSHOT/openwebbeans-jms-4.1.1-SNAPSHOT.pom
[JENKINS] Archiving <https://ci-builds.apache.org/job/OpenWebBeans/job/OpenWebBeans%20CI%20(main)/ws/bom/openwebbeans-web-bom/pom.xml> to org.apache.openwebbeans.bom/openwebbeans-web-bom/4.1.1-SNAPSHOT/openwebbeans-web-bom-4.1.1-SNAPSHOT.pom
[JENKINS] Archiving <https://ci-builds.apache.org/job/OpenWebBeans/job/OpenWebBeans%20CI%20(main)/ws/atinject-tck/pom.xml> to org.apache.openwebbeans/atinject-tck/4.1.1-SNAPSHOT/atinject-tck-4.1.1-SNAPSHOT.pom
[JENKINS] Archiving <https://ci-builds.apache.org/job/OpenWebBeans/job/OpenWebBeans%20CI%20(main)/ws/distribution/pom.xml> to org.apache.openwebbeans/openwebbeans-distribution/4.1.1-SNAPSHOT/openwebbeans-distribution-4.1.1-SNAPSHOT.pom
[JENKINS] Archiving <https://ci-builds.apache.org/job/OpenWebBeans/job/OpenWebBeans%20CI%20(main)/ws/webbeans-arquillian/owb-arquillian-standalone/pom.xml> to org.apache.openwebbeans.arquillian/owb-arquillian-standalone/4.1.1-SNAPSHOT/owb-arquillian-standalone-4.1.1-SNAPSHOT.pom
channel stopped

Build failed in Jenkins: OpenWebBeans » OpenWebBeans CI (main) #130

Posted by Apache Jenkins Server <je...@builds.apache.org>.
See <https://ci-builds.apache.org/job/OpenWebBeans/job/OpenWebBeans%20CI%20(main)/130/display/redirect?page=changes>

Changes:

[Mark Struberg] move to xbean 5.0.0-SNAPSHOT

[Mark Struberg] OWB-1463 expose List of AnnotationFinders for use in extensions

[Mark Struberg] OWB-1463 scan single threaded if numThreads <=1

[Mark Struberg] adding more info logs for a test which fails in the CI environment


------------------------------------------
[...truncated 4.10 KiB...]
[INFO] OpenWebBeans-Standalone Arquillian connector                       [jar]
[INFO] Slf4j Integration                                                  [jar]
[INFO] Gradle ShadowJar Plugin Integration                                [jar]
[INFO] OpenWebBeans JUnit5                                                [jar]
[INFO] TCK Porting Pkg                                                    [jar]
[INFO] OWB JSR-330 Jakarta version TCK                                    [jar]
[INFO] EE Common plugin                                                   [jar]
[INFO] Java EE plugin                                                     [jar]
[INFO] JMS plugin                                                         [jar]
[INFO] JSR-365 TCK runner                                                 [jar]
[INFO] JSF-2 plugin                                                       [jar]
[INFO] OSGi plugin                                                        [jar]
[INFO] Distribution Pkg                                                   [pom]
[INFO] BOM                                                                [pom]
[INFO] SE BOM                                                             [pom]
[INFO] Web BOM                                                            [pom]
[INFO] OpenWebBeans Java SE Sample                                        [jar]
[INFO] OWB Samples                                                        [pom]
[INFO] Sample Guess Application                                           [war]
[INFO] JSF Conversation Sample                                            [war]
[INFO] Sample JSF2 Application                                            [war]
[INFO] Sample Hotel Reservation Application                               [war]
[HUDSON] Collecting dependencies info
[HUDSON] Collecting dependencies info
[HUDSON] Collecting dependencies info
[HUDSON] Collecting dependencies info
[HUDSON] Collecting dependencies info
[HUDSON] Collecting dependencies info
[HUDSON] Collecting dependencies info
[HUDSON] Collecting dependencies info
[HUDSON] Collecting dependencies info
[HUDSON] Collecting dependencies info
[HUDSON] Collecting dependencies info
[HUDSON] Collecting dependencies info
[HUDSON] Collecting dependencies info
[HUDSON] Collecting dependencies info
[HUDSON] Collecting dependencies info
[HUDSON] Collecting dependencies info
[HUDSON] Collecting dependencies info
[INFO] 
[INFO] ----------------< org.apache.openwebbeans:openwebbeans >----------------
[INFO] Building Apache OpenWebBeans 4.1.1-SNAPSHOT                       [1/31]
[INFO]   from pom.xml
[INFO] --------------------------------[ pom ]---------------------------------
[INFO] 
[INFO] --- clean:3.5.0:clean (default-clean) @ openwebbeans ---
[INFO] 
[INFO] --- enforcer:3.6.2:enforce (enforce-maven-version) @ openwebbeans ---
[INFO] Rule 0: org.apache.maven.enforcer.rules.version.RequireMavenVersion passed
[INFO] 
[INFO] --- enforcer:3.6.2:enforce (enforce-java-version) @ openwebbeans ---
[INFO] Rule 0: org.apache.maven.enforcer.rules.version.RequireJavaVersion passed
[INFO] 
[INFO] --- remote-resources:3.2.0:process (default) @ openwebbeans ---
[INFO] Preparing remote bundle org.apache:apache-jar-resource-bundle:1.4
[INFO] Copying 3 resources from 1 bundle.
[INFO] 
[INFO] --- remote-resources:3.2.0:process (process-resource-bundles) @ openwebbeans ---
[INFO] Preparing remote bundle org.apache.apache.resources:apache-jar-resource-bundle:1.7
[INFO] Copying 3 resources from 1 bundle.
[INFO] 
[INFO] --- bundle:5.1.9:manifest (bundle-manifest) @ openwebbeans ---
[WARNING] Ignoring project type pom - supportedProjectTypes = [jar, bundle, war]
[INFO] 
[INFO] --- source:3.4.0:jar-no-fork (attach-sources) @ openwebbeans ---
[INFO] 
[INFO] --- checkstyle:3.6.0:check (verify-style) @ openwebbeans ---
[INFO] Starting audit...
Audit done.
[INFO] You have 0 Checkstyle violations.
[INFO] 
[INFO] --- apache-rat:0.16.1:check (default) @ openwebbeans ---
[INFO] Rat check: Summary over all files. Unapproved: 0, unknown: 0, generated: 0, approved: 1 licenses.
[INFO] 
[INFO] --- install:3.1.4:install (default-install) @ openwebbeans ---
[INFO] Installing <https://ci-builds.apache.org/job/OpenWebBeans/job/OpenWebBeans%20CI%20(main)/ws/pom.xml> to /home/jenkins/maven-repositories/1/org/apache/openwebbeans/openwebbeans/4.1.1-SNAPSHOT/openwebbeans-4.1.1-SNAPSHOT.pom
[WARNING] Attempt to (de-)serialize anonymous class org.jfrog.hudson.maven2.MavenDependenciesRecorder$1; see: https://jenkins.io/redirect/serialization-of-anonymous-classes/
[INFO] 
[INFO] --------------< org.apache.openwebbeans:openwebbeans-spi >--------------
[INFO] Building SPI definition 4.1.1-SNAPSHOT                            [2/31]
[INFO]   from webbeans-spi/pom.xml
[INFO] --------------------------------[ jar ]---------------------------------
[INFO] 
[INFO] --- clean:3.5.0:clean (default-clean) @ openwebbeans-spi ---
[INFO] 
[INFO] --- enforcer:3.6.2:enforce (enforce-maven-version) @ openwebbeans-spi ---
[INFO] 
[INFO] --- enforcer:3.6.2:enforce (enforce-java-version) @ openwebbeans-spi ---
[INFO] 
[INFO] --- remote-resources:3.2.0:process (default) @ openwebbeans-spi ---
[INFO] Preparing remote bundle org.apache:apache-jar-resource-bundle:1.4
[INFO] Copying 3 resources from 1 bundle.
[INFO] 
[INFO] --- remote-resources:3.2.0:process (process-resource-bundles) @ openwebbeans-spi ---
[INFO] Preparing remote bundle org.apache.apache.resources:apache-jar-resource-bundle:1.7
[INFO] Copying 3 resources from 1 bundle.
[INFO] 
[INFO] --- resources:3.4.0:resources (default-resources) @ openwebbeans-spi ---
[INFO] skip non existing resourceDirectory <https://ci-builds.apache.org/job/OpenWebBeans/job/OpenWebBeans%20CI%20(main)/ws/webbeans-spi/src/main/resources>
[INFO] Copying 3 resources from target/maven-shared-archive-resources to target/classes
[INFO] Copying 3 resources from target/maven-shared-archive-resources to target/classes
[INFO] 
[INFO] --- compiler:3.15.0:compile (default-compile) @ openwebbeans-spi ---
[INFO] Recompiling the module because of changed source code.
[INFO] Compiling 24 source files with javac [debug release 17] to target/classes
[WARNING] <https://ci-builds.apache.org/job/OpenWebBeans/job/OpenWebBeans%20CI%20(main)/ws/webbeans-spi/src/main/java/org/apache/webbeans/spi/BDABeansXmlScanner.java>:[28,8] deprecated item is not annotated with @Deprecated
[WARNING] <https://ci-builds.apache.org/job/OpenWebBeans/job/OpenWebBeans%20CI%20(main)/ws/webbeans-spi/src/main/java/org/apache/webbeans/spi/ResourceInjectionService.java>:[88,22] deprecated item is not annotated with @Deprecated
[WARNING] <https://ci-builds.apache.org/job/OpenWebBeans/job/OpenWebBeans%20CI%20(main)/ws/webbeans-spi/src/main/java/org/apache/webbeans/spi/ResourceInjectionService.java>:[97,19] deprecated item is not annotated with @Deprecated
[WARNING] <https://ci-builds.apache.org/job/OpenWebBeans/job/OpenWebBeans%20CI%20(main)/ws/webbeans-spi/src/main/java/org/apache/webbeans/spi/api/ResourceReference.java>:[93,42] non-varargs call of varargs method with inexact argument type for last parameter;
  cast to java.lang.Class for a varargs call
  cast to java.lang.Class[] for a non-varargs call and to suppress this warning
[WARNING] <https://ci-builds.apache.org/job/OpenWebBeans/job/OpenWebBeans%20CI%20(main)/ws/webbeans-spi/src/main/java/org/apache/webbeans/spi/api/ResourceReference.java>:[109,69] non-varargs call of varargs method with inexact argument type for last parameter;
  cast to java.lang.Object for a varargs call
  cast to java.lang.Object[] for a non-varargs call and to suppress this warning
[INFO] <https://ci-builds.apache.org/job/OpenWebBeans/job/OpenWebBeans%20CI%20(main)/ws/webbeans-spi/src/main/java/org/apache/webbeans/spi/ScannerService.java>: <https://ci-builds.apache.org/job/OpenWebBeans/job/OpenWebBeans%20CI%20(main)/ws/webbeans-spi/src/main/java/org/apache/webbeans/spi/ScannerService.java> uses or overrides a deprecated API.
[INFO] <https://ci-builds.apache.org/job/OpenWebBeans/job/OpenWebBeans%20CI%20(main)/ws/webbeans-spi/src/main/java/org/apache/webbeans/spi/ScannerService.java>: Recompile with -Xlint:deprecation for details.
[INFO] <https://ci-builds.apache.org/job/OpenWebBeans/job/OpenWebBeans%20CI%20(main)/ws/webbeans-spi/src/main/java/org/apache/webbeans/spi/api/ResourceReference.java>: <https://ci-builds.apache.org/job/OpenWebBeans/job/OpenWebBeans%20CI%20(main)/ws/webbeans-spi/src/main/java/org/apache/webbeans/spi/api/ResourceReference.java> uses unchecked or unsafe operations.
[INFO] <https://ci-builds.apache.org/job/OpenWebBeans/job/OpenWebBeans%20CI%20(main)/ws/webbeans-spi/src/main/java/org/apache/webbeans/spi/api/ResourceReference.java>: Recompile with -Xlint:unchecked for details.
[INFO] 
[INFO] --- bundle:5.1.9:manifest (bundle-manifest) @ openwebbeans-spi ---
[INFO] No MANIFEST.MF file found, generating manifest.
[INFO] Writing manifest: <https://ci-builds.apache.org/job/OpenWebBeans/job/OpenWebBeans%20CI%20(main)/ws/webbeans-spi/target/classes/META-INF/MANIFEST.MF>
[INFO] 
[INFO] --- resources:3.4.0:testResources (default-testResources) @ openwebbeans-spi ---
[INFO] skip non existing resourceDirectory <https://ci-builds.apache.org/job/OpenWebBeans/job/OpenWebBeans%20CI%20(main)/ws/webbeans-spi/src/test/resources>
[INFO] Copying 3 resources from target/maven-shared-archive-resources to target/test-classes
[INFO] Copying 3 resources from target/maven-shared-archive-resources to target/test-classes
[INFO] 
[INFO] --- compiler:3.15.0:testCompile (default-testCompile) @ openwebbeans-spi ---
[INFO] No sources to compile
[INFO] 
[INFO] --- surefire:3.2.2:test (default-test) @ openwebbeans-spi ---
[JENKINS] Recording test results
[INFO] 
[INFO] --- jar:3.3.0:jar (default-jar) @ openwebbeans-spi ---
[INFO] Building jar: <https://ci-builds.apache.org/job/OpenWebBeans/job/OpenWebBeans%20CI%20(main)/ws/webbeans-spi/target/openwebbeans-spi-4.1.1-SNAPSHOT.jar>
[INFO] 
[INFO] --- source:3.4.0:jar-no-fork (attach-sources) @ openwebbeans-spi ---
[INFO] Building jar: <https://ci-builds.apache.org/job/OpenWebBeans/job/OpenWebBeans%20CI%20(main)/ws/webbeans-spi/target/openwebbeans-spi-4.1.1-SNAPSHOT-sources.jar>
[INFO] 
[INFO] --- checkstyle:3.6.0:check (verify-style) @ openwebbeans-spi ---
[INFO] Starting audit...
Audit done.
[INFO] You have 0 Checkstyle violations.
[INFO] 
[INFO] --- apache-rat:0.16.1:check (default) @ openwebbeans-spi ---
[INFO] Rat check: Summary over all files. Unapproved: 0, unknown: 0, generated: 0, approved: 28 licenses.
[INFO] 
[INFO] --- install:3.1.4:install (default-install) @ openwebbeans-spi ---
[INFO] Installing <https://ci-builds.apache.org/job/OpenWebBeans/job/OpenWebBeans%20CI%20(main)/ws/webbeans-spi/pom.xml> to /home/jenkins/maven-repositories/1/org/apache/openwebbeans/openwebbeans-spi/4.1.1-SNAPSHOT/openwebbeans-spi-4.1.1-SNAPSHOT.pom
[INFO] Installing <https://ci-builds.apache.org/job/OpenWebBeans/job/OpenWebBeans%20CI%20(main)/ws/webbeans-spi/target/openwebbeans-spi-4.1.1-SNAPSHOT.jar> to /home/jenkins/maven-repositories/1/org/apache/openwebbeans/openwebbeans-spi/4.1.1-SNAPSHOT/openwebbeans-spi-4.1.1-SNAPSHOT.jar
[INFO] Installing <https://ci-builds.apache.org/job/OpenWebBeans/job/OpenWebBeans%20CI%20(main)/ws/webbeans-spi/target/openwebbeans-spi-4.1.1-SNAPSHOT-sources.jar> to /home/jenkins/maven-repositories/1/org/apache/openwebbeans/openwebbeans-spi/4.1.1-SNAPSHOT/openwebbeans-spi-4.1.1-SNAPSHOT-sources.jar
[INFO] 
[INFO] -------------< org.apache.openwebbeans:openwebbeans-impl >--------------
[INFO] Building OpenWebBeans Core 4.1.1-SNAPSHOT                         [3/31]
[INFO]   from webbeans-impl/pom.xml
[INFO] --------------------------------[ jar ]---------------------------------
[WARNING] The POM for org.apache.xbean:xbean-finder-shaded:jar:5.0.0-SNAPSHOT is missing, no dependency information available
[WARNING] The POM for org.apache.xbean:xbean-asm9-shaded:jar:5.0.0-SNAPSHOT is missing, no dependency information available
[INFO] ------------------------------------------------------------------------
[INFO] Reactor Summary for Apache OpenWebBeans 4.1.1-SNAPSHOT:
[INFO] 
[INFO] Apache OpenWebBeans ................................ SUCCESS [ 22.521 s]
[INFO] SPI definition ..................................... SUCCESS [ 15.924 s]
[INFO] OpenWebBeans Core .................................. FAILURE [  0.784 s]
[INFO] EL 2.2 plugin ...................................... SKIPPED
[INFO] Apache OpenWebBeans CDI Java SE Implementation ..... SKIPPED
[INFO] Web plugin ......................................... SKIPPED
[INFO] Tomcat plugin ...................................... SKIPPED
[INFO] EJB plugin ......................................... SKIPPED
[INFO] OWB Arquillian Parent .............................. SKIPPED
[INFO] OpenWebBeans-Standalone Arquillian connector ....... SKIPPED
[INFO] Slf4j Integration .................................. SKIPPED
[INFO] Gradle ShadowJar Plugin Integration ................ SKIPPED
[INFO] OpenWebBeans JUnit5 ................................ SKIPPED
[INFO] TCK Porting Pkg .................................... SKIPPED
[INFO] OWB JSR-330 Jakarta version TCK .................... SKIPPED
[INFO] EE Common plugin ................................... SKIPPED
[INFO] Java EE plugin ..................................... SKIPPED
[INFO] JMS plugin ......................................... SKIPPED
[INFO] JSR-365 TCK runner ................................. SKIPPED
[INFO] JSF-2 plugin ....................................... SKIPPED
[INFO] OSGi plugin ........................................ SKIPPED
[INFO] Distribution Pkg ................................... SKIPPED
[INFO] BOM ................................................ SKIPPED
[INFO] SE BOM ............................................. SKIPPED
[INFO] Web BOM ............................................ SKIPPED
[INFO] OpenWebBeans Java SE Sample ........................ SKIPPED
[INFO] OWB Samples ........................................ SKIPPED
[INFO] Sample Guess Application ........................... SKIPPED
[INFO] JSF Conversation Sample ............................ SKIPPED
[INFO] Sample JSF2 Application ............................ SKIPPED
[INFO] Sample Hotel Reservation Application ............... SKIPPED
[INFO] ------------------------------------------------------------------------
[INFO] BUILD FAILURE
[INFO] ------------------------------------------------------------------------
[INFO] Total time:  01:25 min
[INFO] Finished at: 2026-07-29T18:27:06Z
[INFO] ------------------------------------------------------------------------
Waiting for Jenkins to finish collecting data
[ERROR] Failed to execute goal on project openwebbeans-impl: Could not resolve dependencies for project org.apache.openwebbeans:openwebbeans-impl:jar:4.1.1-SNAPSHOT
[ERROR] dependency: org.apache.xbean:xbean-finder-shaded:jar:5.0.0-SNAPSHOT (compile)
[ERROR] Could not find artifact org.apache.xbean:xbean-finder-shaded:jar:5.0.0-SNAPSHOT
[ERROR] dependency: org.apache.xbean:xbean-asm9-shaded:jar:5.0.0-SNAPSHOT (compile)
[ERROR] Could not find artifact org.apache.xbean:xbean-asm9-shaded:jar:5.0.0-SNAPSHOT
[ERROR] -> [Help 1]
[ERROR] 
[ERROR] To see the full stack trace of the errors, re-run Maven with the -e switch.
[ERROR] Re-run Maven using the -X switch to enable full debug logging.
[ERROR] 
[ERROR] For more information about the errors and possible solutions, please read the following articles:
[ERROR] [Help 1] http://cwiki.apache.org/confluence/display/MAVEN/DependencyResolutionException
[ERROR] 
[ERROR] After correcting the problems, you can resume the build with the command
[ERROR]   mvn <goals> -rf :openwebbeans-impl
[JENKINS] Archiving <https://ci-builds.apache.org/job/OpenWebBeans/job/OpenWebBeans%20CI%20(main)/ws/webbeans-impl/pom.xml> to org.apache.openwebbeans/openwebbeans-impl/4.1.1-SNAPSHOT/openwebbeans-impl-4.1.1-SNAPSHOT.pom
[JENKINS] Archiving <https://ci-builds.apache.org/job/OpenWebBeans/job/OpenWebBeans%20CI%20(main)/ws/bom/openwebbeans-se-bom/pom.xml> to org.apache.openwebbeans.bom/openwebbeans-se-bom/4.1.1-SNAPSHOT/openwebbeans-se-bom-4.1.1-SNAPSHOT.pom
[JENKINS] Archiving <https://ci-builds.apache.org/job/OpenWebBeans/job/OpenWebBeans%20CI%20(main)/ws/webbeans-ee-common/pom.xml> to org.apache.openwebbeans/openwebbeans-ee-common/4.1.1-SNAPSHOT/openwebbeans-ee-common-4.1.1-SNAPSHOT.pom
[JENKINS] Archiving <https://ci-builds.apache.org/job/OpenWebBeans/job/OpenWebBeans%20CI%20(main)/ws/webbeans-jsf/pom.xml> to org.apache.openwebbeans/openwebbeans-jsf/4.1.1-SNAPSHOT/openwebbeans-jsf-4.1.1-SNAPSHOT.pom
[JENKINS] Archiving <https://ci-builds.apache.org/job/OpenWebBeans/job/OpenWebBeans%20CI%20(main)/ws/webbeans-arquillian/pom.xml> to org.apache.openwebbeans.arquillian/owb-arquillian-parent/4.1.1-SNAPSHOT/owb-arquillian-parent-4.1.1-SNAPSHOT.pom
[JENKINS] Archiving <https://ci-builds.apache.org/job/OpenWebBeans/job/OpenWebBeans%20CI%20(main)/ws/webbeans-el22/pom.xml> to org.apache.openwebbeans/openwebbeans-el22/4.1.1-SNAPSHOT/openwebbeans-el22-4.1.1-SNAPSHOT.pom
[JENKINS] Archiving <https://ci-builds.apache.org/job/OpenWebBeans/job/OpenWebBeans%20CI%20(main)/ws/samples/reservation/pom.xml> to org.apache.openwebbeans.samples/reservation/4.1.1-SNAPSHOT/reservation-4.1.1-SNAPSHOT.pom
[JENKINS] Archiving <https://ci-builds.apache.org/job/OpenWebBeans/job/OpenWebBeans%20CI%20(main)/ws/samples/standalone-sample/pom.xml> to org.apache.openwebbeans/standalone-sample/4.1.1-SNAPSHOT/standalone-sample-4.1.1-SNAPSHOT.pom
[JENKINS] Archiving <https://ci-builds.apache.org/job/OpenWebBeans/job/OpenWebBeans%20CI%20(main)/ws/webbeans-gradle/pom.xml> to org.apache.openwebbeans/openwebbeans-gradle/4.1.1-SNAPSHOT/openwebbeans-gradle-4.1.1-SNAPSHOT.pom
[JENKINS] Archiving <https://ci-builds.apache.org/job/OpenWebBeans/job/OpenWebBeans%20CI%20(main)/ws/samples/pom.xml> to org.apache.openwebbeans/samples/4.1.1-SNAPSHOT/samples-4.1.1-SNAPSHOT.pom
[JENKINS] Archiving <https://ci-builds.apache.org/job/OpenWebBeans/job/OpenWebBeans%20CI%20(main)/ws/webbeans-spi/pom.xml> to org.apache.openwebbeans/openwebbeans-spi/4.1.1-SNAPSHOT/openwebbeans-spi-4.1.1-SNAPSHOT.pom
[JENKINS] Archiving <https://ci-builds.apache.org/job/OpenWebBeans/job/OpenWebBeans%20CI%20(main)/ws/webbeans-spi/target/openwebbeans-spi-4.1.1-SNAPSHOT.jar> to org.apache.openwebbeans/openwebbeans-spi/4.1.1-SNAPSHOT/openwebbeans-spi-4.1.1-SNAPSHOT.jar
[JENKINS] Archiving <https://ci-builds.apache.org/job/OpenWebBeans/job/OpenWebBeans%20CI%20(main)/ws/webbeans-spi/target/openwebbeans-spi-4.1.1-SNAPSHOT-sources.jar> to org.apache.openwebbeans/openwebbeans-spi/4.1.1-SNAPSHOT/openwebbeans-spi-4.1.1-SNAPSHOT-sources.jar
[JENKINS] Archiving <https://ci-builds.apache.org/job/OpenWebBeans/job/OpenWebBeans%20CI%20(main)/ws/samples/guess/pom.xml> to org.apache.openwebbeans.samples/guess/4.1.1-SNAPSHOT/guess-4.1.1-SNAPSHOT.pom
[JENKINS] Archiving <https://ci-builds.apache.org/job/OpenWebBeans/job/OpenWebBeans%20CI%20(main)/ws/webbeans-se/pom.xml> to org.apache.openwebbeans/openwebbeans-se/4.1.1-SNAPSHOT/openwebbeans-se-4.1.1-SNAPSHOT.pom
[JENKINS] Archiving <https://ci-builds.apache.org/job/OpenWebBeans/job/OpenWebBeans%20CI%20(main)/ws/webbeans-osgi/pom.xml> to org.apache.openwebbeans/openwebbeans-osgi/4.1.1-SNAPSHOT/openwebbeans-osgi-4.1.1-SNAPSHOT.pom
[JENKINS] Archiving <https://ci-builds.apache.org/job/OpenWebBeans/job/OpenWebBeans%20CI%20(main)/ws/samples/jsf2sample/pom.xml> to org.apache.openwebbeans.samples/jsf2sample/4.1.1-SNAPSHOT/jsf2sample-4.1.1-SNAPSHOT.pom
[JENKINS] Archiving <https://ci-builds.apache.org/job/OpenWebBeans/job/OpenWebBeans%20CI%20(main)/ws/pom.xml> to org.apache.openwebbeans/openwebbeans/4.1.1-SNAPSHOT/openwebbeans-4.1.1-SNAPSHOT.pom
[JENKINS] Archiving <https://ci-builds.apache.org/job/OpenWebBeans/job/OpenWebBeans%20CI%20(main)/ws/webbeans-tck/pom.xml> to org.apache.openwebbeans/openwebbeans-tck/4.1.1-SNAPSHOT/openwebbeans-tck-4.1.1-SNAPSHOT.pom
[JENKINS] Archiving <https://ci-builds.apache.org/job/OpenWebBeans/job/OpenWebBeans%20CI%20(main)/ws/webbeans-ee/pom.xml> to org.apache.openwebbeans/openwebbeans-ee/4.1.1-SNAPSHOT/openwebbeans-ee-4.1.1-SNAPSHOT.pom
[JENKINS] Archiving <https://ci-builds.apache.org/job/OpenWebBeans/job/OpenWebBeans%20CI%20(main)/ws/webbeans-slf4j/pom.xml> to org.apache.openwebbeans/openwebbeans-slf4j/4.1.1-SNAPSHOT/openwebbeans-slf4j-4.1.1-SNAPSHOT.pom
[JENKINS] Archiving <https://ci-builds.apache.org/job/OpenWebBeans/job/OpenWebBeans%20CI%20(main)/ws/webbeans-ejb/pom.xml> to org.apache.openwebbeans/openwebbeans-ejb/4.1.1-SNAPSHOT/openwebbeans-ejb-4.1.1-SNAPSHOT.pom
[JENKINS] Archiving <https://ci-builds.apache.org/job/OpenWebBeans/job/OpenWebBeans%20CI%20(main)/ws/webbeans-junit5/pom.xml> to org.apache.openwebbeans/openwebbeans-junit5/4.1.1-SNAPSHOT/openwebbeans-junit5-4.1.1-SNAPSHOT.pom
[JENKINS] Archiving <https://ci-builds.apache.org/job/OpenWebBeans/job/OpenWebBeans%20CI%20(main)/ws/bom/pom.xml> to org.apache.openwebbeans.bom/bom/4.1.1-SNAPSHOT/bom-4.1.1-SNAPSHOT.pom
[JENKINS] Archiving <https://ci-builds.apache.org/job/OpenWebBeans/job/OpenWebBeans%20CI%20(main)/ws/samples/conversation-sample/pom.xml> to org.apache.openwebbeans.samples/conversation-sample/4.1.1-SNAPSHOT/conversation-sample-4.1.1-SNAPSHOT.pom
[JENKINS] Archiving <https://ci-builds.apache.org/job/OpenWebBeans/job/OpenWebBeans%20CI%20(main)/ws/webbeans-web/pom.xml> to org.apache.openwebbeans/openwebbeans-web/4.1.1-SNAPSHOT/openwebbeans-web-4.1.1-SNAPSHOT.pom
[JENKINS] Archiving <https://ci-builds.apache.org/job/OpenWebBeans/job/OpenWebBeans%20CI%20(main)/ws/webbeans-porting/pom.xml> to org.apache.openwebbeans/openwebbeans-porting/4.1.1-SNAPSHOT/openwebbeans-porting-4.1.1-SNAPSHOT.pom
[JENKINS] Archiving <https://ci-builds.apache.org/job/OpenWebBeans/job/OpenWebBeans%20CI%20(main)/ws/webbeans-tomcat/pom.xml> to org.apache.openwebbeans/openwebbeans-tomcat/4.1.1-SNAPSHOT/openwebbeans-tomcat-4.1.1-SNAPSHOT.pom
[JENKINS] Archiving <https://ci-builds.apache.org/job/OpenWebBeans/job/OpenWebBeans%20CI%20(main)/ws/webbeans-jms/pom.xml> to org.apache.openwebbeans/openwebbeans-jms/4.1.1-SNAPSHOT/openwebbeans-jms-4.1.1-SNAPSHOT.pom
[JENKINS] Archiving <https://ci-builds.apache.org/job/OpenWebBeans/job/OpenWebBeans%20CI%20(main)/ws/bom/openwebbeans-web-bom/pom.xml> to org.apache.openwebbeans.bom/openwebbeans-web-bom/4.1.1-SNAPSHOT/openwebbeans-web-bom-4.1.1-SNAPSHOT.pom
[JENKINS] Archiving <https://ci-builds.apache.org/job/OpenWebBeans/job/OpenWebBeans%20CI%20(main)/ws/atinject-tck/pom.xml> to org.apache.openwebbeans/atinject-tck/4.1.1-SNAPSHOT/atinject-tck-4.1.1-SNAPSHOT.pom
[JENKINS] Archiving <https://ci-builds.apache.org/job/OpenWebBeans/job/OpenWebBeans%20CI%20(main)/ws/distribution/pom.xml> to org.apache.openwebbeans/openwebbeans-distribution/4.1.1-SNAPSHOT/openwebbeans-distribution-4.1.1-SNAPSHOT.pom
[JENKINS] Archiving <https://ci-builds.apache.org/job/OpenWebBeans/job/OpenWebBeans%20CI%20(main)/ws/webbeans-arquillian/owb-arquillian-standalone/pom.xml> to org.apache.openwebbeans.arquillian/owb-arquillian-standalone/4.1.1-SNAPSHOT/owb-arquillian-standalone-4.1.1-SNAPSHOT.pom
channel stopped

Jenkins build is still unstable: OpenWebBeans » OpenWebBeans CI (main) #129

Posted by Apache Jenkins Server <je...@builds.apache.org>.
See <https://ci-builds.apache.org/job/OpenWebBeans/job/OpenWebBeans%20CI%20(main)/129/display/redirect?page=changes>