You are viewing a plain text version of this content. The canonical link for it is here.
Posted to commits@activemq.apache.org by Apache Jenkins Server <je...@builds.apache.org> on 2015/06/16 13:06:23 UTC
Build failed in Jenkins: ActiveMQ-Java7-All-UnitTests #146
See <https://builds.apache.org/job/ActiveMQ-Java7-All-UnitTests/146/changes>
Changes:
[dejan] https://issues.apache.org/jira/browse/AMQ-5841 - activemq script returns a non zero exit code for successful operations
[tabish121] https://issues.apache.org/jira/browse/AMQ-5606
[tabish121] https://issues.apache.org/jira/browse/AMQ-5621
[andy.tayls67] https://issues.apache.org/jira/browse/AMQ-5400
[tabish121] https://issues.apache.org/jira/browse/AMQ-5845
------------------------------------------
[...truncated 2289 lines...]
[INFO] ActiveMQ :: Broker ................................ SUCCESS [1:20.340s]
[INFO] ActiveMQ :: KahaDB Store .......................... SUCCESS [2:06.830s]
[INFO] ActiveMQ :: STOMP Protocol ........................ SUCCESS [8:36.103s]
[INFO] ActiveMQ :: MQTT Protocol ......................... SUCCESS [12:43.974s]
[INFO] ActiveMQ :: JDBC Store ............................ SUCCESS [2.269s]
[INFO] ActiveMQ :: LevelDB Store ......................... SUCCESS [5:17.572s]
[INFO] ActiveMQ :: Generic JMS Pool ...................... SUCCESS [41.028s]
[INFO] ActiveMQ :: Pool .................................. SUCCESS [3.134s]
[INFO] ActiveMQ :: RA .................................... SUCCESS [2:41.906s]
[INFO] ActiveMQ :: Spring ................................ SUCCESS [1:10.365s]
[INFO] ActiveMQ :: AMQP .................................. SUCCESS [9:07.579s]
[INFO] ActiveMQ :: Console ............................... SUCCESS [2.996s]
[INFO] ActiveMQ :: Partition Management .................. SUCCESS [19.933s]
[INFO] ActiveMQ :: Unit Tests ............................ FAILURE [2:02:50.078s]
[INFO] ------------------------------------------------------------------------
[INFO] BUILD FAILURE
[INFO] ------------------------------------------------------------------------
[INFO] Total time: 2:50:00.552s
[INFO] Finished at: Tue Jun 16 11:06:11 UTC 2015
[INFO] Final Memory: 97M/1003M
Tests run: 3, Failures: 0, Errors: 0, Skipped: 0, Time elapsed: 8.719 sec - in org.apache.activemq.bugs.AMQ4930Test
[INFO] ------------------------------------------------------------------------
Waiting for Jenkins to finish collecting data
[ERROR] Failed to execute goal org.apache.maven.plugins:maven-surefire-plugin:2.16:test (default-test) on project activemq-unit-tests: ExecutionException; nested exception is java.util.concurrent.ExecutionException: java.lang.RuntimeException: The forked VM terminated without saying properly goodbye. VM crash or System.exit called ?
[ERROR] Command was/bin/sh -c cd <https://builds.apache.org/job/ActiveMQ-Java7-All-UnitTests/ws/activemq-unit-tests> && /home/jenkins/tools/java/jdk1.7.0_25-32/jre/bin/java -Xmx512m -jar <https://builds.apache.org/job/ActiveMQ-Java7-All-UnitTests/ws/activemq-unit-tests/target/surefire/surefirebooter2907766302351086688.jar> <https://builds.apache.org/job/ActiveMQ-Java7-All-UnitTests/ws/activemq-unit-tests/target/surefire/surefire7941040774375154078tmp> <https://builds.apache.org/job/ActiveMQ-Java7-All-UnitTests/ws/activemq-unit-tests/target/surefire/surefire_2823151828024728666345tmp>
[ERROR] -> [Help 1]
org.apache.maven.lifecycle.LifecycleExecutionException: Failed to execute goal org.apache.maven.plugins:maven-surefire-plugin:2.16:test (default-test) on project activemq-unit-tests: ExecutionException; nested exception is java.util.concurrent.ExecutionException: java.lang.RuntimeException: The forked VM terminated without saying properly goodbye. VM crash or System.exit called ?
Command was/bin/sh -c cd <https://builds.apache.org/job/ActiveMQ-Java7-All-UnitTests/ws/activemq-unit-tests> && /home/jenkins/tools/java/jdk1.7.0_25-32/jre/bin/java -Xmx512m -jar <https://builds.apache.org/job/ActiveMQ-Java7-All-UnitTests/ws/activemq-unit-tests/target/surefire/surefirebooter2907766302351086688.jar> <https://builds.apache.org/job/ActiveMQ-Java7-All-UnitTests/ws/activemq-unit-tests/target/surefire/surefire7941040774375154078tmp> <https://builds.apache.org/job/ActiveMQ-Java7-All-UnitTests/ws/activemq-unit-tests/target/surefire/surefire_2823151828024728666345tmp>
at org.apache.maven.lifecycle.internal.MojoExecutor.execute(MojoExecutor.java:213)
at org.apache.maven.lifecycle.internal.MojoExecutor.execute(MojoExecutor.java:153)
at org.apache.maven.lifecycle.internal.MojoExecutor.execute(MojoExecutor.java:145)
at org.apache.maven.lifecycle.internal.LifecycleModuleBuilder.buildProject(LifecycleModuleBuilder.java:84)
at org.apache.maven.lifecycle.internal.LifecycleModuleBuilder.buildProject(LifecycleModuleBuilder.java:59)
at org.apache.maven.lifecycle.internal.LifecycleStarter.singleThreadedBuild(LifecycleStarter.java:183)
at org.apache.maven.lifecycle.internal.LifecycleStarter.execute(LifecycleStarter.java:161)
at org.apache.maven.DefaultMaven.doExecute(DefaultMaven.java:320)
at org.apache.maven.DefaultMaven.execute(DefaultMaven.java:156)
at org.jvnet.hudson.maven3.launcher.Maven3Launcher.main(Maven3Launcher.java:117)
at sun.reflect.NativeMethodAccessorImpl.invoke0(Native Method)
at sun.reflect.NativeMethodAccessorImpl.invoke(NativeMethodAccessorImpl.java:57)
at sun.reflect.DelegatingMethodAccessorImpl.invoke(DelegatingMethodAccessorImpl.java:43)
at java.lang.reflect.Method.invoke(Method.java:606)
at org.codehaus.plexus.classworlds.launcher.Launcher.launchStandard(Launcher.java:329)
at org.codehaus.plexus.classworlds.launcher.Launcher.launch(Launcher.java:239)
at org.jvnet.hudson.maven3.agent.Maven3Main.launch(Maven3Main.java:178)
at sun.reflect.NativeMethodAccessorImpl.invoke0(Native Method)
at sun.reflect.NativeMethodAccessorImpl.invoke(NativeMethodAccessorImpl.java:57)
at sun.reflect.DelegatingMethodAccessorImpl.invoke(DelegatingMethodAccessorImpl.java:43)
at java.lang.reflect.Method.invoke(Method.java:606)
at hudson.maven.Maven3Builder.call(Maven3Builder.java:136)
at hudson.maven.Maven3Builder.call(Maven3Builder.java:71)
at hudson.remoting.UserRequest.perform(UserRequest.java:118)
at hudson.remoting.UserRequest.perform(UserRequest.java:48)
at hudson.remoting.Request$2.run(Request.java:328)
at hudson.remoting.InterceptingExecutorService$1.call(InterceptingExecutorService.java:72)
at java.util.concurrent.FutureTask$Sync.innerRun(FutureTask.java:334)
at java.util.concurrent.FutureTask.run(FutureTask.java:166)
at java.util.concurrent.ThreadPoolExecutor.runWorker(ThreadPoolExecutor.java:1145)
at java.util.concurrent.ThreadPoolExecutor$Worker.run(ThreadPoolExecutor.java:615)
at java.lang.Thread.run(Thread.java:724)
Caused by: org.apache.maven.plugin.MojoFailureException: ExecutionException; nested exception is java.util.concurrent.ExecutionException: java.lang.RuntimeException: The forked VM terminated without saying properly goodbye. VM crash or System.exit called ?
Command was/bin/sh -c cd <https://builds.apache.org/job/ActiveMQ-Java7-All-UnitTests/ws/activemq-unit-tests> && /home/jenkins/tools/java/jdk1.7.0_25-32/jre/bin/java -Xmx512m -jar <https://builds.apache.org/job/ActiveMQ-Java7-All-UnitTests/ws/activemq-unit-tests/target/surefire/surefirebooter2907766302351086688.jar> <https://builds.apache.org/job/ActiveMQ-Java7-All-UnitTests/ws/activemq-unit-tests/target/surefire/surefire7941040774375154078tmp> <https://builds.apache.org/job/ActiveMQ-Java7-All-UnitTests/ws/activemq-unit-tests/target/surefire/surefire_2823151828024728666345tmp>
at org.apache.maven.plugin.surefire.SurefirePlugin.assertNoException(SurefirePlugin.java:198)
at org.apache.maven.plugin.surefire.SurefirePlugin.handleSummary(SurefirePlugin.java:188)
at org.apache.maven.plugin.surefire.AbstractSurefireMojo.executeAfterPreconditionsChecked(AbstractSurefireMojo.java:852)
at org.apache.maven.plugin.surefire.AbstractSurefireMojo.execute(AbstractSurefireMojo.java:720)
at org.apache.maven.plugin.DefaultBuildPluginManager.executeMojo(DefaultBuildPluginManager.java:101)
at org.apache.maven.lifecycle.internal.MojoExecutor.execute(MojoExecutor.java:209)
... 31 more
Caused by: org.apache.maven.surefire.booter.SurefireBooterForkException: ExecutionException; nested exception is java.util.concurrent.ExecutionException: java.lang.RuntimeException: The forked VM terminated without saying properly goodbye. VM crash or System.exit called ?
Command was/bin/sh -c cd <https://builds.apache.org/job/ActiveMQ-Java7-All-UnitTests/ws/activemq-unit-tests> && /home/jenkins/tools/java/jdk1.7.0_25-32/jre/bin/java -Xmx512m -jar <https://builds.apache.org/job/ActiveMQ-Java7-All-UnitTests/ws/activemq-unit-tests/target/surefire/surefirebooter2907766302351086688.jar> <https://builds.apache.org/job/ActiveMQ-Java7-All-UnitTests/ws/activemq-unit-tests/target/surefire/surefire7941040774375154078tmp> <https://builds.apache.org/job/ActiveMQ-Java7-All-UnitTests/ws/activemq-unit-tests/target/surefire/surefire_2823151828024728666345tmp>
at org.apache.maven.plugin.surefire.booterclient.ForkStarter.runSuitesForkPerTestSet(ForkStarter.java:316)
at org.apache.maven.plugin.surefire.booterclient.ForkStarter.run(ForkStarter.java:169)
at org.apache.maven.plugin.surefire.AbstractSurefireMojo.executeProvider(AbstractSurefireMojo.java:958)
at org.apache.maven.plugin.surefire.AbstractSurefireMojo.executeAfterPreconditionsChecked(AbstractSurefireMojo.java:822)
... 34 more
Caused by: java.util.concurrent.ExecutionException: java.lang.RuntimeException: The forked VM terminated without saying properly goodbye. VM crash or System.exit called ?
Command was/bin/sh -c cd <https://builds.apache.org/job/ActiveMQ-Java7-All-UnitTests/ws/activemq-unit-tests> && /home/jenkins/tools/java/jdk1.7.0_25-32/jre/bin/java -Xmx512m -jar <https://builds.apache.org/job/ActiveMQ-Java7-All-UnitTests/ws/activemq-unit-tests/target/surefire/surefirebooter2907766302351086688.jar> <https://builds.apache.org/job/ActiveMQ-Java7-All-UnitTests/ws/activemq-unit-tests/target/surefire/surefire7941040774375154078tmp> <https://builds.apache.org/job/ActiveMQ-Java7-All-UnitTests/ws/activemq-unit-tests/target/surefire/surefire_2823151828024728666345tmp>
at java.util.concurrent.FutureTask$Sync.innerGet(FutureTask.java:252)
at java.util.concurrent.FutureTask.get(FutureTask.java:111)
at org.apache.maven.plugin.surefire.booterclient.ForkStarter.runSuitesForkPerTestSet(ForkStarter.java:300)
... 37 more
Caused by: java.lang.RuntimeException: The forked VM terminated without saying properly goodbye. VM crash or System.exit called ?
Command was/bin/sh -c cd <https://builds.apache.org/job/ActiveMQ-Java7-All-UnitTests/ws/activemq-unit-tests> && /home/jenkins/tools/java/jdk1.7.0_25-32/jre/bin/java -Xmx512m -jar <https://builds.apache.org/job/ActiveMQ-Java7-All-UnitTests/ws/activemq-unit-tests/target/surefire/surefirebooter2907766302351086688.jar> <https://builds.apache.org/job/ActiveMQ-Java7-All-UnitTests/ws/activemq-unit-tests/target/surefire/surefire7941040774375154078tmp> <https://builds.apache.org/job/ActiveMQ-Java7-All-UnitTests/ws/activemq-unit-tests/target/surefire/surefire_2823151828024728666345tmp>
at org.apache.maven.plugin.surefire.booterclient.ForkStarter.fork(ForkStarter.java:485)
at org.apache.maven.plugin.surefire.booterclient.ForkStarter.fork(ForkStarter.java:352)
at org.apache.maven.plugin.surefire.booterclient.ForkStarter.access$300(ForkStarter.java:85)
at org.apache.maven.plugin.surefire.booterclient.ForkStarter$2.call(ForkStarter.java:288)
at org.apache.maven.plugin.surefire.booterclient.ForkStarter$2.call(ForkStarter.java:283)
... 5 more
[ERROR]
[ERROR] Re-run Maven using the -X switch to enable full debug logging.
[ERROR]
[ERROR] For more information about the errors and possible solutions, please read the following articles:
[ERROR] [Help 1] http://cwiki.apache.org/confluence/display/MAVEN/MojoFailureException
[ERROR]
[ERROR] After correcting the problems, you can resume the build with the command
[ERROR] mvn <goals> -rf :activemq-unit-tests
[JENKINS] Archiving <https://builds.apache.org/job/ActiveMQ-Java7-All-UnitTests/ws/activemq-unit-tests/pom.xml> to org.apache.activemq/activemq-unit-tests/5.12-SNAPSHOT/activemq-unit-tests-5.12-SNAPSHOT.pom
Sending artifact delta relative to ActiveMQ-Java7-All-UnitTests » ActiveMQ :: Unit Tests #143
Archived 1 artifacts
Archive block size is 32768
Received 1 blocks and 37691 bytes
Compression is 46.5%
Took 1.2 sec
[JENKINS] Archiving <https://builds.apache.org/job/ActiveMQ-Java7-All-UnitTests/ws/activemq-openwire-legacy/pom.xml> to org.apache.activemq/activemq-openwire-legacy/5.12-SNAPSHOT/activemq-openwire-legacy-5.12-SNAPSHOT.pom
[JENKINS] Archiving <https://builds.apache.org/job/ActiveMQ-Java7-All-UnitTests/ws/activemq-openwire-legacy/target/activemq-openwire-legacy-5.12-SNAPSHOT.jar> to org.apache.activemq/activemq-openwire-legacy/5.12-SNAPSHOT/activemq-openwire-legacy-5.12-SNAPSHOT.jar
Sending artifact delta relative to ActiveMQ-Java7-All-UnitTests » ActiveMQ :: Openwire Legacy Support #145
Archived 2 artifacts
Archive block size is 32768
Received 0 blocks and 687392 bytes
Compression is 0.0%
Took 0.78 sec
[JENKINS] Archiving <https://builds.apache.org/job/ActiveMQ-Java7-All-UnitTests/ws/activemq-jdbc-store/pom.xml> to org.apache.activemq/activemq-jdbc-store/5.12-SNAPSHOT/activemq-jdbc-store-5.12-SNAPSHOT.pom
[JENKINS] Archiving <https://builds.apache.org/job/ActiveMQ-Java7-All-UnitTests/ws/activemq-jdbc-store/target/activemq-jdbc-store-5.12-SNAPSHOT.jar> to org.apache.activemq/activemq-jdbc-store/5.12-SNAPSHOT/activemq-jdbc-store-5.12-SNAPSHOT.jar
Sending artifact delta relative to ActiveMQ-Java7-All-UnitTests » ActiveMQ :: JDBC Store #145
Archived 2 artifacts
Archive block size is 32768
Received 0 blocks and 178340 bytes
Compression is 0.0%
Took 0.28 sec
[JENKINS] Archiving <https://builds.apache.org/job/ActiveMQ-Java7-All-UnitTests/ws/activemq-amqp/pom.xml> to org.apache.activemq/activemq-amqp/5.12-SNAPSHOT/activemq-amqp-5.12-SNAPSHOT.pom
[JENKINS] Archiving <https://builds.apache.org/job/ActiveMQ-Java7-All-UnitTests/ws/activemq-amqp/target/activemq-amqp-5.12-SNAPSHOT.jar> to org.apache.activemq/activemq-amqp/5.12-SNAPSHOT/activemq-amqp-5.12-SNAPSHOT.jar
Sending artifact delta relative to ActiveMQ-Java7-All-UnitTests » ActiveMQ :: AMQP #145
Archived 2 artifacts
Archive block size is 32768
Received 0 blocks and 153699 bytes
Compression is 0.0%
Took 0.4 sec
[JENKINS] Archiving <https://builds.apache.org/job/ActiveMQ-Java7-All-UnitTests/ws/activemq-jms-pool/pom.xml> to org.apache.activemq/activemq-jms-pool/5.12-SNAPSHOT/activemq-jms-pool-5.12-SNAPSHOT.pom
[JENKINS] Archiving <https://builds.apache.org/job/ActiveMQ-Java7-All-UnitTests/ws/activemq-jms-pool/target/activemq-jms-pool-5.12-SNAPSHOT.jar> to org.apache.activemq/activemq-jms-pool/5.12-SNAPSHOT/activemq-jms-pool-5.12-SNAPSHOT.jar
Sending artifact delta relative to ActiveMQ-Java7-All-UnitTests » ActiveMQ :: Generic JMS Pool #145
Archived 2 artifacts
Archive block size is 32768
Received 0 blocks and 56305 bytes
Compression is 0.0%
Took 0.18 sec
[JENKINS] Archiving <https://builds.apache.org/job/ActiveMQ-Java7-All-UnitTests/ws/activemq-pool/pom.xml> to org.apache.activemq/activemq-pool/5.12-SNAPSHOT/activemq-pool-5.12-SNAPSHOT.pom
[JENKINS] Archiving <https://builds.apache.org/job/ActiveMQ-Java7-All-UnitTests/ws/activemq-pool/target/activemq-pool-5.12-SNAPSHOT.jar> to org.apache.activemq/activemq-pool/5.12-SNAPSHOT/activemq-pool-5.12-SNAPSHOT.jar
Sending artifact delta relative to ActiveMQ-Java7-All-UnitTests » ActiveMQ :: Pool #145
Archived 2 artifacts
Archive block size is 32768
Received 0 blocks and 23940 bytes
Compression is 0.0%
Took 44 ms
[JENKINS] Archiving <https://builds.apache.org/job/ActiveMQ-Java7-All-UnitTests/ws/activemq-stomp/pom.xml> to org.apache.activemq/activemq-stomp/5.12-SNAPSHOT/activemq-stomp-5.12-SNAPSHOT.pom
[JENKINS] Archiving <https://builds.apache.org/job/ActiveMQ-Java7-All-UnitTests/ws/activemq-stomp/target/activemq-stomp-5.12-SNAPSHOT.jar> to org.apache.activemq/activemq-stomp/5.12-SNAPSHOT/activemq-stomp-5.12-SNAPSHOT.jar
Sending artifact delta relative to ActiveMQ-Java7-All-UnitTests » ActiveMQ :: STOMP Protocol #145
Archived 2 artifacts
Archive block size is 32768
Received 0 blocks and 110448 bytes
Compression is 0.0%
Took 92 ms
[JENKINS] Archiving <https://builds.apache.org/job/ActiveMQ-Java7-All-UnitTests/ws/activemq-mqtt/pom.xml> to org.apache.activemq/activemq-mqtt/5.12-SNAPSHOT/activemq-mqtt-5.12-SNAPSHOT.pom
[JENKINS] Archiving <https://builds.apache.org/job/ActiveMQ-Java7-All-UnitTests/ws/activemq-mqtt/target/activemq-mqtt-5.12-SNAPSHOT.jar> to org.apache.activemq/activemq-mqtt/5.12-SNAPSHOT/activemq-mqtt-5.12-SNAPSHOT.jar
Sending artifact delta relative to ActiveMQ-Java7-All-UnitTests » ActiveMQ :: MQTT Protocol #145
Archived 2 artifacts
Archive block size is 32768
Received 0 blocks and 109593 bytes
Compression is 0.0%
Took 0.14 sec
[JENKINS] Archiving <https://builds.apache.org/job/ActiveMQ-Java7-All-UnitTests/ws/activemq-console/pom.xml> to org.apache.activemq/activemq-console/5.12-SNAPSHOT/activemq-console-5.12-SNAPSHOT.pom
[JENKINS] Archiving <https://builds.apache.org/job/ActiveMQ-Java7-All-UnitTests/ws/activemq-console/target/activemq-console-5.12-SNAPSHOT.jar> to org.apache.activemq/activemq-console/5.12-SNAPSHOT/activemq-console-5.12-SNAPSHOT.jar
Sending artifact delta relative to ActiveMQ-Java7-All-UnitTests » ActiveMQ :: Console #145
Archived 2 artifacts
Archive block size is 32768
Received 0 blocks and 202043 bytes
Compression is 0.0%
Took 0.41 sec
[JENKINS] Archiving <https://builds.apache.org/job/ActiveMQ-Java7-All-UnitTests/ws/activemq-client/pom.xml> to org.apache.activemq/activemq-client/5.12-SNAPSHOT/activemq-client-5.12-SNAPSHOT.pom
[JENKINS] Archiving <https://builds.apache.org/job/ActiveMQ-Java7-All-UnitTests/ws/activemq-client/target/activemq-client-5.12-SNAPSHOT.jar> to org.apache.activemq/activemq-client/5.12-SNAPSHOT/activemq-client-5.12-SNAPSHOT.jar
Sending artifact delta relative to ActiveMQ-Java7-All-UnitTests » ActiveMQ :: Client #145
Archived 2 artifacts
Archive block size is 32768
Received 0 blocks and 1197742 bytes
Compression is 0.0%
Took 0.63 sec
[JENKINS] Archiving <https://builds.apache.org/job/ActiveMQ-Java7-All-UnitTests/ws/pom.xml> to org.apache.activemq/activemq-parent/5.12-SNAPSHOT/activemq-parent-5.12-SNAPSHOT.pom
Sending artifact delta relative to ActiveMQ-Java7-All-UnitTests » ActiveMQ #145
Archived 1 artifacts
Archive block size is 32768
Received 0 blocks and 59390 bytes
Compression is 0.0%
Took 0.13 sec
[JENKINS] Archiving <https://builds.apache.org/job/ActiveMQ-Java7-All-UnitTests/ws/activemq-broker/pom.xml> to org.apache.activemq/activemq-broker/5.12-SNAPSHOT/activemq-broker-5.12-SNAPSHOT.pom
[JENKINS] Archiving <https://builds.apache.org/job/ActiveMQ-Java7-All-UnitTests/ws/activemq-broker/target/activemq-broker-5.12-SNAPSHOT.jar> to org.apache.activemq/activemq-broker/5.12-SNAPSHOT/activemq-broker-5.12-SNAPSHOT.jar
[JENKINS] Archiving <https://builds.apache.org/job/ActiveMQ-Java7-All-UnitTests/ws/activemq-broker/target/activemq-broker-5.12-SNAPSHOT-tests.jar> to org.apache.activemq/activemq-broker/5.12-SNAPSHOT/activemq-broker-5.12-SNAPSHOT-tests.jar
Sending artifact delta relative to ActiveMQ-Java7-All-UnitTests » ActiveMQ :: Broker #145
Archived 3 artifacts
Archive block size is 32768
Received 0 blocks and 1169405 bytes
Compression is 0.0%
Took 0.68 sec
[JENKINS] Archiving <https://builds.apache.org/job/ActiveMQ-Java7-All-UnitTests/ws/activemq-ra/pom.xml> to org.apache.activemq/activemq-ra/5.12-SNAPSHOT/activemq-ra-5.12-SNAPSHOT.pom
[JENKINS] Archiving <https://builds.apache.org/job/ActiveMQ-Java7-All-UnitTests/ws/activemq-ra/target/activemq-ra-5.12-SNAPSHOT.jar> to org.apache.activemq/activemq-ra/5.12-SNAPSHOT/activemq-ra-5.12-SNAPSHOT.jar
[JENKINS] Archiving <https://builds.apache.org/job/ActiveMQ-Java7-All-UnitTests/ws/activemq-ra/target/xbean/activemq-ra.xsd> to org.apache.activemq/activemq-ra/5.12-SNAPSHOT/activemq-ra-5.12-SNAPSHOT.xsd
[JENKINS] Archiving <https://builds.apache.org/job/ActiveMQ-Java7-All-UnitTests/ws/activemq-ra/target/xbean/activemq-ra.xsd.html> to org.apache.activemq/activemq-ra/5.12-SNAPSHOT/activemq-ra-5.12-SNAPSHOT-schema.html
[JENKINS] Archiving <https://builds.apache.org/job/ActiveMQ-Java7-All-UnitTests/ws/activemq-ra/target/xbean/activemq-ra.xsd.html> to org.apache.activemq/activemq-ra/5.12-SNAPSHOT/activemq-ra-5.12-SNAPSHOT.xsd.html
Sending artifact delta relative to ActiveMQ-Java7-All-UnitTests » ActiveMQ :: RA #145
Archived 5 artifacts
Archive block size is 32768
Received 0 blocks and 128017 bytes
Compression is 0.0%
Took 0.24 sec
[JENKINS] Archiving <https://builds.apache.org/job/ActiveMQ-Java7-All-UnitTests/ws/activemq-spring/pom.xml> to org.apache.activemq/activemq-spring/5.12-SNAPSHOT/activemq-spring-5.12-SNAPSHOT.pom
[JENKINS] Archiving <https://builds.apache.org/job/ActiveMQ-Java7-All-UnitTests/ws/activemq-spring/target/activemq-spring-5.12-SNAPSHOT.jar> to org.apache.activemq/activemq-spring/5.12-SNAPSHOT/activemq-spring-5.12-SNAPSHOT.jar
[JENKINS] Archiving <https://builds.apache.org/job/ActiveMQ-Java7-All-UnitTests/ws/activemq-spring/target/classes/activemq.xsd> to org.apache.activemq/activemq-spring/5.12-SNAPSHOT/activemq-spring-5.12-SNAPSHOT.xsd
[JENKINS] Archiving <https://builds.apache.org/job/ActiveMQ-Java7-All-UnitTests/ws/activemq-spring/target/classes/activemq.xsd.html> to org.apache.activemq/activemq-spring/5.12-SNAPSHOT/activemq-spring-5.12-SNAPSHOT-schema.html
Sending artifact delta relative to ActiveMQ-Java7-All-UnitTests » ActiveMQ :: Spring #145
Archived 4 artifacts
Archive block size is 32768
Received 22 blocks and 180213 bytes
Compression is 80.0%
Took 0.27 sec
[JENKINS] Archiving <https://builds.apache.org/job/ActiveMQ-Java7-All-UnitTests/ws/activemq-kahadb-store/pom.xml> to org.apache.activemq/activemq-kahadb-store/5.12-SNAPSHOT/activemq-kahadb-store-5.12-SNAPSHOT.pom
[JENKINS] Archiving <https://builds.apache.org/job/ActiveMQ-Java7-All-UnitTests/ws/activemq-kahadb-store/target/activemq-kahadb-store-5.12-SNAPSHOT.jar> to org.apache.activemq/activemq-kahadb-store/5.12-SNAPSHOT/activemq-kahadb-store-5.12-SNAPSHOT.jar
Sending artifact delta relative to ActiveMQ-Java7-All-UnitTests » ActiveMQ :: KahaDB Store #145
Archived 2 artifacts
Archive block size is 32768
Received 0 blocks and 642135 bytes
Compression is 0.0%
Took 0.35 sec
[JENKINS] Archiving <https://builds.apache.org/job/ActiveMQ-Java7-All-UnitTests/ws/activemq-jaas/pom.xml> to org.apache.activemq/activemq-jaas/5.12-SNAPSHOT/activemq-jaas-5.12-SNAPSHOT.pom
[JENKINS] Archiving <https://builds.apache.org/job/ActiveMQ-Java7-All-UnitTests/ws/activemq-jaas/target/activemq-jaas-5.12-SNAPSHOT.jar> to org.apache.activemq/activemq-jaas/5.12-SNAPSHOT/activemq-jaas-5.12-SNAPSHOT.jar
Sending artifact delta relative to ActiveMQ-Java7-All-UnitTests » ActiveMQ :: JAAS #145
Archived 2 artifacts
Archive block size is 32768
Received 0 blocks and 37982 bytes
Compression is 0.0%
Took 91 ms
[JENKINS] Archiving <https://builds.apache.org/job/ActiveMQ-Java7-All-UnitTests/ws/activemq-partition/pom.xml> to org.apache.activemq/activemq-partition/5.12-SNAPSHOT/activemq-partition-5.12-SNAPSHOT.pom
[JENKINS] Archiving <https://builds.apache.org/job/ActiveMQ-Java7-All-UnitTests/ws/activemq-partition/target/activemq-partition-5.12-SNAPSHOT.jar> to org.apache.activemq/activemq-partition/5.12-SNAPSHOT/activemq-partition-5.12-SNAPSHOT.jar
Sending artifact delta relative to ActiveMQ-Java7-All-UnitTests » ActiveMQ :: Partition Management #145
Archived 2 artifacts
Archive block size is 32768
Received 0 blocks and 28980 bytes
Compression is 0.0%
Took 0.23 sec
[JENKINS] Archiving <https://builds.apache.org/job/ActiveMQ-Java7-All-UnitTests/ws/activemq-leveldb-store/pom.xml> to org.apache.activemq/activemq-leveldb-store/5.12-SNAPSHOT/activemq-leveldb-store-5.12-SNAPSHOT.pom
[JENKINS] Archiving <https://builds.apache.org/job/ActiveMQ-Java7-All-UnitTests/ws/activemq-leveldb-store/target/activemq-leveldb-store-5.12-SNAPSHOT.jar> to org.apache.activemq/activemq-leveldb-store/5.12-SNAPSHOT/activemq-leveldb-store-5.12-SNAPSHOT.jar
Sending artifact delta relative to ActiveMQ-Java7-All-UnitTests » ActiveMQ :: LevelDB Store #145
Archived 2 artifacts
Archive block size is 32768
Received 0 blocks and 991378 bytes
Compression is 0.0%
Took 0.51 sec
channel stopped
[locks-and-latches] Releasing all the locks
[locks-and-latches] All the locks released
Build failed in Jenkins: ActiveMQ-Java7-All-UnitTests #149
Posted by Apache Jenkins Server <je...@builds.apache.org>.
See <https://builds.apache.org/job/ActiveMQ-Java7-All-UnitTests/149/changes>
Changes:
[tabish121] https://issues.apache.org/jira/browse/AMQ-5848
[tabish121] https://issues.apache.org/jira/browse/AMQ-5850
[gtully] add sanity test for masterslave scheme for networkconnectors
[gtully] ensure data dir is empty for test as derby needs clean dir
[gtully] fix intermittent failure with thread accounting test VmTransportNetworkBrokerTest, it did not lie. ci
[gtully] fix intermittent failure - wait rather than sleep which also speeds up the test run
[gtully] https://issues.apache.org/jira/browse/AMQ-5853 - fix and test, statement was not configurable from xml also so there is no workaround.
[tabish121] https://issues.apache.org/jira/browse/AMQ-5811
[tabish121] https://issues.apache.org/jira/browse/AMQ-5804
[tabish121] https://issues.apache.org/jira/browse/AMQ-5740
------------------------------------------
[...truncated 9616 lines...]
[INFO] ActiveMQ :: JAAS .................................. SUCCESS [38.967s]
[INFO] ActiveMQ :: Broker ................................ SUCCESS [1:20.316s]
[INFO] ActiveMQ :: KahaDB Store .......................... SUCCESS [3:53.920s]
[INFO] ActiveMQ :: STOMP Protocol ........................ SUCCESS [8:31.702s]
[INFO] ActiveMQ :: MQTT Protocol ......................... SUCCESS [12:36.068s]
[INFO] ActiveMQ :: JDBC Store ............................ SUCCESS [1.080s]
[INFO] ActiveMQ :: LevelDB Store ......................... SUCCESS [11:17.751s]
[INFO] ActiveMQ :: Generic JMS Pool ...................... SUCCESS [42.535s]
[INFO] ActiveMQ :: Pool .................................. SUCCESS [2.805s]
[INFO] ActiveMQ :: RA .................................... SUCCESS [2:34.552s]
[INFO] ActiveMQ :: Spring ................................ SUCCESS [1:13.959s]
[INFO] ActiveMQ :: AMQP .................................. SUCCESS [8:10.535s]
[INFO] ActiveMQ :: Console ............................... SUCCESS [4.606s]
[INFO] ActiveMQ :: Partition Management .................. SUCCESS [18.554s]
[INFO] ActiveMQ :: Unit Tests ............................ FAILURE [7:59:25.689s]
[INFO] ------------------------------------------------------------------------
[INFO] BUILD FAILURE
[INFO] ------------------------------------------------------------------------
[INFO] Total time: 8:53:03.258s
[INFO] Finished at: Sat Jun 20 13:36:41 UTC 2015
[INFO] Final Memory: 126M/1013M
[INFO] ------------------------------------------------------------------------
Waiting for Jenkins to finish collecting data
[ERROR] Failed to execute goal org.apache.maven.plugins:maven-surefire-plugin:2.16:test (default-test) on project activemq-unit-tests: ExecutionException; nested exception is java.util.concurrent.ExecutionException: java.lang.RuntimeException: The forked VM terminated without saying properly goodbye. VM crash or System.exit called ?
[ERROR] Command was/bin/sh -c cd <https://builds.apache.org/job/ActiveMQ-Java7-All-UnitTests/ws/activemq-unit-tests> && /x1/jenkins/tools/java/jdk1.7.0_25-32/jre/bin/java -Xmx512m -jar <https://builds.apache.org/job/ActiveMQ-Java7-All-UnitTests/ws/activemq-unit-tests/target/surefire/surefirebooter5881143751691245626.jar> <https://builds.apache.org/job/ActiveMQ-Java7-All-UnitTests/ws/activemq-unit-tests/target/surefire/surefire8573355091936125160tmp> <https://builds.apache.org/job/ActiveMQ-Java7-All-UnitTests/ws/activemq-unit-tests/target/surefire/surefire_10514079843236511172240tmp>
[ERROR] -> [Help 1]
org.apache.maven.lifecycle.LifecycleExecutionException: Failed to execute goal org.apache.maven.plugins:maven-surefire-plugin:2.16:test (default-test) on project activemq-unit-tests: ExecutionException; nested exception is java.util.concurrent.ExecutionException: java.lang.RuntimeException: The forked VM terminated without saying properly goodbye. VM crash or System.exit called ?
Command was/bin/sh -c cd <https://builds.apache.org/job/ActiveMQ-Java7-All-UnitTests/ws/activemq-unit-tests> && /x1/jenkins/tools/java/jdk1.7.0_25-32/jre/bin/java -Xmx512m -jar <https://builds.apache.org/job/ActiveMQ-Java7-All-UnitTests/ws/activemq-unit-tests/target/surefire/surefirebooter5881143751691245626.jar> <https://builds.apache.org/job/ActiveMQ-Java7-All-UnitTests/ws/activemq-unit-tests/target/surefire/surefire8573355091936125160tmp> <https://builds.apache.org/job/ActiveMQ-Java7-All-UnitTests/ws/activemq-unit-tests/target/surefire/surefire_10514079843236511172240tmp>
at org.apache.maven.lifecycle.internal.MojoExecutor.execute(MojoExecutor.java:213)
at org.apache.maven.lifecycle.internal.MojoExecutor.execute(MojoExecutor.java:153)
at org.apache.maven.lifecycle.internal.MojoExecutor.execute(MojoExecutor.java:145)
at org.apache.maven.lifecycle.internal.LifecycleModuleBuilder.buildProject(LifecycleModuleBuilder.java:84)
at org.apache.maven.lifecycle.internal.LifecycleModuleBuilder.buildProject(LifecycleModuleBuilder.java:59)
at org.apache.maven.lifecycle.internal.LifecycleStarter.singleThreadedBuild(LifecycleStarter.java:183)
at org.apache.maven.lifecycle.internal.LifecycleStarter.execute(LifecycleStarter.java:161)
at org.apache.maven.DefaultMaven.doExecute(DefaultMaven.java:320)
at org.apache.maven.DefaultMaven.execute(DefaultMaven.java:156)
at org.jvnet.hudson.maven3.launcher.Maven3Launcher.main(Maven3Launcher.java:117)
at sun.reflect.NativeMethodAccessorImpl.invoke0(Native Method)
at sun.reflect.NativeMethodAccessorImpl.invoke(NativeMethodAccessorImpl.java:57)
at sun.reflect.DelegatingMethodAccessorImpl.invoke(DelegatingMethodAccessorImpl.java:43)
at java.lang.reflect.Method.invoke(Method.java:606)
at org.codehaus.plexus.classworlds.launcher.Launcher.launchStandard(Launcher.java:329)
at org.codehaus.plexus.classworlds.launcher.Launcher.launch(Launcher.java:239)
at org.jvnet.hudson.maven3.agent.Maven3Main.launch(Maven3Main.java:178)
at sun.reflect.NativeMethodAccessorImpl.invoke0(Native Method)
at sun.reflect.NativeMethodAccessorImpl.invoke(NativeMethodAccessorImpl.java:57)
at sun.reflect.DelegatingMethodAccessorImpl.invoke(DelegatingMethodAccessorImpl.java:43)
at java.lang.reflect.Method.invoke(Method.java:606)
at hudson.maven.Maven3Builder.call(Maven3Builder.java:136)
at hudson.maven.Maven3Builder.call(Maven3Builder.java:71)
at hudson.remoting.UserRequest.perform(UserRequest.java:118)
at hudson.remoting.UserRequest.perform(UserRequest.java:48)
at hudson.remoting.Request$2.run(Request.java:328)
at hudson.remoting.InterceptingExecutorService$1.call(InterceptingExecutorService.java:72)
at java.util.concurrent.FutureTask$Sync.innerRun(FutureTask.java:334)
at java.util.concurrent.FutureTask.run(FutureTask.java:166)
at java.util.concurrent.ThreadPoolExecutor.runWorker(ThreadPoolExecutor.java:1145)
at java.util.concurrent.ThreadPoolExecutor$Worker.run(ThreadPoolExecutor.java:615)
at java.lang.Thread.run(Thread.java:724)
Caused by: org.apache.maven.plugin.MojoFailureException: ExecutionException; nested exception is java.util.concurrent.ExecutionException: java.lang.RuntimeException: The forked VM terminated without saying properly goodbye. VM crash or System.exit called ?
Command was/bin/sh -c cd <https://builds.apache.org/job/ActiveMQ-Java7-All-UnitTests/ws/activemq-unit-tests> && /x1/jenkins/tools/java/jdk1.7.0_25-32/jre/bin/java -Xmx512m -jar <https://builds.apache.org/job/ActiveMQ-Java7-All-UnitTests/ws/activemq-unit-tests/target/surefire/surefirebooter5881143751691245626.jar> <https://builds.apache.org/job/ActiveMQ-Java7-All-UnitTests/ws/activemq-unit-tests/target/surefire/surefire8573355091936125160tmp> <https://builds.apache.org/job/ActiveMQ-Java7-All-UnitTests/ws/activemq-unit-tests/target/surefire/surefire_10514079843236511172240tmp>
at org.apache.maven.plugin.surefire.SurefirePlugin.assertNoException(SurefirePlugin.java:198)
at org.apache.maven.plugin.surefire.SurefirePlugin.handleSummary(SurefirePlugin.java:188)
at org.apache.maven.plugin.surefire.AbstractSurefireMojo.executeAfterPreconditionsChecked(AbstractSurefireMojo.java:852)
at org.apache.maven.plugin.surefire.AbstractSurefireMojo.execute(AbstractSurefireMojo.java:720)
at org.apache.maven.plugin.DefaultBuildPluginManager.executeMojo(DefaultBuildPluginManager.java:101)
at org.apache.maven.lifecycle.internal.MojoExecutor.execute(MojoExecutor.java:209)
... 31 more
Caused by: org.apache.maven.surefire.booter.SurefireBooterForkException: ExecutionException; nested exception is java.util.concurrent.ExecutionException: java.lang.RuntimeException: The forked VM terminated without saying properly goodbye. VM crash or System.exit called ?
Command was/bin/sh -c cd <https://builds.apache.org/job/ActiveMQ-Java7-All-UnitTests/ws/activemq-unit-tests> && /x1/jenkins/tools/java/jdk1.7.0_25-32/jre/bin/java -Xmx512m -jar <https://builds.apache.org/job/ActiveMQ-Java7-All-UnitTests/ws/activemq-unit-tests/target/surefire/surefirebooter5881143751691245626.jar> <https://builds.apache.org/job/ActiveMQ-Java7-All-UnitTests/ws/activemq-unit-tests/target/surefire/surefire8573355091936125160tmp> <https://builds.apache.org/job/ActiveMQ-Java7-All-UnitTests/ws/activemq-unit-tests/target/surefire/surefire_10514079843236511172240tmp>
at org.apache.maven.plugin.surefire.booterclient.ForkStarter.runSuitesForkPerTestSet(ForkStarter.java:316)
at org.apache.maven.plugin.surefire.booterclient.ForkStarter.run(ForkStarter.java:169)
at org.apache.maven.plugin.surefire.AbstractSurefireMojo.executeProvider(AbstractSurefireMojo.java:958)
at org.apache.maven.plugin.surefire.AbstractSurefireMojo.executeAfterPreconditionsChecked(AbstractSurefireMojo.java:822)
... 34 more
Caused by: java.util.concurrent.ExecutionException: java.lang.RuntimeException: The forked VM terminated without saying properly goodbye. VM crash or System.exit called ?
Command was/bin/sh -c cd <https://builds.apache.org/job/ActiveMQ-Java7-All-UnitTests/ws/activemq-unit-tests> && /x1/jenkins/tools/java/jdk1.7.0_25-32/jre/bin/java -Xmx512m -jar <https://builds.apache.org/job/ActiveMQ-Java7-All-UnitTests/ws/activemq-unit-tests/target/surefire/surefirebooter5881143751691245626.jar> <https://builds.apache.org/job/ActiveMQ-Java7-All-UnitTests/ws/activemq-unit-tests/target/surefire/surefire8573355091936125160tmp> <https://builds.apache.org/job/ActiveMQ-Java7-All-UnitTests/ws/activemq-unit-tests/target/surefire/surefire_10514079843236511172240tmp>
at java.util.concurrent.FutureTask$Sync.innerGet(FutureTask.java:252)
at java.util.concurrent.FutureTask.get(FutureTask.java:111)
at org.apache.maven.plugin.surefire.booterclient.ForkStarter.runSuitesForkPerTestSet(ForkStarter.java:300)
... 37 more
Caused by: java.lang.RuntimeException: The forked VM terminated without saying properly goodbye. VM crash or System.exit called ?
Command was/bin/sh -c cd <https://builds.apache.org/job/ActiveMQ-Java7-All-UnitTests/ws/activemq-unit-tests> && /x1/jenkins/tools/java/jdk1.7.0_25-32/jre/bin/java -Xmx512m -jar <https://builds.apache.org/job/ActiveMQ-Java7-All-UnitTests/ws/activemq-unit-tests/target/surefire/surefirebooter5881143751691245626.jar> <https://builds.apache.org/job/ActiveMQ-Java7-All-UnitTests/ws/activemq-unit-tests/target/surefire/surefire8573355091936125160tmp> <https://builds.apache.org/job/ActiveMQ-Java7-All-UnitTests/ws/activemq-unit-tests/target/surefire/surefire_10514079843236511172240tmp>
at org.apache.maven.plugin.surefire.booterclient.ForkStarter.fork(ForkStarter.java:485)
at org.apache.maven.plugin.surefire.booterclient.ForkStarter.fork(ForkStarter.java:352)
at org.apache.maven.plugin.surefire.booterclient.ForkStarter.access$300(ForkStarter.java:85)
at org.apache.maven.plugin.surefire.booterclient.ForkStarter$2.call(ForkStarter.java:288)
at org.apache.maven.plugin.surefire.booterclient.ForkStarter$2.call(ForkStarter.java:283)
... 5 more
[ERROR]
[ERROR] Re-run Maven using the -X switch to enable full debug logging.
[ERROR]
[ERROR] For more information about the errors and possible solutions, please read the following articles:
[ERROR] [Help 1] http://cwiki.apache.org/confluence/display/MAVEN/MojoFailureException
[ERROR]
[ERROR] After correcting the problems, you can resume the build with the command
[ERROR] mvn <goals> -rf :activemq-unit-tests
[JENKINS] Archiving <https://builds.apache.org/job/ActiveMQ-Java7-All-UnitTests/ws/activemq-unit-tests/pom.xml> to org.apache.activemq/activemq-unit-tests/5.12-SNAPSHOT/activemq-unit-tests-5.12-SNAPSHOT.pom
Sending artifact delta relative to ActiveMQ-Java7-All-UnitTests ? ActiveMQ :: Unit Tests #147
Archived 1 artifacts
Archive block size is 32768
Received 1 blocks and 37765 bytes
Compression is 46.5%
Took 0.61 sec
[JENKINS] Archiving <https://builds.apache.org/job/ActiveMQ-Java7-All-UnitTests/ws/activemq-openwire-legacy/pom.xml> to org.apache.activemq/activemq-openwire-legacy/5.12-SNAPSHOT/activemq-openwire-legacy-5.12-SNAPSHOT.pom
[JENKINS] Archiving <https://builds.apache.org/job/ActiveMQ-Java7-All-UnitTests/ws/activemq-openwire-legacy/target/activemq-openwire-legacy-5.12-SNAPSHOT.jar> to org.apache.activemq/activemq-openwire-legacy/5.12-SNAPSHOT/activemq-openwire-legacy-5.12-SNAPSHOT.jar
Sending artifact delta relative to ActiveMQ-Java7-All-UnitTests ? ActiveMQ :: Openwire Legacy Support #148
Archived 2 artifacts
Archive block size is 32768
Received 0 blocks and 687389 bytes
Compression is 0.0%
Took 0.44 sec
[JENKINS] Archiving <https://builds.apache.org/job/ActiveMQ-Java7-All-UnitTests/ws/activemq-jdbc-store/pom.xml> to org.apache.activemq/activemq-jdbc-store/5.12-SNAPSHOT/activemq-jdbc-store-5.12-SNAPSHOT.pom
[JENKINS] Archiving <https://builds.apache.org/job/ActiveMQ-Java7-All-UnitTests/ws/activemq-jdbc-store/target/activemq-jdbc-store-5.12-SNAPSHOT.jar> to org.apache.activemq/activemq-jdbc-store/5.12-SNAPSHOT/activemq-jdbc-store-5.12-SNAPSHOT.jar
Sending artifact delta relative to ActiveMQ-Java7-All-UnitTests ? ActiveMQ :: JDBC Store #148
Archived 2 artifacts
Archive block size is 32768
Received 0 blocks and 178417 bytes
Compression is 0.0%
Took 0.15 sec
[JENKINS] Archiving <https://builds.apache.org/job/ActiveMQ-Java7-All-UnitTests/ws/activemq-amqp/pom.xml> to org.apache.activemq/activemq-amqp/5.12-SNAPSHOT/activemq-amqp-5.12-SNAPSHOT.pom
[JENKINS] Archiving <https://builds.apache.org/job/ActiveMQ-Java7-All-UnitTests/ws/activemq-amqp/target/activemq-amqp-5.12-SNAPSHOT.jar> to org.apache.activemq/activemq-amqp/5.12-SNAPSHOT/activemq-amqp-5.12-SNAPSHOT.jar
Sending artifact delta relative to ActiveMQ-Java7-All-UnitTests ? ActiveMQ :: AMQP #148
Archived 2 artifacts
Archive block size is 32768
Received 0 blocks and 154558 bytes
Compression is 0.0%
Took 0.41 sec
[JENKINS] Archiving <https://builds.apache.org/job/ActiveMQ-Java7-All-UnitTests/ws/activemq-jms-pool/pom.xml> to org.apache.activemq/activemq-jms-pool/5.12-SNAPSHOT/activemq-jms-pool-5.12-SNAPSHOT.pom
[JENKINS] Archiving <https://builds.apache.org/job/ActiveMQ-Java7-All-UnitTests/ws/activemq-jms-pool/target/activemq-jms-pool-5.12-SNAPSHOT.jar> to org.apache.activemq/activemq-jms-pool/5.12-SNAPSHOT/activemq-jms-pool-5.12-SNAPSHOT.jar
Sending artifact delta relative to ActiveMQ-Java7-All-UnitTests ? ActiveMQ :: Generic JMS Pool #148
Archived 2 artifacts
Archive block size is 32768
Received 0 blocks and 56304 bytes
Compression is 0.0%
Took 0.1 sec
[JENKINS] Archiving <https://builds.apache.org/job/ActiveMQ-Java7-All-UnitTests/ws/activemq-pool/pom.xml> to org.apache.activemq/activemq-pool/5.12-SNAPSHOT/activemq-pool-5.12-SNAPSHOT.pom
[JENKINS] Archiving <https://builds.apache.org/job/ActiveMQ-Java7-All-UnitTests/ws/activemq-pool/target/activemq-pool-5.12-SNAPSHOT.jar> to org.apache.activemq/activemq-pool/5.12-SNAPSHOT/activemq-pool-5.12-SNAPSHOT.jar
Sending artifact delta relative to ActiveMQ-Java7-All-UnitTests ? ActiveMQ :: Pool #148
Archived 2 artifacts
Archive block size is 32768
Received 0 blocks and 23939 bytes
Compression is 0.0%
Took 0.19 sec
[JENKINS] Archiving <https://builds.apache.org/job/ActiveMQ-Java7-All-UnitTests/ws/activemq-stomp/pom.xml> to org.apache.activemq/activemq-stomp/5.12-SNAPSHOT/activemq-stomp-5.12-SNAPSHOT.pom
[JENKINS] Archiving <https://builds.apache.org/job/ActiveMQ-Java7-All-UnitTests/ws/activemq-stomp/target/activemq-stomp-5.12-SNAPSHOT.jar> to org.apache.activemq/activemq-stomp/5.12-SNAPSHOT/activemq-stomp-5.12-SNAPSHOT.jar
Sending artifact delta relative to ActiveMQ-Java7-All-UnitTests ? ActiveMQ :: STOMP Protocol #148
Archived 2 artifacts
Archive block size is 32768
Received 0 blocks and 110447 bytes
Compression is 0.0%
Took 59 ms
[JENKINS] Archiving <https://builds.apache.org/job/ActiveMQ-Java7-All-UnitTests/ws/activemq-mqtt/pom.xml> to org.apache.activemq/activemq-mqtt/5.12-SNAPSHOT/activemq-mqtt-5.12-SNAPSHOT.pom
[JENKINS] Archiving <https://builds.apache.org/job/ActiveMQ-Java7-All-UnitTests/ws/activemq-mqtt/target/activemq-mqtt-5.12-SNAPSHOT.jar> to org.apache.activemq/activemq-mqtt/5.12-SNAPSHOT/activemq-mqtt-5.12-SNAPSHOT.jar
Sending artifact delta relative to ActiveMQ-Java7-All-UnitTests ? ActiveMQ :: MQTT Protocol #148
Archived 2 artifacts
Archive block size is 32768
Received 0 blocks and 109592 bytes
Compression is 0.0%
Took 0.28 sec
[JENKINS] Archiving <https://builds.apache.org/job/ActiveMQ-Java7-All-UnitTests/ws/activemq-console/pom.xml> to org.apache.activemq/activemq-console/5.12-SNAPSHOT/activemq-console-5.12-SNAPSHOT.pom
[JENKINS] Archiving <https://builds.apache.org/job/ActiveMQ-Java7-All-UnitTests/ws/activemq-console/target/activemq-console-5.12-SNAPSHOT.jar> to org.apache.activemq/activemq-console/5.12-SNAPSHOT/activemq-console-5.12-SNAPSHOT.jar
Sending artifact delta relative to ActiveMQ-Java7-All-UnitTests ? ActiveMQ :: Console #148
Archived 2 artifacts
Archive block size is 32768
Received 0 blocks and 203791 bytes
Compression is 0.0%
Took 0.51 sec
[JENKINS] Archiving <https://builds.apache.org/job/ActiveMQ-Java7-All-UnitTests/ws/activemq-client/pom.xml> to org.apache.activemq/activemq-client/5.12-SNAPSHOT/activemq-client-5.12-SNAPSHOT.pom
[JENKINS] Archiving <https://builds.apache.org/job/ActiveMQ-Java7-All-UnitTests/ws/activemq-client/target/activemq-client-5.12-SNAPSHOT.jar> to org.apache.activemq/activemq-client/5.12-SNAPSHOT/activemq-client-5.12-SNAPSHOT.jar
Sending artifact delta relative to ActiveMQ-Java7-All-UnitTests ? ActiveMQ :: Client #148
Archived 2 artifacts
Archive block size is 32768
Received 0 blocks and 1297404 bytes
Compression is 0.0%
Took 0.65 sec
[JENKINS] Archiving <https://builds.apache.org/job/ActiveMQ-Java7-All-UnitTests/ws/pom.xml> to org.apache.activemq/activemq-parent/5.12-SNAPSHOT/activemq-parent-5.12-SNAPSHOT.pom
Sending artifact delta relative to ActiveMQ-Java7-All-UnitTests ? ActiveMQ #148
Archived 1 artifacts
Archive block size is 32768
Received 1 blocks and 26622 bytes
Compression is 55.2%
Took 85 ms
[JENKINS] Archiving <https://builds.apache.org/job/ActiveMQ-Java7-All-UnitTests/ws/activemq-broker/pom.xml> to org.apache.activemq/activemq-broker/5.12-SNAPSHOT/activemq-broker-5.12-SNAPSHOT.pom
[JENKINS] Archiving <https://builds.apache.org/job/ActiveMQ-Java7-All-UnitTests/ws/activemq-broker/target/activemq-broker-5.12-SNAPSHOT.jar> to org.apache.activemq/activemq-broker/5.12-SNAPSHOT/activemq-broker-5.12-SNAPSHOT.jar
[JENKINS] Archiving <https://builds.apache.org/job/ActiveMQ-Java7-All-UnitTests/ws/activemq-broker/target/activemq-broker-5.12-SNAPSHOT-tests.jar> to org.apache.activemq/activemq-broker/5.12-SNAPSHOT/activemq-broker-5.12-SNAPSHOT-tests.jar
Sending artifact delta relative to ActiveMQ-Java7-All-UnitTests ? ActiveMQ :: Broker #148
Archived 3 artifacts
Archive block size is 32768
Received 0 blocks and 1169871 bytes
Compression is 0.0%
Took 0.6 sec
[JENKINS] Archiving <https://builds.apache.org/job/ActiveMQ-Java7-All-UnitTests/ws/activemq-ra/pom.xml> to org.apache.activemq/activemq-ra/5.12-SNAPSHOT/activemq-ra-5.12-SNAPSHOT.pom
[JENKINS] Archiving <https://builds.apache.org/job/ActiveMQ-Java7-All-UnitTests/ws/activemq-ra/target/activemq-ra-5.12-SNAPSHOT.jar> to org.apache.activemq/activemq-ra/5.12-SNAPSHOT/activemq-ra-5.12-SNAPSHOT.jar
[JENKINS] Archiving <https://builds.apache.org/job/ActiveMQ-Java7-All-UnitTests/ws/activemq-ra/target/xbean/activemq-ra.xsd> to org.apache.activemq/activemq-ra/5.12-SNAPSHOT/activemq-ra-5.12-SNAPSHOT.xsd
[JENKINS] Archiving <https://builds.apache.org/job/ActiveMQ-Java7-All-UnitTests/ws/activemq-ra/target/xbean/activemq-ra.xsd.html> to org.apache.activemq/activemq-ra/5.12-SNAPSHOT/activemq-ra-5.12-SNAPSHOT-schema.html
[JENKINS] Archiving <https://builds.apache.org/job/ActiveMQ-Java7-All-UnitTests/ws/activemq-ra/target/xbean/activemq-ra.xsd.html> to org.apache.activemq/activemq-ra/5.12-SNAPSHOT/activemq-ra-5.12-SNAPSHOT.xsd.html
Sending artifact delta relative to ActiveMQ-Java7-All-UnitTests ? ActiveMQ :: RA #148
Archived 5 artifacts
Archive block size is 32768
Received 0 blocks and 128115 bytes
Compression is 0.0%
Took 0.2 sec
[JENKINS] Archiving <https://builds.apache.org/job/ActiveMQ-Java7-All-UnitTests/ws/activemq-spring/pom.xml> to org.apache.activemq/activemq-spring/5.12-SNAPSHOT/activemq-spring-5.12-SNAPSHOT.pom
[JENKINS] Archiving <https://builds.apache.org/job/ActiveMQ-Java7-All-UnitTests/ws/activemq-spring/target/activemq-spring-5.12-SNAPSHOT.jar> to org.apache.activemq/activemq-spring/5.12-SNAPSHOT/activemq-spring-5.12-SNAPSHOT.jar
[JENKINS] Archiving <https://builds.apache.org/job/ActiveMQ-Java7-All-UnitTests/ws/activemq-spring/target/classes/activemq.xsd> to org.apache.activemq/activemq-spring/5.12-SNAPSHOT/activemq-spring-5.12-SNAPSHOT.xsd
[JENKINS] Archiving <https://builds.apache.org/job/ActiveMQ-Java7-All-UnitTests/ws/activemq-spring/target/classes/activemq.xsd.html> to org.apache.activemq/activemq-spring/5.12-SNAPSHOT/activemq-spring-5.12-SNAPSHOT-schema.html
Sending artifact delta relative to ActiveMQ-Java7-All-UnitTests ? ActiveMQ :: Spring #148
Archived 4 artifacts
Archive block size is 32768
Received 18 blocks and 312299 bytes
Compression is 65.4%
Took 0.56 sec
[JENKINS] Archiving <https://builds.apache.org/job/ActiveMQ-Java7-All-UnitTests/ws/activemq-kahadb-store/pom.xml> to org.apache.activemq/activemq-kahadb-store/5.12-SNAPSHOT/activemq-kahadb-store-5.12-SNAPSHOT.pom
[JENKINS] Archiving <https://builds.apache.org/job/ActiveMQ-Java7-All-UnitTests/ws/activemq-kahadb-store/target/activemq-kahadb-store-5.12-SNAPSHOT.jar> to org.apache.activemq/activemq-kahadb-store/5.12-SNAPSHOT/activemq-kahadb-store-5.12-SNAPSHOT.jar
Sending artifact delta relative to ActiveMQ-Java7-All-UnitTests ? ActiveMQ :: KahaDB Store #148
Archived 2 artifacts
Archive block size is 32768
Received 0 blocks and 642134 bytes
Compression is 0.0%
Took 0.47 sec
[JENKINS] Archiving <https://builds.apache.org/job/ActiveMQ-Java7-All-UnitTests/ws/activemq-jaas/pom.xml> to org.apache.activemq/activemq-jaas/5.12-SNAPSHOT/activemq-jaas-5.12-SNAPSHOT.pom
[JENKINS] Archiving <https://builds.apache.org/job/ActiveMQ-Java7-All-UnitTests/ws/activemq-jaas/target/activemq-jaas-5.12-SNAPSHOT.jar> to org.apache.activemq/activemq-jaas/5.12-SNAPSHOT/activemq-jaas-5.12-SNAPSHOT.jar
Sending artifact delta relative to ActiveMQ-Java7-All-UnitTests ? ActiveMQ :: JAAS #148
Archived 2 artifacts
Archive block size is 32768
Received 0 blocks and 37980 bytes
Compression is 0.0%
Took 50 ms
[JENKINS] Archiving <https://builds.apache.org/job/ActiveMQ-Java7-All-UnitTests/ws/activemq-partition/pom.xml> to org.apache.activemq/activemq-partition/5.12-SNAPSHOT/activemq-partition-5.12-SNAPSHOT.pom
[JENKINS] Archiving <https://builds.apache.org/job/ActiveMQ-Java7-All-UnitTests/ws/activemq-partition/target/activemq-partition-5.12-SNAPSHOT.jar> to org.apache.activemq/activemq-partition/5.12-SNAPSHOT/activemq-partition-5.12-SNAPSHOT.jar
Sending artifact delta relative to ActiveMQ-Java7-All-UnitTests ? ActiveMQ :: Partition Management #148
Archived 2 artifacts
Archive block size is 32768
Received 0 blocks and 28979 bytes
Compression is 0.0%
Took 65 ms
[JENKINS] Archiving <https://builds.apache.org/job/ActiveMQ-Java7-All-UnitTests/ws/activemq-leveldb-store/pom.xml> to org.apache.activemq/activemq-leveldb-store/5.12-SNAPSHOT/activemq-leveldb-store-5.12-SNAPSHOT.pom
[JENKINS] Archiving <https://builds.apache.org/job/ActiveMQ-Java7-All-UnitTests/ws/activemq-leveldb-store/target/activemq-leveldb-store-5.12-SNAPSHOT.jar> to org.apache.activemq/activemq-leveldb-store/5.12-SNAPSHOT/activemq-leveldb-store-5.12-SNAPSHOT.jar
Sending artifact delta relative to ActiveMQ-Java7-All-UnitTests ? ActiveMQ :: LevelDB Store #148
Archived 2 artifacts
Archive block size is 32768
Received 0 blocks and 991376 bytes
Compression is 0.0%
Took 0.53 sec
channel stopped
[locks-and-latches] Releasing all the locks
[locks-and-latches] All the locks released
Build failed in Jenkins: ActiveMQ-Java7-All-UnitTests #148
Posted by Apache Jenkins Server <je...@builds.apache.org>.
See <https://builds.apache.org/job/ActiveMQ-Java7-All-UnitTests/148/changes>
Changes:
[gtully] ci disks seem to be really slow on force, increasing timeout and decreasing load on this test
[gtully] bring some more consistency to derby usage and log nested exceptions on create failure
[gtully] disable periodic expiry b/c that will page in and effect the usage assertions if the test lasts for more than 30s. read ci
[gtully] AMQ5266Test can take 8mins locally - exclude from quick tests
[christopher.l.shannon] https://issues.apache.org/jira/browse/AMQ-5705
[tabish121] https://issues.apache.org/jira/browse/AMQ-5668
------------------------------------------
[...truncated 2133 lines...]
[INFO] ActiveMQ :: JAAS .................................. SUCCESS [31.328s]
[INFO] ActiveMQ :: Broker ................................ SUCCESS [1:21.346s]
[INFO] ActiveMQ :: KahaDB Store .......................... SUCCESS [3:46.784s]
[INFO] ActiveMQ :: STOMP Protocol ........................ SUCCESS [10:33.688s]
[INFO] ActiveMQ :: MQTT Protocol ......................... SUCCESS [12:29.805s]
[INFO] ActiveMQ :: JDBC Store ............................ SUCCESS [1.739s]
[INFO] ActiveMQ :: LevelDB Store ......................... SUCCESS [10:06.426s]
[INFO] ActiveMQ :: Generic JMS Pool ...................... SUCCESS [43.031s]
[INFO] ActiveMQ :: Pool .................................. SUCCESS [2.835s]
[INFO] ActiveMQ :: RA .................................... SUCCESS [2:34.438s]
[INFO] ActiveMQ :: Spring ................................ SUCCESS [1:21.342s]
[INFO] ActiveMQ :: AMQP .................................. SUCCESS [7:37.459s]
[INFO] ActiveMQ :: Console ............................... SUCCESS [3.318s]
[INFO] ActiveMQ :: Partition Management .................. SUCCESS [18.503s]
[INFO] ActiveMQ :: Unit Tests ............................ FAILURE [2:50:43.969s]
[INFO] ------------------------------------------------------------------------
[INFO] BUILD FAILURE
[INFO] ------------------------------------------------------------------------
[INFO] Total time: 3:44:39.097s
[INFO] Finished at: Thu Jun 18 14:02:12 UTC 2015
[INFO] Final Memory: 98M/1049M
[INFO] ------------------------------------------------------------------------
Waiting for Jenkins to finish collecting data
[ERROR] Failed to execute goal org.apache.maven.plugins:maven-surefire-plugin:2.16:test (default-test) on project activemq-unit-tests: ExecutionException; nested exception is java.util.concurrent.ExecutionException: java.lang.RuntimeException: The forked VM terminated without saying properly goodbye. VM crash or System.exit called ?
[ERROR] Command was/bin/sh -c cd <https://builds.apache.org/job/ActiveMQ-Java7-All-UnitTests/ws/activemq-unit-tests> && /home/jenkins/tools/java/jdk1.7.0_25-32/jre/bin/java -Xmx512m -jar <https://builds.apache.org/job/ActiveMQ-Java7-All-UnitTests/ws/activemq-unit-tests/target/surefire/surefirebooter1622705644360481807.jar> <https://builds.apache.org/job/ActiveMQ-Java7-All-UnitTests/ws/activemq-unit-tests/target/surefire/surefire8273836928306698557tmp> <https://builds.apache.org/job/ActiveMQ-Java7-All-UnitTests/ws/activemq-unit-tests/target/surefire/surefire_2954726006584867671759tmp>
[ERROR] -> [Help 1]
org.apache.maven.lifecycle.LifecycleExecutionException: Failed to execute goal org.apache.maven.plugins:maven-surefire-plugin:2.16:test (default-test) on project activemq-unit-tests: ExecutionException; nested exception is java.util.concurrent.ExecutionException: java.lang.RuntimeException: The forked VM terminated without saying properly goodbye. VM crash or System.exit called ?
Command was/bin/sh -c cd <https://builds.apache.org/job/ActiveMQ-Java7-All-UnitTests/ws/activemq-unit-tests> && /home/jenkins/tools/java/jdk1.7.0_25-32/jre/bin/java -Xmx512m -jar <https://builds.apache.org/job/ActiveMQ-Java7-All-UnitTests/ws/activemq-unit-tests/target/surefire/surefirebooter1622705644360481807.jar> <https://builds.apache.org/job/ActiveMQ-Java7-All-UnitTests/ws/activemq-unit-tests/target/surefire/surefire8273836928306698557tmp> <https://builds.apache.org/job/ActiveMQ-Java7-All-UnitTests/ws/activemq-unit-tests/target/surefire/surefire_2954726006584867671759tmp>
at org.apache.maven.lifecycle.internal.MojoExecutor.execute(MojoExecutor.java:213)
at org.apache.maven.lifecycle.internal.MojoExecutor.execute(MojoExecutor.java:153)
at org.apache.maven.lifecycle.internal.MojoExecutor.execute(MojoExecutor.java:145)
at org.apache.maven.lifecycle.internal.LifecycleModuleBuilder.buildProject(LifecycleModuleBuilder.java:84)
at org.apache.maven.lifecycle.internal.LifecycleModuleBuilder.buildProject(LifecycleModuleBuilder.java:59)
at org.apache.maven.lifecycle.internal.LifecycleStarter.singleThreadedBuild(LifecycleStarter.java:183)
at org.apache.maven.lifecycle.internal.LifecycleStarter.execute(LifecycleStarter.java:161)
at org.apache.maven.DefaultMaven.doExecute(DefaultMaven.java:320)
at org.apache.maven.DefaultMaven.execute(DefaultMaven.java:156)
at org.jvnet.hudson.maven3.launcher.Maven3Launcher.main(Maven3Launcher.java:117)
at sun.reflect.NativeMethodAccessorImpl.invoke0(Native Method)
at sun.reflect.NativeMethodAccessorImpl.invoke(NativeMethodAccessorImpl.java:57)
at sun.reflect.DelegatingMethodAccessorImpl.invoke(DelegatingMethodAccessorImpl.java:43)
at java.lang.reflect.Method.invoke(Method.java:606)
at org.codehaus.plexus.classworlds.launcher.Launcher.launchStandard(Launcher.java:329)
at org.codehaus.plexus.classworlds.launcher.Launcher.launch(Launcher.java:239)
at org.jvnet.hudson.maven3.agent.Maven3Main.launch(Maven3Main.java:178)
at sun.reflect.NativeMethodAccessorImpl.invoke0(Native Method)
at sun.reflect.NativeMethodAccessorImpl.invoke(NativeMethodAccessorImpl.java:57)
at sun.reflect.DelegatingMethodAccessorImpl.invoke(DelegatingMethodAccessorImpl.java:43)
at java.lang.reflect.Method.invoke(Method.java:606)
at hudson.maven.Maven3Builder.call(Maven3Builder.java:136)
at hudson.maven.Maven3Builder.call(Maven3Builder.java:71)
at hudson.remoting.UserRequest.perform(UserRequest.java:118)
at hudson.remoting.UserRequest.perform(UserRequest.java:48)
at hudson.remoting.Request$2.run(Request.java:328)
at hudson.remoting.InterceptingExecutorService$1.call(InterceptingExecutorService.java:72)
at java.util.concurrent.FutureTask$Sync.innerRun(FutureTask.java:334)
at java.util.concurrent.FutureTask.run(FutureTask.java:166)
at java.util.concurrent.ThreadPoolExecutor.runWorker(ThreadPoolExecutor.java:1145)
at java.util.concurrent.ThreadPoolExecutor$Worker.run(ThreadPoolExecutor.java:615)
at java.lang.Thread.run(Thread.java:724)
Caused by: org.apache.maven.plugin.MojoFailureException: ExecutionException; nested exception is java.util.concurrent.ExecutionException: java.lang.RuntimeException: The forked VM terminated without saying properly goodbye. VM crash or System.exit called ?
Command was/bin/sh -c cd <https://builds.apache.org/job/ActiveMQ-Java7-All-UnitTests/ws/activemq-unit-tests> && /home/jenkins/tools/java/jdk1.7.0_25-32/jre/bin/java -Xmx512m -jar <https://builds.apache.org/job/ActiveMQ-Java7-All-UnitTests/ws/activemq-unit-tests/target/surefire/surefirebooter1622705644360481807.jar> <https://builds.apache.org/job/ActiveMQ-Java7-All-UnitTests/ws/activemq-unit-tests/target/surefire/surefire8273836928306698557tmp> <https://builds.apache.org/job/ActiveMQ-Java7-All-UnitTests/ws/activemq-unit-tests/target/surefire/surefire_2954726006584867671759tmp>
at org.apache.maven.plugin.surefire.SurefirePlugin.assertNoException(SurefirePlugin.java:198)
at org.apache.maven.plugin.surefire.SurefirePlugin.handleSummary(SurefirePlugin.java:188)
at org.apache.maven.plugin.surefire.AbstractSurefireMojo.executeAfterPreconditionsChecked(AbstractSurefireMojo.java:852)
at org.apache.maven.plugin.surefire.AbstractSurefireMojo.execute(AbstractSurefireMojo.java:720)
at org.apache.maven.plugin.DefaultBuildPluginManager.executeMojo(DefaultBuildPluginManager.java:101)
at org.apache.maven.lifecycle.internal.MojoExecutor.execute(MojoExecutor.java:209)
... 31 more
Caused by: org.apache.maven.surefire.booter.SurefireBooterForkException: ExecutionException; nested exception is java.util.concurrent.ExecutionException: java.lang.RuntimeException: The forked VM terminated without saying properly goodbye. VM crash or System.exit called ?
Command was/bin/sh -c cd <https://builds.apache.org/job/ActiveMQ-Java7-All-UnitTests/ws/activemq-unit-tests> && /home/jenkins/tools/java/jdk1.7.0_25-32/jre/bin/java -Xmx512m -jar <https://builds.apache.org/job/ActiveMQ-Java7-All-UnitTests/ws/activemq-unit-tests/target/surefire/surefirebooter1622705644360481807.jar> <https://builds.apache.org/job/ActiveMQ-Java7-All-UnitTests/ws/activemq-unit-tests/target/surefire/surefire8273836928306698557tmp> <https://builds.apache.org/job/ActiveMQ-Java7-All-UnitTests/ws/activemq-unit-tests/target/surefire/surefire_2954726006584867671759tmp>
at org.apache.maven.plugin.surefire.booterclient.ForkStarter.runSuitesForkPerTestSet(ForkStarter.java:316)
at org.apache.maven.plugin.surefire.booterclient.ForkStarter.run(ForkStarter.java:169)
at org.apache.maven.plugin.surefire.AbstractSurefireMojo.executeProvider(AbstractSurefireMojo.java:958)
at org.apache.maven.plugin.surefire.AbstractSurefireMojo.executeAfterPreconditionsChecked(AbstractSurefireMojo.java:822)
... 34 more
Caused by: java.util.concurrent.ExecutionException: java.lang.RuntimeException: The forked VM terminated without saying properly goodbye. VM crash or System.exit called ?
Command was/bin/sh -c cd <https://builds.apache.org/job/ActiveMQ-Java7-All-UnitTests/ws/activemq-unit-tests> && /home/jenkins/tools/java/jdk1.7.0_25-32/jre/bin/java -Xmx512m -jar <https://builds.apache.org/job/ActiveMQ-Java7-All-UnitTests/ws/activemq-unit-tests/target/surefire/surefirebooter1622705644360481807.jar> <https://builds.apache.org/job/ActiveMQ-Java7-All-UnitTests/ws/activemq-unit-tests/target/surefire/surefire8273836928306698557tmp> <https://builds.apache.org/job/ActiveMQ-Java7-All-UnitTests/ws/activemq-unit-tests/target/surefire/surefire_2954726006584867671759tmp>
at java.util.concurrent.FutureTask$Sync.innerGet(FutureTask.java:252)
at java.util.concurrent.FutureTask.get(FutureTask.java:111)
at org.apache.maven.plugin.surefire.booterclient.ForkStarter.runSuitesForkPerTestSet(ForkStarter.java:300)
... 37 more
Caused by: java.lang.RuntimeException: The forked VM terminated without saying properly goodbye. VM crash or System.exit called ?
Command was/bin/sh -c cd <https://builds.apache.org/job/ActiveMQ-Java7-All-UnitTests/ws/activemq-unit-tests> && /home/jenkins/tools/java/jdk1.7.0_25-32/jre/bin/java -Xmx512m -jar <https://builds.apache.org/job/ActiveMQ-Java7-All-UnitTests/ws/activemq-unit-tests/target/surefire/surefirebooter1622705644360481807.jar> <https://builds.apache.org/job/ActiveMQ-Java7-All-UnitTests/ws/activemq-unit-tests/target/surefire/surefire8273836928306698557tmp> <https://builds.apache.org/job/ActiveMQ-Java7-All-UnitTests/ws/activemq-unit-tests/target/surefire/surefire_2954726006584867671759tmp>
at org.apache.maven.plugin.surefire.booterclient.ForkStarter.fork(ForkStarter.java:485)
at org.apache.maven.plugin.surefire.booterclient.ForkStarter.fork(ForkStarter.java:352)
at org.apache.maven.plugin.surefire.booterclient.ForkStarter.access$300(ForkStarter.java:85)
at org.apache.maven.plugin.surefire.booterclient.ForkStarter$2.call(ForkStarter.java:288)
at org.apache.maven.plugin.surefire.booterclient.ForkStarter$2.call(ForkStarter.java:283)
... 5 more
[ERROR]
[ERROR] Re-run Maven using the -X switch to enable full debug logging.
[ERROR]
[ERROR] For more information about the errors and possible solutions, please read the following articles:
[ERROR] [Help 1] http://cwiki.apache.org/confluence/display/MAVEN/MojoFailureException
[ERROR]
[ERROR] After correcting the problems, you can resume the build with the command
[ERROR] mvn <goals> -rf :activemq-unit-tests
[JENKINS] Archiving <https://builds.apache.org/job/ActiveMQ-Java7-All-UnitTests/ws/activemq-unit-tests/pom.xml> to org.apache.activemq/activemq-unit-tests/5.12-SNAPSHOT/activemq-unit-tests-5.12-SNAPSHOT.pom
Sending artifact delta relative to ActiveMQ-Java7-All-UnitTests » ActiveMQ :: Unit Tests #147
Archived 1 artifacts
Archive block size is 32768
Received 1 blocks and 37765 bytes
Compression is 46.5%
Took 0.77 sec
[JENKINS] Archiving <https://builds.apache.org/job/ActiveMQ-Java7-All-UnitTests/ws/activemq-openwire-legacy/pom.xml> to org.apache.activemq/activemq-openwire-legacy/5.12-SNAPSHOT/activemq-openwire-legacy-5.12-SNAPSHOT.pom
[JENKINS] Archiving <https://builds.apache.org/job/ActiveMQ-Java7-All-UnitTests/ws/activemq-openwire-legacy/target/activemq-openwire-legacy-5.12-SNAPSHOT.jar> to org.apache.activemq/activemq-openwire-legacy/5.12-SNAPSHOT/activemq-openwire-legacy-5.12-SNAPSHOT.jar
Sending artifact delta relative to ActiveMQ-Java7-All-UnitTests » ActiveMQ :: Openwire Legacy Support #147
Archived 2 artifacts
Archive block size is 32768
Received 0 blocks and 687391 bytes
Compression is 0.0%
Took 0.44 sec
[JENKINS] Archiving <https://builds.apache.org/job/ActiveMQ-Java7-All-UnitTests/ws/activemq-jdbc-store/pom.xml> to org.apache.activemq/activemq-jdbc-store/5.12-SNAPSHOT/activemq-jdbc-store-5.12-SNAPSHOT.pom
[JENKINS] Archiving <https://builds.apache.org/job/ActiveMQ-Java7-All-UnitTests/ws/activemq-jdbc-store/target/activemq-jdbc-store-5.12-SNAPSHOT.jar> to org.apache.activemq/activemq-jdbc-store/5.12-SNAPSHOT/activemq-jdbc-store-5.12-SNAPSHOT.jar
Sending artifact delta relative to ActiveMQ-Java7-All-UnitTests » ActiveMQ :: JDBC Store #147
Archived 2 artifacts
Archive block size is 32768
Received 0 blocks and 178387 bytes
Compression is 0.0%
Took 0.13 sec
[JENKINS] Archiving <https://builds.apache.org/job/ActiveMQ-Java7-All-UnitTests/ws/activemq-amqp/pom.xml> to org.apache.activemq/activemq-amqp/5.12-SNAPSHOT/activemq-amqp-5.12-SNAPSHOT.pom
[JENKINS] Archiving <https://builds.apache.org/job/ActiveMQ-Java7-All-UnitTests/ws/activemq-amqp/target/activemq-amqp-5.12-SNAPSHOT.jar> to org.apache.activemq/activemq-amqp/5.12-SNAPSHOT/activemq-amqp-5.12-SNAPSHOT.jar
Sending artifact delta relative to ActiveMQ-Java7-All-UnitTests » ActiveMQ :: AMQP #147
Archived 2 artifacts
Archive block size is 32768
Received 0 blocks and 154559 bytes
Compression is 0.0%
Took 95 ms
[JENKINS] Archiving <https://builds.apache.org/job/ActiveMQ-Java7-All-UnitTests/ws/activemq-jms-pool/pom.xml> to org.apache.activemq/activemq-jms-pool/5.12-SNAPSHOT/activemq-jms-pool-5.12-SNAPSHOT.pom
[JENKINS] Archiving <https://builds.apache.org/job/ActiveMQ-Java7-All-UnitTests/ws/activemq-jms-pool/target/activemq-jms-pool-5.12-SNAPSHOT.jar> to org.apache.activemq/activemq-jms-pool/5.12-SNAPSHOT/activemq-jms-pool-5.12-SNAPSHOT.jar
Sending artifact delta relative to ActiveMQ-Java7-All-UnitTests » ActiveMQ :: Generic JMS Pool #147
Archived 2 artifacts
Archive block size is 32768
Received 0 blocks and 56305 bytes
Compression is 0.0%
Took 43 ms
[JENKINS] Archiving <https://builds.apache.org/job/ActiveMQ-Java7-All-UnitTests/ws/activemq-pool/pom.xml> to org.apache.activemq/activemq-pool/5.12-SNAPSHOT/activemq-pool-5.12-SNAPSHOT.pom
[JENKINS] Archiving <https://builds.apache.org/job/ActiveMQ-Java7-All-UnitTests/ws/activemq-pool/target/activemq-pool-5.12-SNAPSHOT.jar> to org.apache.activemq/activemq-pool/5.12-SNAPSHOT/activemq-pool-5.12-SNAPSHOT.jar
Sending artifact delta relative to ActiveMQ-Java7-All-UnitTests » ActiveMQ :: Pool #147
Archived 2 artifacts
Archive block size is 32768
Received 0 blocks and 23940 bytes
Compression is 0.0%
Took 26 ms
[JENKINS] Archiving <https://builds.apache.org/job/ActiveMQ-Java7-All-UnitTests/ws/activemq-stomp/pom.xml> to org.apache.activemq/activemq-stomp/5.12-SNAPSHOT/activemq-stomp-5.12-SNAPSHOT.pom
[JENKINS] Archiving <https://builds.apache.org/job/ActiveMQ-Java7-All-UnitTests/ws/activemq-stomp/target/activemq-stomp-5.12-SNAPSHOT.jar> to org.apache.activemq/activemq-stomp/5.12-SNAPSHOT/activemq-stomp-5.12-SNAPSHOT.jar
Sending artifact delta relative to ActiveMQ-Java7-All-UnitTests » ActiveMQ :: STOMP Protocol #147
Archived 2 artifacts
Archive block size is 32768
Received 0 blocks and 110448 bytes
Compression is 0.0%
Took 59 ms
[JENKINS] Archiving <https://builds.apache.org/job/ActiveMQ-Java7-All-UnitTests/ws/activemq-mqtt/pom.xml> to org.apache.activemq/activemq-mqtt/5.12-SNAPSHOT/activemq-mqtt-5.12-SNAPSHOT.pom
[JENKINS] Archiving <https://builds.apache.org/job/ActiveMQ-Java7-All-UnitTests/ws/activemq-mqtt/target/activemq-mqtt-5.12-SNAPSHOT.jar> to org.apache.activemq/activemq-mqtt/5.12-SNAPSHOT/activemq-mqtt-5.12-SNAPSHOT.jar
Sending artifact delta relative to ActiveMQ-Java7-All-UnitTests » ActiveMQ :: MQTT Protocol #147
Archived 2 artifacts
Archive block size is 32768
Received 0 blocks and 109593 bytes
Compression is 0.0%
Took 75 ms
[JENKINS] Archiving <https://builds.apache.org/job/ActiveMQ-Java7-All-UnitTests/ws/activemq-console/pom.xml> to org.apache.activemq/activemq-console/5.12-SNAPSHOT/activemq-console-5.12-SNAPSHOT.pom
[JENKINS] Archiving <https://builds.apache.org/job/ActiveMQ-Java7-All-UnitTests/ws/activemq-console/target/activemq-console-5.12-SNAPSHOT.jar> to org.apache.activemq/activemq-console/5.12-SNAPSHOT/activemq-console-5.12-SNAPSHOT.jar
Sending artifact delta relative to ActiveMQ-Java7-All-UnitTests » ActiveMQ :: Console #147
Archived 2 artifacts
Archive block size is 32768
Received 0 blocks and 203598 bytes
Compression is 0.0%
Took 0.12 sec
[JENKINS] Archiving <https://builds.apache.org/job/ActiveMQ-Java7-All-UnitTests/ws/activemq-client/pom.xml> to org.apache.activemq/activemq-client/5.12-SNAPSHOT/activemq-client-5.12-SNAPSHOT.pom
[JENKINS] Archiving <https://builds.apache.org/job/ActiveMQ-Java7-All-UnitTests/ws/activemq-client/target/activemq-client-5.12-SNAPSHOT.jar> to org.apache.activemq/activemq-client/5.12-SNAPSHOT/activemq-client-5.12-SNAPSHOT.jar
Sending artifact delta relative to ActiveMQ-Java7-All-UnitTests » ActiveMQ :: Client #147
Archived 2 artifacts
Archive block size is 32768
Received 0 blocks and 1197979 bytes
Compression is 0.0%
Took 0.47 sec
[JENKINS] Archiving <https://builds.apache.org/job/ActiveMQ-Java7-All-UnitTests/ws/pom.xml> to org.apache.activemq/activemq-parent/5.12-SNAPSHOT/activemq-parent-5.12-SNAPSHOT.pom
Sending artifact delta relative to ActiveMQ-Java7-All-UnitTests » ActiveMQ #147
Archived 1 artifacts
Archive block size is 32768
Received 1 blocks and 26622 bytes
Compression is 55.2%
Took 30 ms
[JENKINS] Archiving <https://builds.apache.org/job/ActiveMQ-Java7-All-UnitTests/ws/activemq-broker/pom.xml> to org.apache.activemq/activemq-broker/5.12-SNAPSHOT/activemq-broker-5.12-SNAPSHOT.pom
[JENKINS] Archiving <https://builds.apache.org/job/ActiveMQ-Java7-All-UnitTests/ws/activemq-broker/target/activemq-broker-5.12-SNAPSHOT.jar> to org.apache.activemq/activemq-broker/5.12-SNAPSHOT/activemq-broker-5.12-SNAPSHOT.jar
[JENKINS] Archiving <https://builds.apache.org/job/ActiveMQ-Java7-All-UnitTests/ws/activemq-broker/target/activemq-broker-5.12-SNAPSHOT-tests.jar> to org.apache.activemq/activemq-broker/5.12-SNAPSHOT/activemq-broker-5.12-SNAPSHOT-tests.jar
Sending artifact delta relative to ActiveMQ-Java7-All-UnitTests » ActiveMQ :: Broker #147
Archived 3 artifacts
Archive block size is 32768
Received 0 blocks and 1169923 bytes
Compression is 0.0%
Took 0.47 sec
[JENKINS] Archiving <https://builds.apache.org/job/ActiveMQ-Java7-All-UnitTests/ws/activemq-ra/pom.xml> to org.apache.activemq/activemq-ra/5.12-SNAPSHOT/activemq-ra-5.12-SNAPSHOT.pom
[JENKINS] Archiving <https://builds.apache.org/job/ActiveMQ-Java7-All-UnitTests/ws/activemq-ra/target/activemq-ra-5.12-SNAPSHOT.jar> to org.apache.activemq/activemq-ra/5.12-SNAPSHOT/activemq-ra-5.12-SNAPSHOT.jar
[JENKINS] Archiving <https://builds.apache.org/job/ActiveMQ-Java7-All-UnitTests/ws/activemq-ra/target/xbean/activemq-ra.xsd> to org.apache.activemq/activemq-ra/5.12-SNAPSHOT/activemq-ra-5.12-SNAPSHOT.xsd
[JENKINS] Archiving <https://builds.apache.org/job/ActiveMQ-Java7-All-UnitTests/ws/activemq-ra/target/xbean/activemq-ra.xsd.html> to org.apache.activemq/activemq-ra/5.12-SNAPSHOT/activemq-ra-5.12-SNAPSHOT-schema.html
[JENKINS] Archiving <https://builds.apache.org/job/ActiveMQ-Java7-All-UnitTests/ws/activemq-ra/target/xbean/activemq-ra.xsd.html> to org.apache.activemq/activemq-ra/5.12-SNAPSHOT/activemq-ra-5.12-SNAPSHOT.xsd.html
Sending artifact delta relative to ActiveMQ-Java7-All-UnitTests » ActiveMQ :: RA #147
Archived 5 artifacts
Archive block size is 32768
Received 0 blocks and 128016 bytes
Compression is 0.0%
Took 0.11 sec
[JENKINS] Archiving <https://builds.apache.org/job/ActiveMQ-Java7-All-UnitTests/ws/activemq-spring/pom.xml> to org.apache.activemq/activemq-spring/5.12-SNAPSHOT/activemq-spring-5.12-SNAPSHOT.pom
[JENKINS] Archiving <https://builds.apache.org/job/ActiveMQ-Java7-All-UnitTests/ws/activemq-spring/target/activemq-spring-5.12-SNAPSHOT.jar> to org.apache.activemq/activemq-spring/5.12-SNAPSHOT/activemq-spring-5.12-SNAPSHOT.jar
[JENKINS] Archiving <https://builds.apache.org/job/ActiveMQ-Java7-All-UnitTests/ws/activemq-spring/target/classes/activemq.xsd> to org.apache.activemq/activemq-spring/5.12-SNAPSHOT/activemq-spring-5.12-SNAPSHOT.xsd
[JENKINS] Archiving <https://builds.apache.org/job/ActiveMQ-Java7-All-UnitTests/ws/activemq-spring/target/classes/activemq.xsd.html> to org.apache.activemq/activemq-spring/5.12-SNAPSHOT/activemq-spring-5.12-SNAPSHOT-schema.html
Sending artifact delta relative to ActiveMQ-Java7-All-UnitTests » ActiveMQ :: Spring #147
Archived 4 artifacts
Archive block size is 32768
Received 21 blocks and 213635 bytes
Compression is 76.3%
Took 0.36 sec
[JENKINS] Archiving <https://builds.apache.org/job/ActiveMQ-Java7-All-UnitTests/ws/activemq-kahadb-store/pom.xml> to org.apache.activemq/activemq-kahadb-store/5.12-SNAPSHOT/activemq-kahadb-store-5.12-SNAPSHOT.pom
[JENKINS] Archiving <https://builds.apache.org/job/ActiveMQ-Java7-All-UnitTests/ws/activemq-kahadb-store/target/activemq-kahadb-store-5.12-SNAPSHOT.jar> to org.apache.activemq/activemq-kahadb-store/5.12-SNAPSHOT/activemq-kahadb-store-5.12-SNAPSHOT.jar
Sending artifact delta relative to ActiveMQ-Java7-All-UnitTests » ActiveMQ :: KahaDB Store #147
Archived 2 artifacts
Archive block size is 32768
Received 0 blocks and 642135 bytes
Compression is 0.0%
Took 0.38 sec
[JENKINS] Archiving <https://builds.apache.org/job/ActiveMQ-Java7-All-UnitTests/ws/activemq-jaas/pom.xml> to org.apache.activemq/activemq-jaas/5.12-SNAPSHOT/activemq-jaas-5.12-SNAPSHOT.pom
[JENKINS] Archiving <https://builds.apache.org/job/ActiveMQ-Java7-All-UnitTests/ws/activemq-jaas/target/activemq-jaas-5.12-SNAPSHOT.jar> to org.apache.activemq/activemq-jaas/5.12-SNAPSHOT/activemq-jaas-5.12-SNAPSHOT.jar
Sending artifact delta relative to ActiveMQ-Java7-All-UnitTests » ActiveMQ :: JAAS #147
Archived 2 artifacts
Archive block size is 32768
Received 0 blocks and 37981 bytes
Compression is 0.0%
Took 78 ms
[JENKINS] Archiving <https://builds.apache.org/job/ActiveMQ-Java7-All-UnitTests/ws/activemq-partition/pom.xml> to org.apache.activemq/activemq-partition/5.12-SNAPSHOT/activemq-partition-5.12-SNAPSHOT.pom
[JENKINS] Archiving <https://builds.apache.org/job/ActiveMQ-Java7-All-UnitTests/ws/activemq-partition/target/activemq-partition-5.12-SNAPSHOT.jar> to org.apache.activemq/activemq-partition/5.12-SNAPSHOT/activemq-partition-5.12-SNAPSHOT.jar
Sending artifact delta relative to ActiveMQ-Java7-All-UnitTests » ActiveMQ :: Partition Management #147
Archived 2 artifacts
Archive block size is 32768
Received 0 blocks and 28979 bytes
Compression is 0.0%
Took 77 ms
[JENKINS] Archiving <https://builds.apache.org/job/ActiveMQ-Java7-All-UnitTests/ws/activemq-leveldb-store/pom.xml> to org.apache.activemq/activemq-leveldb-store/5.12-SNAPSHOT/activemq-leveldb-store-5.12-SNAPSHOT.pom
[JENKINS] Archiving <https://builds.apache.org/job/ActiveMQ-Java7-All-UnitTests/ws/activemq-leveldb-store/target/activemq-leveldb-store-5.12-SNAPSHOT.jar> to org.apache.activemq/activemq-leveldb-store/5.12-SNAPSHOT/activemq-leveldb-store-5.12-SNAPSHOT.jar
Sending artifact delta relative to ActiveMQ-Java7-All-UnitTests » ActiveMQ :: LevelDB Store #147
Archived 2 artifacts
Archive block size is 32768
Received 0 blocks and 991378 bytes
Compression is 0.0%
Took 0.5 sec
channel stopped
[locks-and-latches] Releasing all the locks
[locks-and-latches] All the locks released
Jenkins build is unstable: ActiveMQ-Java7-All-UnitTests #147
Posted by Apache Jenkins Server <je...@builds.apache.org>.
See <https://builds.apache.org/job/ActiveMQ-Java7-All-UnitTests/147/changes>