You are viewing a plain text version of this content. The canonical link for it is here.
Posted to dev@lucene.apache.org by Policeman Jenkins Server <je...@thetaphi.de> on 2017/09/16 17:27:08 UTC
[JENKINS-EA] Lucene-Solr-7.x-Linux (64bit/jdk-9-ea+181) - Build #
425 - Still unstable!
Build: https://jenkins.thetaphi.de/job/Lucene-Solr-7.x-Linux/425/
Java: 64bit/jdk-9-ea+181 -XX:+UseCompressedOops -XX:+UseG1GC --illegal-access=deny
1 tests failed.
FAILED: org.apache.solr.cloud.LeaderElectionContextKeyTest.test
Error Message:
Stack Trace:
java.lang.AssertionError
at __randomizedtesting.SeedInfo.seed([181A9A394EAB9ACE:904EA5E3E057F736]:0)
at org.junit.Assert.fail(Assert.java:92)
at org.junit.Assert.assertTrue(Assert.java:43)
at org.junit.Assert.assertTrue(Assert.java:54)
at org.apache.solr.cloud.LeaderElectionContextKeyTest.test(LeaderElectionContextKeyTest.java:88)
at java.base/jdk.internal.reflect.NativeMethodAccessorImpl.invoke0(Native Method)
at java.base/jdk.internal.reflect.NativeMethodAccessorImpl.invoke(NativeMethodAccessorImpl.java:62)
at java.base/jdk.internal.reflect.DelegatingMethodAccessorImpl.invoke(DelegatingMethodAccessorImpl.java:43)
at java.base/java.lang.reflect.Method.invoke(Method.java:564)
at com.carrotsearch.randomizedtesting.RandomizedRunner.invoke(RandomizedRunner.java:1737)
at com.carrotsearch.randomizedtesting.RandomizedRunner$8.evaluate(RandomizedRunner.java:934)
at com.carrotsearch.randomizedtesting.RandomizedRunner$9.evaluate(RandomizedRunner.java:970)
at com.carrotsearch.randomizedtesting.RandomizedRunner$10.evaluate(RandomizedRunner.java:984)
at com.carrotsearch.randomizedtesting.rules.SystemPropertiesRestoreRule$1.evaluate(SystemPropertiesRestoreRule.java:57)
at org.apache.lucene.util.TestRuleSetupTeardownChained$1.evaluate(TestRuleSetupTeardownChained.java:49)
at org.apache.lucene.util.AbstractBeforeAfterRule$1.evaluate(AbstractBeforeAfterRule.java:45)
at org.apache.lucene.util.TestRuleThreadAndTestName$1.evaluate(TestRuleThreadAndTestName.java:48)
at org.apache.lucene.util.TestRuleIgnoreAfterMaxFailures$1.evaluate(TestRuleIgnoreAfterMaxFailures.java:64)
at org.apache.lucene.util.TestRuleMarkFailure$1.evaluate(TestRuleMarkFailure.java:47)
at com.carrotsearch.randomizedtesting.rules.StatementAdapter.evaluate(StatementAdapter.java:36)
at com.carrotsearch.randomizedtesting.ThreadLeakControl$StatementRunner.run(ThreadLeakControl.java:368)
at com.carrotsearch.randomizedtesting.ThreadLeakControl.forkTimeoutingTask(ThreadLeakControl.java:817)
at com.carrotsearch.randomizedtesting.ThreadLeakControl$3.evaluate(ThreadLeakControl.java:468)
at com.carrotsearch.randomizedtesting.RandomizedRunner.runSingleTest(RandomizedRunner.java:943)
at com.carrotsearch.randomizedtesting.RandomizedRunner$5.evaluate(RandomizedRunner.java:829)
at com.carrotsearch.randomizedtesting.RandomizedRunner$6.evaluate(RandomizedRunner.java:879)
at com.carrotsearch.randomizedtesting.RandomizedRunner$7.evaluate(RandomizedRunner.java:890)
at com.carrotsearch.randomizedtesting.rules.StatementAdapter.evaluate(StatementAdapter.java:36)
at com.carrotsearch.randomizedtesting.rules.SystemPropertiesRestoreRule$1.evaluate(SystemPropertiesRestoreRule.java:57)
at org.apache.lucene.util.AbstractBeforeAfterRule$1.evaluate(AbstractBeforeAfterRule.java:45)
at com.carrotsearch.randomizedtesting.rules.StatementAdapter.evaluate(StatementAdapter.java:36)
at org.apache.lucene.util.TestRuleStoreClassName$1.evaluate(TestRuleStoreClassName.java:41)
at com.carrotsearch.randomizedtesting.rules.NoShadowingOrOverridesOnMethodsRule$1.evaluate(NoShadowingOrOverridesOnMethodsRule.java:40)
at com.carrotsearch.randomizedtesting.rules.NoShadowingOrOverridesOnMethodsRule$1.evaluate(NoShadowingOrOverridesOnMethodsRule.java:40)
at com.carrotsearch.randomizedtesting.rules.StatementAdapter.evaluate(StatementAdapter.java:36)
at com.carrotsearch.randomizedtesting.rules.StatementAdapter.evaluate(StatementAdapter.java:36)
at org.apache.lucene.util.TestRuleAssertionsRequired$1.evaluate(TestRuleAssertionsRequired.java:53)
at org.apache.lucene.util.TestRuleMarkFailure$1.evaluate(TestRuleMarkFailure.java:47)
at org.apache.lucene.util.TestRuleIgnoreAfterMaxFailures$1.evaluate(TestRuleIgnoreAfterMaxFailures.java:64)
at org.apache.lucene.util.TestRuleIgnoreTestSuites$1.evaluate(TestRuleIgnoreTestSuites.java:54)
at com.carrotsearch.randomizedtesting.rules.StatementAdapter.evaluate(StatementAdapter.java:36)
at com.carrotsearch.randomizedtesting.ThreadLeakControl$StatementRunner.run(ThreadLeakControl.java:368)
at java.base/java.lang.Thread.run(Thread.java:844)
Build Log:
[...truncated 11504 lines...]
[junit4] Suite: org.apache.solr.cloud.LeaderElectionContextKeyTest
[junit4] 2> Creating dataDir: /home/jenkins/workspace/Lucene-Solr-7.x-Linux/solr/build/solr-core/test/J0/temp/solr.cloud.LeaderElectionContextKeyTest_181A9A394EAB9ACE-001/init-core-data-001
[junit4] 2> 313296 WARN (SUITE-LeaderElectionContextKeyTest-seed#[181A9A394EAB9ACE]-worker) [ ] o.a.s.SolrTestCaseJ4 startTrackingSearchers: numOpens=1 numCloses=1
[junit4] 2> 313296 INFO (SUITE-LeaderElectionContextKeyTest-seed#[181A9A394EAB9ACE]-worker) [ ] o.a.s.SolrTestCaseJ4 Using PointFields (NUMERIC_POINTS_SYSPROP=true) w/NUMERIC_DOCVALUES_SYSPROP=true
[junit4] 2> 313297 INFO (SUITE-LeaderElectionContextKeyTest-seed#[181A9A394EAB9ACE]-worker) [ ] o.a.s.SolrTestCaseJ4 Randomized ssl (true) and clientAuth (true) via: @org.apache.solr.util.RandomizeSSL(reason="", ssl=0.0/0.0, value=0.0/0.0, clientAuth=0.0/0.0)
[junit4] 2> 313298 INFO (SUITE-LeaderElectionContextKeyTest-seed#[181A9A394EAB9ACE]-worker) [ ] o.a.s.SolrTestCaseJ4 SecureRandom sanity checks: test.solr.allowed.securerandom=null & java.security.egd=file:/dev/./urandom
[junit4] 2> 313298 INFO (SUITE-LeaderElectionContextKeyTest-seed#[181A9A394EAB9ACE]-worker) [ ] o.a.s.c.MiniSolrCloudCluster Starting cluster of 1 servers in /home/jenkins/workspace/Lucene-Solr-7.x-Linux/solr/build/solr-core/test/J0/temp/solr.cloud.LeaderElectionContextKeyTest_181A9A394EAB9ACE-001/tempDir-001
[junit4] 2> 313298 INFO (SUITE-LeaderElectionContextKeyTest-seed#[181A9A394EAB9ACE]-worker) [ ] o.a.s.c.ZkTestServer STARTING ZK TEST SERVER
[junit4] 2> 313298 INFO (Thread-759) [ ] o.a.s.c.ZkTestServer client port:0.0.0.0/0.0.0.0:0
[junit4] 2> 313299 INFO (Thread-759) [ ] o.a.s.c.ZkTestServer Starting server
[junit4] 2> 313301 ERROR (Thread-759) [ ] o.a.z.s.ZooKeeperServer ZKShutdownHandler is not registered, so ZooKeeper server won't take any action on ERROR or SHUTDOWN server state changes
[junit4] 2> 313399 INFO (SUITE-LeaderElectionContextKeyTest-seed#[181A9A394EAB9ACE]-worker) [ ] o.a.s.c.ZkTestServer start zk server on port:36237
[junit4] 2> 313405 INFO (jetty-launcher-468-thread-1) [ ] o.e.j.s.Server jetty-9.3.20.v20170531
[junit4] 2> 313406 INFO (jetty-launcher-468-thread-1) [ ] o.e.j.s.h.ContextHandler Started o.e.j.s.ServletContextHandler@1a5d1290{/solr,null,AVAILABLE}
[junit4] 2> 313408 INFO (jetty-launcher-468-thread-1) [ ] o.e.j.s.AbstractConnector Started ServerConnector@980ab1f{SSL,[ssl, http/1.1]}{127.0.0.1:35867}
[junit4] 2> 313408 INFO (jetty-launcher-468-thread-1) [ ] o.e.j.s.Server Started @315615ms
[junit4] 2> 313408 INFO (jetty-launcher-468-thread-1) [ ] o.a.s.c.s.e.JettySolrRunner Jetty properties: {hostContext=/solr, hostPort=35867}
[junit4] 2> 313408 ERROR (jetty-launcher-468-thread-1) [ ] o.a.s.u.StartupLoggingUtils Missing Java Option solr.log.dir. Logging may be missing or incomplete.
[junit4] 2> 313408 INFO (jetty-launcher-468-thread-1) [ ] o.a.s.s.SolrDispatchFilter ___ _ Welcome to Apache Solr™ version 7.1.0
[junit4] 2> 313408 INFO (jetty-launcher-468-thread-1) [ ] o.a.s.s.SolrDispatchFilter / __| ___| |_ _ Starting in cloud mode on port null
[junit4] 2> 313408 INFO (jetty-launcher-468-thread-1) [ ] o.a.s.s.SolrDispatchFilter \__ \/ _ \ | '_| Install dir: null, Default config dir: null
[junit4] 2> 313408 INFO (jetty-launcher-468-thread-1) [ ] o.a.s.s.SolrDispatchFilter |___/\___/_|_| Start time: 2017-09-16T16:33:58.332917Z
[junit4] 2> 313410 INFO (jetty-launcher-468-thread-1) [ ] o.a.s.s.SolrDispatchFilter solr.xml found in ZooKeeper. Loading...
[junit4] 2> 313415 INFO (jetty-launcher-468-thread-1) [ ] o.a.s.c.ZkContainer Zookeeper client=127.0.0.1:36237/solr
[junit4] 2> 313454 INFO (jetty-launcher-468-thread-1) [ ] o.a.s.c.Overseer Overseer (id=null) closing
[junit4] 2> 313454 INFO (jetty-launcher-468-thread-1) [ ] o.a.s.c.OverseerElectionContext I am going to be the leader 127.0.0.1:35867_solr
[junit4] 2> 313455 INFO (jetty-launcher-468-thread-1) [ ] o.a.s.c.Overseer Overseer (id=98669667170648067-127.0.0.1:35867_solr-n_0000000000) starting
[junit4] 2> 313457 INFO (jetty-launcher-468-thread-1) [ ] o.a.s.c.ZkController Register node as live in ZooKeeper:/live_nodes/127.0.0.1:35867_solr
[junit4] 2> 313468 INFO (zkCallback-475-thread-1) [ ] o.a.s.c.c.ZkStateReader Updated live nodes from ZooKeeper... (0) -> (1)
[junit4] 2> 313492 INFO (jetty-launcher-468-thread-1) [ ] o.a.s.m.r.SolrJmxReporter JMX monitoring for 'solr_35867.solr.node' (registry 'solr.node') enabled at server: com.sun.jmx.mbeanserver.JmxMBeanServer@3e2e5c9c
[junit4] 2> 313499 INFO (jetty-launcher-468-thread-1) [ ] o.a.s.m.r.SolrJmxReporter JMX monitoring for 'solr_35867.solr.jvm' (registry 'solr.jvm') enabled at server: com.sun.jmx.mbeanserver.JmxMBeanServer@3e2e5c9c
[junit4] 2> 313499 INFO (jetty-launcher-468-thread-1) [ ] o.a.s.m.r.SolrJmxReporter JMX monitoring for 'solr_35867.solr.jetty' (registry 'solr.jetty') enabled at server: com.sun.jmx.mbeanserver.JmxMBeanServer@3e2e5c9c
[junit4] 2> 313499 INFO (jetty-launcher-468-thread-1) [ ] o.a.s.c.CorePropertiesLocator Found 0 core definitions underneath /home/jenkins/workspace/Lucene-Solr-7.x-Linux/solr/build/solr-core/test/J0/temp/solr.cloud.LeaderElectionContextKeyTest_181A9A394EAB9ACE-001/tempDir-001/node1/.
[junit4] 2> 313513 INFO (SUITE-LeaderElectionContextKeyTest-seed#[181A9A394EAB9ACE]-worker) [ ] o.a.s.c.c.ZkStateReader Updated live nodes from ZooKeeper... (0) -> (1)
[junit4] 2> 313513 INFO (SUITE-LeaderElectionContextKeyTest-seed#[181A9A394EAB9ACE]-worker) [ ] o.a.s.c.s.i.ZkClientClusterStateProvider Cluster at 127.0.0.1:36237/solr ready
[junit4] 2> 313544 INFO (qtp407303870-2927) [ ] o.a.s.h.a.CollectionsHandler Invoked Collection Action :create with params replicationFactor=1&collection.configName=config&maxShardsPerNode=1000&name=testCollection1&nrtReplicas=1&action=CREATE&numShards=2&wt=javabin&version=2 and sendToOCPQueue=true
[junit4] 2> 313549 INFO (OverseerThreadFactory-1493-thread-1) [ ] o.a.s.c.CreateCollectionCmd Create collection testCollection1
[junit4] 2> 313653 INFO (OverseerStateUpdate-98669667170648067-127.0.0.1:35867_solr-n_0000000000) [ ] o.a.s.c.o.SliceMutator createReplica() {
[junit4] 2> "operation":"ADDREPLICA",
[junit4] 2> "collection":"testCollection1",
[junit4] 2> "shard":"shard1",
[junit4] 2> "core":"testCollection1_shard1_replica_n1",
[junit4] 2> "state":"down",
[junit4] 2> "base_url":"https://127.0.0.1:35867/solr",
[junit4] 2> "type":"NRT"}
[junit4] 2> 313657 INFO (OverseerStateUpdate-98669667170648067-127.0.0.1:35867_solr-n_0000000000) [ ] o.a.s.c.o.SliceMutator createReplica() {
[junit4] 2> "operation":"ADDREPLICA",
[junit4] 2> "collection":"testCollection1",
[junit4] 2> "shard":"shard2",
[junit4] 2> "core":"testCollection1_shard2_replica_n3",
[junit4] 2> "state":"down",
[junit4] 2> "base_url":"https://127.0.0.1:35867/solr",
[junit4] 2> "type":"NRT"}
[junit4] 2> 313865 INFO (qtp407303870-2934) [ ] o.a.s.h.a.CoreAdminOperation core create command qt=/admin/cores&coreNodeName=core_node4&collection.configName=config&newCollection=true&name=testCollection1_shard2_replica_n3&action=CREATE&numShards=2&collection=testCollection1&shard=shard2&wt=javabin&version=2&replicaType=NRT
[junit4] 2> 313865 INFO (qtp407303870-2934) [ ] o.a.s.c.TransientSolrCoreCacheDefault Allocating transient cache for 2147483647 transient cores
[junit4] 2> 313866 INFO (qtp407303870-2929) [ ] o.a.s.h.a.CoreAdminOperation core create command qt=/admin/cores&coreNodeName=core_node2&collection.configName=config&newCollection=true&name=testCollection1_shard1_replica_n1&action=CREATE&numShards=2&collection=testCollection1&shard=shard1&wt=javabin&version=2&replicaType=NRT
[junit4] 2> 313989 INFO (zkCallback-475-thread-1) [ ] o.a.s.c.c.ZkStateReader A cluster state change: [WatchedEvent state:SyncConnected type:NodeDataChanged path:/collections/testCollection1/state.json] for collection [testCollection1] has occurred - updating... (live nodes size: [1])
[junit4] 2> 313989 INFO (zkCallback-475-thread-2) [ ] o.a.s.c.c.ZkStateReader A cluster state change: [WatchedEvent state:SyncConnected type:NodeDataChanged path:/collections/testCollection1/state.json] for collection [testCollection1] has occurred - updating... (live nodes size: [1])
[junit4] 2> 314881 INFO (qtp407303870-2934) [ ] o.a.s.c.SolrConfig Using Lucene MatchVersion: 7.1.0
[junit4] 2> 314884 INFO (qtp407303870-2934) [ ] o.a.s.s.IndexSchema [testCollection1_shard2_replica_n3] Schema name=minimal
[junit4] 2> 314885 INFO (qtp407303870-2934) [ ] o.a.s.s.IndexSchema Loaded schema minimal/1.1 with uniqueid field id
[junit4] 2> 314886 INFO (qtp407303870-2934) [ ] o.a.s.c.CoreContainer Creating SolrCore 'testCollection1_shard2_replica_n3' using configuration from collection testCollection1, trusted=true
[junit4] 2> 314887 INFO (qtp407303870-2934) [ ] o.a.s.m.r.SolrJmxReporter JMX monitoring for 'solr_35867.solr.core.testCollection1.shard2.replica_n3' (registry 'solr.core.testCollection1.shard2.replica_n3') enabled at server: com.sun.jmx.mbeanserver.JmxMBeanServer@3e2e5c9c
[junit4] 2> 314887 INFO (qtp407303870-2934) [ ] o.a.s.c.SolrCore solr.RecoveryStrategy.Builder
[junit4] 2> 314887 INFO (qtp407303870-2934) [ ] o.a.s.c.SolrCore [[testCollection1_shard2_replica_n3] ] Opening new SolrCore at [/home/jenkins/workspace/Lucene-Solr-7.x-Linux/solr/build/solr-core/test/J0/temp/solr.cloud.LeaderElectionContextKeyTest_181A9A394EAB9ACE-001/tempDir-001/node1/testCollection1_shard2_replica_n3], dataDir=[/home/jenkins/workspace/Lucene-Solr-7.x-Linux/solr/build/solr-core/test/J0/temp/solr.cloud.LeaderElectionContextKeyTest_181A9A394EAB9ACE-001/tempDir-001/node1/./testCollection1_shard2_replica_n3/data/]
[junit4] 2> 314894 INFO (qtp407303870-2929) [ ] o.a.s.c.SolrConfig Using Lucene MatchVersion: 7.1.0
[junit4] 2> 314898 INFO (qtp407303870-2929) [ ] o.a.s.s.IndexSchema [testCollection1_shard1_replica_n1] Schema name=minimal
[junit4] 2> 314899 INFO (qtp407303870-2929) [ ] o.a.s.s.IndexSchema Loaded schema minimal/1.1 with uniqueid field id
[junit4] 2> 314899 INFO (qtp407303870-2929) [ ] o.a.s.c.CoreContainer Creating SolrCore 'testCollection1_shard1_replica_n1' using configuration from collection testCollection1, trusted=true
[junit4] 2> 314912 INFO (qtp407303870-2929) [ ] o.a.s.m.r.SolrJmxReporter JMX monitoring for 'solr_35867.solr.core.testCollection1.shard1.replica_n1' (registry 'solr.core.testCollection1.shard1.replica_n1') enabled at server: com.sun.jmx.mbeanserver.JmxMBeanServer@3e2e5c9c
[junit4] 2> 314912 INFO (qtp407303870-2929) [ ] o.a.s.c.SolrCore solr.RecoveryStrategy.Builder
[junit4] 2> 314912 INFO (qtp407303870-2929) [ ] o.a.s.c.SolrCore [[testCollection1_shard1_replica_n1] ] Opening new SolrCore at [/home/jenkins/workspace/Lucene-Solr-7.x-Linux/solr/build/solr-core/test/J0/temp/solr.cloud.LeaderElectionContextKeyTest_181A9A394EAB9ACE-001/tempDir-001/node1/testCollection1_shard1_replica_n1], dataDir=[/home/jenkins/workspace/Lucene-Solr-7.x-Linux/solr/build/solr-core/test/J0/temp/solr.cloud.LeaderElectionContextKeyTest_181A9A394EAB9ACE-001/tempDir-001/node1/./testCollection1_shard1_replica_n1/data/]
[junit4] 2> 314982 INFO (qtp407303870-2934) [ ] o.a.s.u.UpdateHandler Using UpdateLog implementation: org.apache.solr.update.UpdateLog
[junit4] 2> 314982 INFO (qtp407303870-2934) [ ] o.a.s.u.UpdateLog Initializing UpdateLog: dataDir=null defaultSyncLevel=FLUSH numRecordsToKeep=100 maxNumLogsToKeep=10 numVersionBuckets=65536
[junit4] 2> 314984 INFO (qtp407303870-2934) [ ] o.a.s.u.CommitTracker Hard AutoCommit: disabled
[junit4] 2> 314984 INFO (qtp407303870-2934) [ ] o.a.s.u.CommitTracker Soft AutoCommit: disabled
[junit4] 2> 314989 INFO (qtp407303870-2934) [ ] o.a.s.s.SolrIndexSearcher Opening [Searcher@54c0672f[testCollection1_shard2_replica_n3] main]
[junit4] 2> 314993 INFO (qtp407303870-2934) [ ] o.a.s.r.ManagedResourceStorage Configured ZooKeeperStorageIO with znodeBase: /configs/config
[junit4] 2> 314993 INFO (qtp407303870-2934) [ ] o.a.s.r.ManagedResourceStorage Loaded null at path _rest_managed.json using ZooKeeperStorageIO:path=/configs/config
[junit4] 2> 314994 INFO (qtp407303870-2934) [ ] o.a.s.h.ReplicationHandler Commits will be reserved for 10000
[junit4] 2> 314994 INFO (qtp407303870-2934) [ ] o.a.s.u.UpdateLog Could not find max version in index or recent updates, using new clock 1578714676506656768
[junit4] 2> 314996 INFO (searcherExecutor-1496-thread-1) [ ] o.a.s.c.SolrCore [testCollection1_shard2_replica_n3] Registered new searcher Searcher@54c0672f[testCollection1_shard2_replica_n3] main{ExitableDirectoryReader(UninvertingDirectoryReader())}
[junit4] 2> 314997 INFO (qtp407303870-2934) [ ] o.a.s.c.ShardLeaderElectionContext Enough replicas found to continue.
[junit4] 2> 314997 INFO (qtp407303870-2934) [ ] o.a.s.c.ShardLeaderElectionContext I may be the new leader - try and sync
[junit4] 2> 314997 INFO (qtp407303870-2934) [ ] o.a.s.c.SyncStrategy Sync replicas to https://127.0.0.1:35867/solr/testCollection1_shard2_replica_n3/
[junit4] 2> 314997 INFO (qtp407303870-2934) [ ] o.a.s.c.SyncStrategy Sync Success - now sync replicas to me
[junit4] 2> 314997 INFO (qtp407303870-2934) [ ] o.a.s.c.SyncStrategy https://127.0.0.1:35867/solr/testCollection1_shard2_replica_n3/ has no replicas
[junit4] 2> 314997 INFO (qtp407303870-2934) [ ] o.a.s.c.ShardLeaderElectionContext Found all replicas participating in election, clear LIR
[junit4] 2> 314999 INFO (qtp407303870-2934) [ ] o.a.s.c.ShardLeaderElectionContext I am the new leader: https://127.0.0.1:35867/solr/testCollection1_shard2_replica_n3/ shard2
[junit4] 2> 315003 INFO (qtp407303870-2929) [ ] o.a.s.u.UpdateHandler Using UpdateLog implementation: org.apache.solr.update.UpdateLog
[junit4] 2> 315004 INFO (qtp407303870-2929) [ ] o.a.s.u.UpdateLog Initializing UpdateLog: dataDir=null defaultSyncLevel=FLUSH numRecordsToKeep=100 maxNumLogsToKeep=10 numVersionBuckets=65536
[junit4] 2> 315005 INFO (qtp407303870-2929) [ ] o.a.s.u.CommitTracker Hard AutoCommit: disabled
[junit4] 2> 315005 INFO (qtp407303870-2929) [ ] o.a.s.u.CommitTracker Soft AutoCommit: disabled
[junit4] 2> 315006 INFO (qtp407303870-2929) [ ] o.a.s.s.SolrIndexSearcher Opening [Searcher@530b3927[testCollection1_shard1_replica_n1] main]
[junit4] 2> 315007 INFO (qtp407303870-2929) [ ] o.a.s.r.ManagedResourceStorage Configured ZooKeeperStorageIO with znodeBase: /configs/config
[junit4] 2> 315007 INFO (qtp407303870-2929) [ ] o.a.s.r.ManagedResourceStorage Loaded null at path _rest_managed.json using ZooKeeperStorageIO:path=/configs/config
[junit4] 2> 315008 INFO (qtp407303870-2929) [ ] o.a.s.h.ReplicationHandler Commits will be reserved for 10000
[junit4] 2> 315008 INFO (searcherExecutor-1497-thread-1) [ ] o.a.s.c.SolrCore [testCollection1_shard1_replica_n1] Registered new searcher Searcher@530b3927[testCollection1_shard1_replica_n1] main{ExitableDirectoryReader(UninvertingDirectoryReader())}
[junit4] 2> 315008 INFO (qtp407303870-2929) [ ] o.a.s.u.UpdateLog Could not find max version in index or recent updates, using new clock 1578714676521336832
[junit4] 2> 315012 INFO (qtp407303870-2929) [ ] o.a.s.c.ShardLeaderElectionContext Enough replicas found to continue.
[junit4] 2> 315012 INFO (qtp407303870-2929) [ ] o.a.s.c.ShardLeaderElectionContext I may be the new leader - try and sync
[junit4] 2> 315012 INFO (qtp407303870-2929) [ ] o.a.s.c.SyncStrategy Sync replicas to https://127.0.0.1:35867/solr/testCollection1_shard1_replica_n1/
[junit4] 2> 315012 INFO (qtp407303870-2929) [ ] o.a.s.c.SyncStrategy Sync Success - now sync replicas to me
[junit4] 2> 315012 INFO (qtp407303870-2929) [ ] o.a.s.c.SyncStrategy https://127.0.0.1:35867/solr/testCollection1_shard1_replica_n1/ has no replicas
[junit4] 2> 315012 INFO (qtp407303870-2929) [ ] o.a.s.c.ShardLeaderElectionContext Found all replicas participating in election, clear LIR
[junit4] 2> 315014 INFO (qtp407303870-2929) [ ] o.a.s.c.ShardLeaderElectionContext I am the new leader: https://127.0.0.1:35867/solr/testCollection1_shard1_replica_n1/ shard1
[junit4] 2> 315115 INFO (zkCallback-475-thread-2) [ ] o.a.s.c.c.ZkStateReader A cluster state change: [WatchedEvent state:SyncConnected type:NodeDataChanged path:/collections/testCollection1/state.json] for collection [testCollection1] has occurred - updating... (live nodes size: [1])
[junit4] 2> 315115 INFO (zkCallback-475-thread-1) [ ] o.a.s.c.c.ZkStateReader A cluster state change: [WatchedEvent state:SyncConnected type:NodeDataChanged path:/collections/testCollection1/state.json] for collection [testCollection1] has occurred - updating... (live nodes size: [1])
[junit4] 2> 315149 INFO (qtp407303870-2934) [ ] o.a.s.c.ZkController I am the leader, no recovery necessary
[junit4] 2> 315150 INFO (qtp407303870-2934) [ ] o.a.s.s.HttpSolrCall [admin] webapp=null path=/admin/cores params={qt=/admin/cores&coreNodeName=core_node4&collection.configName=config&newCollection=true&name=testCollection1_shard2_replica_n3&action=CREATE&numShards=2&collection=testCollection1&shard=shard2&wt=javabin&version=2&replicaType=NRT} status=0 QTime=1285
[junit4] 2> 315164 INFO (qtp407303870-2929) [ ] o.a.s.c.ZkController I am the leader, no recovery necessary
[junit4] 2> 315165 INFO (qtp407303870-2929) [ ] o.a.s.s.HttpSolrCall [admin] webapp=null path=/admin/cores params={qt=/admin/cores&coreNodeName=core_node2&collection.configName=config&newCollection=true&name=testCollection1_shard1_replica_n1&action=CREATE&numShards=2&collection=testCollection1&shard=shard1&wt=javabin&version=2&replicaType=NRT} status=0 QTime=1298
[junit4] 2> 315167 INFO (qtp407303870-2927) [ ] o.a.s.h.a.CollectionsHandler Wait for new collection to be active for at most 30 seconds. Check all shard replicas
[junit4] 2> 315267 INFO (zkCallback-475-thread-1) [ ] o.a.s.c.c.ZkStateReader A cluster state change: [WatchedEvent state:SyncConnected type:NodeDataChanged path:/collections/testCollection1/state.json] for collection [testCollection1] has occurred - updating... (live nodes size: [1])
[junit4] 2> 315267 INFO (zkCallback-475-thread-2) [ ] o.a.s.c.c.ZkStateReader A cluster state change: [WatchedEvent state:SyncConnected type:NodeDataChanged path:/collections/testCollection1/state.json] for collection [testCollection1] has occurred - updating... (live nodes size: [1])
[junit4] 2> 315551 INFO (OverseerCollectionConfigSetProcessor-98669667170648067-127.0.0.1:35867_solr-n_0000000000) [ ] o.a.s.c.OverseerTaskQueue Response ZK path: /overseer/collection-queue-work/qnr-0000000000 doesn't exist. Requestor may have disconnected from ZooKeeper
[junit4] 2> 316167 INFO (qtp407303870-2927) [ ] o.a.s.s.HttpSolrCall [admin] webapp=null path=/admin/collections params={replicationFactor=1&collection.configName=config&maxShardsPerNode=1000&name=testCollection1&nrtReplicas=1&action=CREATE&numShards=2&wt=javabin&version=2} status=0 QTime=2623
[junit4] 2> 316168 INFO (qtp407303870-2932) [ ] o.a.s.h.a.CollectionsHandler Invoked Collection Action :create with params replicationFactor=1&collection.configName=config&maxShardsPerNode=1000&name=testCollection2&nrtReplicas=1&action=CREATE&numShards=2&wt=javabin&version=2 and sendToOCPQueue=true
[junit4] 2> 316194 INFO (OverseerThreadFactory-1493-thread-2) [ ] o.a.s.c.CreateCollectionCmd Create collection testCollection2
[junit4] 2> 316399 INFO (OverseerStateUpdate-98669667170648067-127.0.0.1:35867_solr-n_0000000000) [ ] o.a.s.c.o.SliceMutator createReplica() {
[junit4] 2> "operation":"ADDREPLICA",
[junit4] 2> "collection":"testCollection2",
[junit4] 2> "shard":"shard1",
[junit4] 2> "core":"testCollection2_shard1_replica_n1",
[junit4] 2> "state":"down",
[junit4] 2> "base_url":"https://127.0.0.1:35867/solr",
[junit4] 2> "type":"NRT"}
[junit4] 2> 316400 INFO (OverseerStateUpdate-98669667170648067-127.0.0.1:35867_solr-n_0000000000) [ ] o.a.s.c.o.SliceMutator createReplica() {
[junit4] 2> "operation":"ADDREPLICA",
[junit4] 2> "collection":"testCollection2",
[junit4] 2> "shard":"shard2",
[junit4] 2> "core":"testCollection2_shard2_replica_n2",
[junit4] 2> "state":"down",
[junit4] 2> "base_url":"https://127.0.0.1:35867/solr",
[junit4] 2> "type":"NRT"}
[junit4] 2> 316601 INFO (qtp407303870-2928) [ ] o.a.s.h.a.CoreAdminOperation core create command qt=/admin/cores&coreNodeName=core_node3&collection.configName=config&newCollection=true&name=testCollection2_shard1_replica_n1&action=CREATE&numShards=2&collection=testCollection2&shard=shard1&wt=javabin&version=2&replicaType=NRT
[junit4] 2> 316601 INFO (qtp407303870-2963) [ ] o.a.s.h.a.CoreAdminOperation core create command qt=/admin/cores&coreNodeName=core_node4&collection.configName=config&newCollection=true&name=testCollection2_shard2_replica_n2&action=CREATE&numShards=2&collection=testCollection2&shard=shard2&wt=javabin&version=2&replicaType=NRT
[junit4] 2> 316705 INFO (zkCallback-475-thread-2) [ ] o.a.s.c.c.ZkStateReader A cluster state change: [WatchedEvent state:SyncConnected type:NodeDataChanged path:/collections/testCollection2/state.json] for collection [testCollection2] has occurred - updating... (live nodes size: [1])
[junit4] 2> 316705 INFO (zkCallback-475-thread-1) [ ] o.a.s.c.c.ZkStateReader A cluster state change: [WatchedEvent state:SyncConnected type:NodeDataChanged path:/collections/testCollection2/state.json] for collection [testCollection2] has occurred - updating... (live nodes size: [1])
[junit4] 2> 317609 INFO (qtp407303870-2928) [ ] o.a.s.c.SolrConfig Using Lucene MatchVersion: 7.1.0
[junit4] 2> 317609 INFO (qtp407303870-2963) [ ] o.a.s.c.SolrConfig Using Lucene MatchVersion: 7.1.0
[junit4] 2> 317613 INFO (qtp407303870-2963) [ ] o.a.s.s.IndexSchema [testCollection2_shard2_replica_n2] Schema name=minimal
[junit4] 2> 317614 INFO (qtp407303870-2928) [ ] o.a.s.s.IndexSchema [testCollection2_shard1_replica_n1] Schema name=minimal
[junit4] 2> 317614 INFO (qtp407303870-2963) [ ] o.a.s.s.IndexSchema Loaded schema minimal/1.1 with uniqueid field id
[junit4] 2> 317614 INFO (qtp407303870-2963) [ ] o.a.s.c.CoreContainer Creating SolrCore 'testCollection2_shard2_replica_n2' using configuration from collection testCollection2, trusted=true
[junit4] 2> 317615 INFO (qtp407303870-2963) [ ] o.a.s.m.r.SolrJmxReporter JMX monitoring for 'solr_35867.solr.core.testCollection2.shard2.replica_n2' (registry 'solr.core.testCollection2.shard2.replica_n2') enabled at server: com.sun.jmx.mbeanserver.JmxMBeanServer@3e2e5c9c
[junit4] 2> 317615 INFO (qtp407303870-2963) [ ] o.a.s.c.SolrCore solr.RecoveryStrategy.Builder
[junit4] 2> 317615 INFO (qtp407303870-2963) [ ] o.a.s.c.SolrCore [[testCollection2_shard2_replica_n2] ] Opening new SolrCore at [/home/jenkins/workspace/Lucene-Solr-7.x-Linux/solr/build/solr-core/test/J0/temp/solr.cloud.LeaderElectionContextKeyTest_181A9A394EAB9ACE-001/tempDir-001/node1/testCollection2_shard2_replica_n2], dataDir=[/home/jenkins/workspace/Lucene-Solr-7.x-Linux/solr/build/solr-core/test/J0/temp/solr.cloud.LeaderElectionContextKeyTest_181A9A394EAB9ACE-001/tempDir-001/node1/./testCollection2_shard2_replica_n2/data/]
[junit4] 2> 317616 INFO (qtp407303870-2928) [ ] o.a.s.s.IndexSchema Loaded schema minimal/1.1 with uniqueid field id
[junit4] 2> 317616 INFO (qtp407303870-2928) [ ] o.a.s.c.CoreContainer Creating SolrCore 'testCollection2_shard1_replica_n1' using configuration from collection testCollection2, trusted=true
[junit4] 2> 317616 INFO (qtp407303870-2928) [ ] o.a.s.m.r.SolrJmxReporter JMX monitoring for 'solr_35867.solr.core.testCollection2.shard1.replica_n1' (registry 'solr.core.testCollection2.shard1.replica_n1') enabled at server: com.sun.jmx.mbeanserver.JmxMBeanServer@3e2e5c9c
[junit4] 2> 317616 INFO (qtp407303870-2928) [ ] o.a.s.c.SolrCore solr.RecoveryStrategy.Builder
[junit4] 2> 317616 INFO (qtp407303870-2928) [ ] o.a.s.c.SolrCore [[testCollection2_shard1_replica_n1] ] Opening new SolrCore at [/home/jenkins/workspace/Lucene-Solr-7.x-Linux/solr/build/solr-core/test/J0/temp/solr.cloud.LeaderElectionContextKeyTest_181A9A394EAB9ACE-001/tempDir-001/node1/testCollection2_shard1_replica_n1], dataDir=[/home/jenkins/workspace/Lucene-Solr-7.x-Linux/solr/build/solr-core/test/J0/temp/solr.cloud.LeaderElectionContextKeyTest_181A9A394EAB9ACE-001/tempDir-001/node1/./testCollection2_shard1_replica_n1/data/]
[junit4] 2> 317653 INFO (qtp407303870-2963) [ ] o.a.s.u.UpdateHandler Using UpdateLog implementation: org.apache.solr.update.UpdateLog
[junit4] 2> 317653 INFO (qtp407303870-2963) [ ] o.a.s.u.UpdateLog Initializing UpdateLog: dataDir=null defaultSyncLevel=FLUSH numRecordsToKeep=100 maxNumLogsToKeep=10 numVersionBuckets=65536
[junit4] 2> 317654 INFO (qtp407303870-2963) [ ] o.a.s.u.CommitTracker Hard AutoCommit: disabled
[junit4] 2> 317654 INFO (qtp407303870-2963) [ ] o.a.s.u.CommitTracker Soft AutoCommit: disabled
[junit4] 2> 317655 INFO (qtp407303870-2963) [ ] o.a.s.s.SolrIndexSearcher Opening [Searcher@69d108f8[testCollection2_shard2_replica_n2] main]
[junit4] 2> 317658 INFO (qtp407303870-2963) [ ] o.a.s.r.ManagedResourceStorage Configured ZooKeeperStorageIO with znodeBase: /configs/config
[junit4] 2> 317659 INFO (qtp407303870-2963) [ ] o.a.s.r.ManagedResourceStorage Loaded null at path _rest_managed.json using ZooKeeperStorageIO:path=/configs/config
[junit4] 2> 317659 INFO (qtp407303870-2963) [ ] o.a.s.h.ReplicationHandler Commits will be reserved for 10000
[junit4] 2> 317659 INFO (qtp407303870-2963) [ ] o.a.s.u.UpdateLog Could not find max version in index or recent updates, using new clock 1578714679301111808
[junit4] 2> 317661 INFO (searcherExecutor-1506-thread-1) [ ] o.a.s.c.SolrCore [testCollection2_shard2_replica_n2] Registered new searcher Searcher@69d108f8[testCollection2_shard2_replica_n2] main{ExitableDirectoryReader(UninvertingDirectoryReader())}
[junit4] 2> 317662 INFO (qtp407303870-2963) [ ] o.a.s.c.ShardLeaderElectionContext Enough replicas found to continue.
[junit4] 2> 317662 INFO (qtp407303870-2963) [ ] o.a.s.c.ShardLeaderElectionContext I may be the new leader - try and sync
[junit4] 2> 317662 INFO (qtp407303870-2963) [ ] o.a.s.c.SyncStrategy Sync replicas to https://127.0.0.1:35867/solr/testCollection2_shard2_replica_n2/
[junit4] 2> 317662 INFO (qtp407303870-2963) [ ] o.a.s.c.SyncStrategy Sync Success - now sync replicas to me
[junit4] 2> 317662 INFO (qtp407303870-2963) [ ] o.a.s.c.SyncStrategy https://127.0.0.1:35867/solr/testCollection2_shard2_replica_n2/ has no replicas
[junit4] 2> 317662 INFO (qtp407303870-2963) [ ] o.a.s.c.ShardLeaderElectionContext Found all replicas participating in election, clear LIR
[junit4] 2> 317663 INFO (qtp407303870-2963) [ ] o.a.s.c.ShardLeaderElectionContext I am the new leader: https://127.0.0.1:35867/solr/testCollection2_shard2_replica_n2/ shard2
[junit4] 2> 317664 INFO (qtp407303870-2928) [ ] o.a.s.u.UpdateHandler Using UpdateLog implementation: org.apache.solr.update.UpdateLog
[junit4] 2> 317664 INFO (qtp407303870-2928) [ ] o.a.s.u.UpdateLog Initializing UpdateLog: dataDir=null defaultSyncLevel=FLUSH numRecordsToKeep=100 maxNumLogsToKeep=10 numVersionBuckets=65536
[junit4] 2> 317665 INFO (qtp407303870-2928) [ ] o.a.s.u.CommitTracker Hard AutoCommit: disabled
[junit4] 2> 317666 INFO (qtp407303870-2928) [ ] o.a.s.u.CommitTracker Soft AutoCommit: disabled
[junit4] 2> 317667 INFO (qtp407303870-2928) [ ] o.a.s.s.SolrIndexSearcher Opening [Searcher@51fd4e59[testCollection2_shard1_replica_n1] main]
[junit4] 2> 317668 INFO (qtp407303870-2928) [ ] o.a.s.r.ManagedResourceStorage Configured ZooKeeperStorageIO with znodeBase: /configs/config
[junit4] 2> 317668 INFO (qtp407303870-2928) [ ] o.a.s.r.ManagedResourceStorage Loaded null at path _rest_managed.json using ZooKeeperStorageIO:path=/configs/config
[junit4] 2> 317669 INFO (qtp407303870-2928) [ ] o.a.s.h.ReplicationHandler Commits will be reserved for 10000
[junit4] 2> 317669 INFO (qtp407303870-2928) [ ] o.a.s.u.UpdateLog Could not find max version in index or recent updates, using new clock 1578714679311597568
[junit4] 2> 317671 INFO (searcherExecutor-1507-thread-1) [ ] o.a.s.c.SolrCore [testCollection2_shard1_replica_n1] Registered new searcher Searcher@51fd4e59[testCollection2_shard1_replica_n1] main{ExitableDirectoryReader(UninvertingDirectoryReader())}
[junit4] 2> 317672 INFO (qtp407303870-2928) [ ] o.a.s.c.ShardLeaderElectionContext Enough replicas found to continue.
[junit4] 2> 317672 INFO (qtp407303870-2928) [ ] o.a.s.c.ShardLeaderElectionContext I may be the new leader - try and sync
[junit4] 2> 317672 INFO (qtp407303870-2928) [ ] o.a.s.c.SyncStrategy Sync replicas to https://127.0.0.1:35867/solr/testCollection2_shard1_replica_n1/
[junit4] 2> 317672 INFO (qtp407303870-2928) [ ] o.a.s.c.SyncStrategy Sync Success - now sync replicas to me
[junit4] 2> 317672 INFO (qtp407303870-2928) [ ] o.a.s.c.SyncStrategy https://127.0.0.1:35867/solr/testCollection2_shard1_replica_n1/ has no replicas
[junit4] 2> 317672 INFO (qtp407303870-2928) [ ] o.a.s.c.ShardLeaderElectionContext Found all replicas participating in election, clear LIR
[junit4] 2> 317680 INFO (qtp407303870-2928) [ ] o.a.s.c.ShardLeaderElectionContext I am the new leader: https://127.0.0.1:35867/solr/testCollection2_shard1_replica_n1/ shard1
[junit4] 2> 317782 INFO (zkCallback-475-thread-1) [ ] o.a.s.c.c.ZkStateReader A cluster state change: [WatchedEvent state:SyncConnected type:NodeDataChanged path:/collections/testCollection2/state.json] for collection [testCollection2] has occurred - updating... (live nodes size: [1])
[junit4] 2> 317782 INFO (zkCallback-475-thread-2) [ ] o.a.s.c.c.ZkStateReader A cluster state change: [WatchedEvent state:SyncConnected type:NodeDataChanged path:/collections/testCollection2/state.json] for collection [testCollection2] has occurred - updating... (live nodes size: [1])
[junit4] 2> 317786 INFO (qtp407303870-2928) [ ] o.a.s.c.ZkController I am the leader, no recovery necessary
[junit4] 2> 317787 INFO (qtp407303870-2928) [ ] o.a.s.s.HttpSolrCall [admin] webapp=null path=/admin/cores params={qt=/admin/cores&coreNodeName=core_node3&collection.configName=config&newCollection=true&name=testCollection2_shard1_replica_n1&action=CREATE&numShards=2&collection=testCollection2&shard=shard1&wt=javabin&version=2&replicaType=NRT} status=0 QTime=1186
[junit4] 2> 317814 INFO (qtp407303870-2963) [ ] o.a.s.c.ZkController I am the leader, no recovery necessary
[junit4] 2> 317815 INFO (qtp407303870-2963) [ ] o.a.s.s.HttpSolrCall [admin] webapp=null path=/admin/cores params={qt=/admin/cores&coreNodeName=core_node4&collection.configName=config&newCollection=true&name=testCollection2_shard2_replica_n2&action=CREATE&numShards=2&collection=testCollection2&shard=shard2&wt=javabin&version=2&replicaType=NRT} status=0 QTime=1213
[junit4] 2> 317816 INFO (qtp407303870-2932) [ ] o.a.s.h.a.CollectionsHandler Wait for new collection to be active for at most 30 seconds. Check all shard replicas
[junit4] 2> 317916 INFO (zkCallback-475-thread-2) [ ] o.a.s.c.c.ZkStateReader A cluster state change: [WatchedEvent state:SyncConnected type:NodeDataChanged path:/collections/testCollection2/state.json] for collection [testCollection2] has occurred - updating... (live nodes size: [1])
[junit4] 2> 317916 INFO (zkCallback-475-thread-1) [ ] o.a.s.c.c.ZkStateReader A cluster state change: [WatchedEvent state:SyncConnected type:NodeDataChanged path:/collections/testCollection2/state.json] for collection [testCollection2] has occurred - updating... (live nodes size: [1])
[junit4] 2> 318195 INFO (OverseerCollectionConfigSetProcessor-98669667170648067-127.0.0.1:35867_solr-n_0000000000) [ ] o.a.s.c.OverseerTaskQueue Response ZK path: /overseer/collection-queue-work/qnr-0000000002 doesn't exist. Requestor may have disconnected from ZooKeeper
[junit4] 2> 318816 INFO (qtp407303870-2932) [ ] o.a.s.s.HttpSolrCall [admin] webapp=null path=/admin/collections params={replicationFactor=1&collection.configName=config&maxShardsPerNode=1000&name=testCollection2&nrtReplicas=1&action=CREATE&numShards=2&wt=javabin&version=2} status=0 QTime=2648
[junit4] 2> 318817 INFO (SUITE-LeaderElectionContextKeyTest-seed#[181A9A394EAB9ACE]-worker) [ ] o.a.s.c.AbstractDistribZkTestBase Wait for recoveries to finish - collection: testCollection1 failOnTimeout:true timeout (sec):30
[junit4] 2> 318817 INFO (SUITE-LeaderElectionContextKeyTest-seed#[181A9A394EAB9ACE]-worker) [ ] o.a.s.c.AbstractDistribZkTestBase Recoveries finished - collection: testCollection1
[junit4] 2> 318817 INFO (SUITE-LeaderElectionContextKeyTest-seed#[181A9A394EAB9ACE]-worker) [ ] o.a.s.c.AbstractDistribZkTestBase Wait for recoveries to finish - collection: testCollection2 failOnTimeout:true timeout (sec):30
[junit4] 2> 318817 INFO (SUITE-LeaderElectionContextKeyTest-seed#[181A9A394EAB9ACE]-worker) [ ] o.a.s.c.AbstractDistribZkTestBase Recoveries finished - collection: testCollection2
[junit4] 2> 318822 INFO (TEST-LeaderElectionContextKeyTest.test-seed#[181A9A394EAB9ACE]) [ ] o.a.s.SolrTestCaseJ4 ###Starting test
[junit4] 2> 318828 INFO (qtp407303870-2928) [ ] o.a.s.m.SolrMetricManager Closing metric reporters for registry=solr.core.testCollection1.shard2.replica_n3, tag=null
[junit4] 2> 318829 INFO (qtp407303870-2928) [ ] o.a.s.m.r.SolrJmxReporter Closing reporter [org.apache.solr.metrics.reporters.SolrJmxReporter@4b775482: rootName = solr_35867, domain = solr.core.testCollection1.shard2.replica_n3, service url = null, agent id = null] for registry solr.core.testCollection1.shard2.replica_n3 / com.codahale.metrics.MetricRegistry@65459408
[junit4] 2> 318837 INFO (qtp407303870-2928) [ ] o.a.s.c.SolrCore [testCollection1_shard2_replica_n3] CLOSING SolrCore org.apache.solr.core.SolrCore@1dd385a3
[junit4] 2> 318837 INFO (qtp407303870-2928) [ ] o.a.s.m.SolrMetricManager Closing metric reporters for registry=solr.core.testCollection1.shard2.replica_n3, tag=500401571
[junit4] 2> 318837 INFO (qtp407303870-2928) [ ] o.a.s.m.SolrMetricManager Closing metric reporters for registry=solr.collection.testCollection1.shard2.leader, tag=500401571
[junit4] 2> 318839 INFO (qtp407303870-2928) [ ] o.a.s.s.HttpSolrCall [admin] webapp=null path=/admin/cores params={deleteInstanceDir=false&core=testCollection1_shard2_replica_n3&deleteDataDir=false&action=UNLOAD&indexInfo=true&wt=javabin&version=2&deleteIndex=false} status=0 QTime=10
[junit4] 2> 318840 INFO (TEST-LeaderElectionContextKeyTest.test-seed#[181A9A394EAB9ACE]) [ ] o.a.s.SolrTestCaseJ4 ###Ending test
[junit4] 2> NOTE: reproduce with: ant test -Dtestcase=LeaderElectionContextKeyTest -Dtests.method=test -Dtests.seed=181A9A394EAB9ACE -Dtests.multiplier=3 -Dtests.slow=true -Dtests.locale=zh-HK -Dtests.timezone=America/Whitehorse -Dtests.asserts=true -Dtests.file.encoding=UTF-8
[junit4] FAILURE 0.02s J0 | LeaderElectionContextKeyTest.test <<<
[junit4] > Throwable #1: java.lang.AssertionError
[junit4] > at __randomizedtesting.SeedInfo.seed([181A9A394EAB9ACE:904EA5E3E057F736]:0)
[junit4] > at org.apache.solr.cloud.LeaderElectionContextKeyTest.test(LeaderElectionContextKeyTest.java:88)
[junit4] > at java.base/jdk.internal.reflect.NativeMethodAccessorImpl.invoke0(Native Method)
[junit4] > at java.base/jdk.internal.reflect.NativeMethodAccessorImpl.invoke(NativeMethodAccessorImpl.java:62)
[junit4] > at java.base/jdk.internal.reflect.DelegatingMethodAccessorImpl.invoke(DelegatingMethodAccessorImpl.java:43)
[junit4] > at java.base/java.lang.reflect.Method.invoke(Method.java:564)
[junit4] > at java.base/java.lang.Thread.run(Thread.java:844)
[junit4] 2> 318843 INFO (jetty-closer-469-thread-1) [ ] o.e.j.s.AbstractConnector Stopped ServerConnector@980ab1f{SSL,[ssl, http/1.1]}{127.0.0.1:0}
[junit4] 2> 318843 INFO (jetty-closer-469-thread-1) [ ] o.a.s.c.CoreContainer Shutting down CoreContainer instance=1946327764
[junit4] 2> 318843 INFO (jetty-closer-469-thread-1) [ ] o.a.s.m.SolrMetricManager Closing metric reporters for registry=solr.node, tag=null
[junit4] 2> 318843 INFO (jetty-closer-469-thread-1) [ ] o.a.s.m.r.SolrJmxReporter Closing reporter [org.apache.solr.metrics.reporters.SolrJmxReporter@509348bc: rootName = solr_35867, domain = solr.node, service url = null, agent id = null] for registry solr.node / com.codahale.metrics.MetricRegistry@4cb07697
[junit4] 2> 318849 INFO (jetty-closer-469-thread-1) [ ] o.a.s.m.SolrMetricManager Closing metric reporters for registry=solr.jvm, tag=null
[junit4] 2> 318849 INFO (jetty-closer-469-thread-1) [ ] o.a.s.m.r.SolrJmxReporter Closing reporter [org.apache.solr.metrics.reporters.SolrJmxReporter@3ef5a3b7: rootName = solr_35867, domain = solr.jvm, service url = null, agent id = null] for registry solr.jvm / com.codahale.metrics.MetricRegistry@6582225
[junit4] 2> 318854 INFO (jetty-closer-469-thread-1) [ ] o.a.s.m.SolrMetricManager Closing metric reporters for registry=solr.jetty, tag=null
[junit4] 2> 318854 INFO (jetty-closer-469-thread-1) [ ] o.a.s.m.r.SolrJmxReporter Closing reporter [org.apache.solr.metrics.reporters.SolrJmxReporter@2c3caafe: rootName = solr_35867, domain = solr.jetty, service url = null, agent id = null] for registry solr.jetty / com.codahale.metrics.MetricRegistry@48f1c06b
[junit4] 2> 318854 INFO (jetty-closer-469-thread-1) [ ] o.a.s.m.SolrMetricManager Closing metric reporters for registry=solr.cluster, tag=null
[junit4] 2> 318855 INFO (coreCloseExecutor-1516-thread-1) [ ] o.a.s.c.SolrCore [testCollection1_shard1_replica_n1] CLOSING SolrCore org.apache.solr.core.SolrCore@61152bc1
[junit4] 2> 318855 INFO (coreCloseExecutor-1516-thread-1) [ ] o.a.s.m.SolrMetricManager Closing metric reporters for registry=solr.core.testCollection1.shard1.replica_n1, tag=1628777409
[junit4] 2> 318855 INFO (coreCloseExecutor-1516-thread-2) [ ] o.a.s.c.SolrCore [testCollection2_shard2_replica_n2] CLOSING SolrCore org.apache.solr.core.SolrCore@51c9b8f5
[junit4] 2> 318855 INFO (coreCloseExecutor-1516-thread-1) [ ] o.a.s.m.r.SolrJmxReporter Closing reporter [org.apache.solr.metrics.reporters.SolrJmxReporter@7b5fdb5e: rootName = solr_35867, domain = solr.core.testCollection1.shard1.replica_n1, service url = null, agent id = null] for registry solr.core.testCollection1.shard1.replica_n1 / com.codahale.metrics.MetricRegistry@5f6ab63e
[junit4] 2> 318855 INFO (coreCloseExecutor-1516-thread-3) [ ] o.a.s.c.SolrCore [testCollection2_shard1_replica_n1] CLOSING SolrCore org.apache.solr.core.SolrCore@6a4e9de0
[junit4] 2> 318861 INFO (coreCloseExecutor-1516-thread-2) [ ] o.a.s.m.SolrMetricManager Closing metric reporters for registry=solr.core.testCollection2.shard2.replica_n2, tag=1372174581
[junit4] 2> 318861 INFO (coreCloseExecutor-1516-thread-2) [ ] o.a.s.m.r.SolrJmxReporter Closing reporter [org.apache.solr.metrics.reporters.SolrJmxReporter@1d9f9b2c: rootName = solr_35867, domain = solr.core.testCollection2.shard2.replica_n2, service url = null, agent id = null] for registry solr.core.testCollection2.shard2.replica_n2 / com.codahale.metrics.MetricRegistry@65ac6136
[junit4] 2> 318866 INFO (coreCloseExecutor-1516-thread-2) [ ] o.a.s.m.SolrMetricManager Closing metric reporters for registry=solr.collection.testCollection2.shard2.leader, tag=1372174581
[junit4] 2> 318866 INFO (coreCloseExecutor-1516-thread-3) [ ] o.a.s.m.SolrMetricManager Closing metric reporters for registry=solr.core.testCollection2.shard1.replica_n1, tag=1783537120
[junit4] 2> 318866 INFO (coreCloseExecutor-1516-thread-3) [ ] o.a.s.m.r.SolrJmxReporter Closing reporter [org.apache.solr.metrics.reporters.SolrJmxReporter@7d8eb19a: rootName = solr_35867, domain = solr.core.testCollection2.shard1.replica_n1, service url = null, agent id = null] for registry solr.core.testCollection2.shard1.replica_n1 / com.codahale.metrics.MetricRegistry@70e732de
[junit4] 2> 318872 INFO (coreCloseExecutor-1516-thread-3) [ ] o.a.s.m.SolrMetricManager Closing metric reporters for registry=solr.collection.testCollection2.shard1.leader, tag=1783537120
[junit4] 2> 318872 INFO (coreCloseExecutor-1516-thread-1) [ ] o.a.s.m.SolrMetricManager Closing metric reporters for registry=solr.collection.testCollection1.shard1.leader, tag=1628777409
[junit4] 2> 318875 INFO (jetty-closer-469-thread-1) [ ] o.a.s.c.Overseer Overseer (id=98669667170648067-127.0.0.1:35867_solr-n_0000000000) closing
[junit4] 2> 318875 INFO (OverseerStateUpdate-98669667170648067-127.0.0.1:35867_solr-n_0000000000) [ ] o.a.s.c.Overseer Overseer Loop exiting : 127.0.0.1:35867_solr
[junit4] 2> 318877 INFO (jetty-closer-469-thread-1) [ ] o.e.j.s.h.ContextHandler Stopped o.e.j.s.ServletContextHandler@1a5d1290{/solr,null,UNAVAILABLE}
[junit4] 2> 318877 ERROR (SUITE-LeaderElectionContextKeyTest-seed#[181A9A394EAB9ACE]-worker) [ ] o.a.z.s.ZooKeeperServer ZKShutdownHandler is not registered, so ZooKeeper server won't take any action on ERROR or SHUTDOWN server state changes
[junit4] 2> 318877 INFO (SUITE-LeaderElectionContextKeyTest-seed#[181A9A394EAB9ACE]-worker) [ ] o.a.s.c.ZkTestServer connecting to 127.0.0.1:36237 36237
[junit4] 2> 323932 INFO (Thread-759) [ ] o.a.s.c.ZkTestServer connecting to 127.0.0.1:36237 36237
[junit4] 2> 323932 WARN (Thread-759) [ ] o.a.s.c.ZkTestServer Watch limit violations:
[junit4] 2> Maximum concurrent create/delete watches above limit:
[junit4] 2>
[junit4] 2> 2 /solr/aliases.json
[junit4] 2>
[junit4] 2> Maximum concurrent data watches above limit:
[junit4] 2>
[junit4] 2> 5 /solr/collections/testCollection2/state.json
[junit4] 2> 5 /solr/collections/testCollection1/state.json
[junit4] 2> 2 /solr/clusterstate.json
[junit4] 2> 2 /solr/clusterprops.json
[junit4] 2>
[junit4] 2> Maximum concurrent children watches above limit:
[junit4] 2>
[junit4] 2> 2 /solr/live_nodes
[junit4] 2> 2 /solr/collections
[junit4] 2>
[junit4] 2> NOTE: leaving temporary files on disk at: /home/jenkins/workspace/Lucene-Solr-7.x-Linux/solr/build/solr-core/test/J0/temp/solr.cloud.LeaderElectionContextKeyTest_181A9A394EAB9ACE-001
[junit4] 2> NOTE: test params are: codec=Asserting(Lucene70): {}, docValues:{}, maxPointsInLeafNode=1999, maxMBSortInHeap=5.018999325398538, sim=RandomSimilarity(queryNorm=false): {}, locale=zh-HK, timezone=America/Whitehorse
[junit4] 2> NOTE: Linux 4.10.0-33-generic amd64/Oracle Corporation 9 (64-bit)/cpus=8,threads=1,free=102381952,total=412090368
[junit4] 2> NOTE: All tests run in this JVM: [TestDynamicFieldCollectionResource, TestWriterPerf, TestHalfAndHalfDocValues, TestRawResponseWriter, BasicZkTest, TestIndexingPerformance, HdfsBasicDistributedZk2Test, QueryElevationComponentTest, TestUnifiedSolrHighlighter, TestManagedSchemaThreadSafety, LeaderElectionIntegrationTest, TestExactSharedStatsCache, TestMultiValuedNumericRangeQuery, DistribJoinFromCollectionTest, RAMDirectoryFactoryTest, TestRemoteStreaming, TestMaxTokenLenTokenizer, TlogReplayBufferedWhileIndexingTest, TestSha256AuthenticationProvider, DistributedQueryElevationComponentTest, TestAuthorizationFramework, WordBreakSolrSpellCheckerTest, SolrIndexConfigTest, CursorPagingTest, TestComponentsName, TestLegacyFieldReuse, TestBinaryField, TestDistributedSearch, TestDocSet, AtomicUpdatesTest, RequestHandlersTest, TestConfigSetsAPIZkFailure, OpenExchangeRatesOrgProviderTest, TestExtendedDismaxParser, SaslZkACLProviderTest, TestFastOutputStream, TestBadConfig, TestBlobHandler, TestFreeTextSuggestions, TestEmbeddedSolrServerAdminHandler, TestConfig, TestAnalyzeInfixSuggestions, MissingSegmentRecoveryTest, TestJettySolrRunner, TestCSVLoader, TestManagedStopFilterFactory, TestCloudManagedSchema, UpdateParamsTest, MetricsConfigTest, TestSegmentSorting, VersionInfoTest, TestLuceneMatchVersion, TestSchemaVersionResource, OutputWriterTest, DefaultValueUpdateProcessorTest, LeaderElectionContextKeyTest]
[junit4] Completed [106/731 (1!)] on J0 in 10.65s, 1 test, 1 failure <<< FAILURES!
[...truncated 41326 lines...]
[JENKINS] Lucene-Solr-7.x-Linux (32bit/jdk1.8.0_144) - Build # 426
- Still Unstable!
Posted by Policeman Jenkins Server <je...@thetaphi.de>.
Build: https://jenkins.thetaphi.de/job/Lucene-Solr-7.x-Linux/426/
Java: 32bit/jdk1.8.0_144 -client -XX:+UseSerialGC
2 tests failed.
FAILED: junit.framework.TestSuite.org.apache.solr.cloud.TestSolrCloudWithSecureImpersonation
Error Message:
2 threads leaked from SUITE scope at org.apache.solr.cloud.TestSolrCloudWithSecureImpersonation: 1) Thread[id=1008, name=jetty-launcher-142-thread-1-EventThread, state=TIMED_WAITING, group=TGRP-TestSolrCloudWithSecureImpersonation] at sun.misc.Unsafe.park(Native Method) at java.util.concurrent.locks.LockSupport.parkNanos(LockSupport.java:215) at java.util.concurrent.locks.AbstractQueuedSynchronizer.doAcquireSharedNanos(AbstractQueuedSynchronizer.java:1037) at java.util.concurrent.locks.AbstractQueuedSynchronizer.tryAcquireSharedNanos(AbstractQueuedSynchronizer.java:1328) at java.util.concurrent.CountDownLatch.await(CountDownLatch.java:277) at org.apache.curator.CuratorZookeeperClient.internalBlockUntilConnectedOrTimedOut(CuratorZookeeperClient.java:323) at org.apache.curator.RetryLoop.callWithRetry(RetryLoop.java:105) at org.apache.curator.framework.imps.GetDataBuilderImpl.pathInForeground(GetDataBuilderImpl.java:288) at org.apache.curator.framework.imps.GetDataBuilderImpl.forPath(GetDataBuilderImpl.java:279) at org.apache.curator.framework.imps.GetDataBuilderImpl.forPath(GetDataBuilderImpl.java:41) at org.apache.curator.framework.recipes.shared.SharedValue.readValue(SharedValue.java:244) at org.apache.curator.framework.recipes.shared.SharedValue.access$100(SharedValue.java:44) at org.apache.curator.framework.recipes.shared.SharedValue$1.process(SharedValue.java:61) at org.apache.curator.framework.imps.NamespaceWatcher.process(NamespaceWatcher.java:67) at org.apache.zookeeper.ClientCnxn$EventThread.processEvent(ClientCnxn.java:530) at org.apache.zookeeper.ClientCnxn$EventThread.run(ClientCnxn.java:505) 2) Thread[id=1013, name=jetty-launcher-142-thread-2-EventThread, state=TIMED_WAITING, group=TGRP-TestSolrCloudWithSecureImpersonation] at sun.misc.Unsafe.park(Native Method) at java.util.concurrent.locks.LockSupport.parkNanos(LockSupport.java:215) at java.util.concurrent.locks.AbstractQueuedSynchronizer.doAcquireSharedNanos(AbstractQueuedSynchronizer.java:1037) at java.util.concurrent.locks.AbstractQueuedSynchronizer.tryAcquireSharedNanos(AbstractQueuedSynchronizer.java:1328) at java.util.concurrent.CountDownLatch.await(CountDownLatch.java:277) at org.apache.curator.CuratorZookeeperClient.internalBlockUntilConnectedOrTimedOut(CuratorZookeeperClient.java:323) at org.apache.curator.RetryLoop.callWithRetry(RetryLoop.java:105) at org.apache.curator.framework.imps.GetDataBuilderImpl.pathInForeground(GetDataBuilderImpl.java:288) at org.apache.curator.framework.imps.GetDataBuilderImpl.forPath(GetDataBuilderImpl.java:279) at org.apache.curator.framework.imps.GetDataBuilderImpl.forPath(GetDataBuilderImpl.java:41) at org.apache.curator.framework.recipes.shared.SharedValue.readValue(SharedValue.java:244) at org.apache.curator.framework.recipes.shared.SharedValue.access$100(SharedValue.java:44) at org.apache.curator.framework.recipes.shared.SharedValue$1.process(SharedValue.java:61) at org.apache.curator.framework.imps.NamespaceWatcher.process(NamespaceWatcher.java:67) at org.apache.zookeeper.ClientCnxn$EventThread.processEvent(ClientCnxn.java:530) at org.apache.zookeeper.ClientCnxn$EventThread.run(ClientCnxn.java:505)
Stack Trace:
com.carrotsearch.randomizedtesting.ThreadLeakError: 2 threads leaked from SUITE scope at org.apache.solr.cloud.TestSolrCloudWithSecureImpersonation:
1) Thread[id=1008, name=jetty-launcher-142-thread-1-EventThread, state=TIMED_WAITING, group=TGRP-TestSolrCloudWithSecureImpersonation]
at sun.misc.Unsafe.park(Native Method)
at java.util.concurrent.locks.LockSupport.parkNanos(LockSupport.java:215)
at java.util.concurrent.locks.AbstractQueuedSynchronizer.doAcquireSharedNanos(AbstractQueuedSynchronizer.java:1037)
at java.util.concurrent.locks.AbstractQueuedSynchronizer.tryAcquireSharedNanos(AbstractQueuedSynchronizer.java:1328)
at java.util.concurrent.CountDownLatch.await(CountDownLatch.java:277)
at org.apache.curator.CuratorZookeeperClient.internalBlockUntilConnectedOrTimedOut(CuratorZookeeperClient.java:323)
at org.apache.curator.RetryLoop.callWithRetry(RetryLoop.java:105)
at org.apache.curator.framework.imps.GetDataBuilderImpl.pathInForeground(GetDataBuilderImpl.java:288)
at org.apache.curator.framework.imps.GetDataBuilderImpl.forPath(GetDataBuilderImpl.java:279)
at org.apache.curator.framework.imps.GetDataBuilderImpl.forPath(GetDataBuilderImpl.java:41)
at org.apache.curator.framework.recipes.shared.SharedValue.readValue(SharedValue.java:244)
at org.apache.curator.framework.recipes.shared.SharedValue.access$100(SharedValue.java:44)
at org.apache.curator.framework.recipes.shared.SharedValue$1.process(SharedValue.java:61)
at org.apache.curator.framework.imps.NamespaceWatcher.process(NamespaceWatcher.java:67)
at org.apache.zookeeper.ClientCnxn$EventThread.processEvent(ClientCnxn.java:530)
at org.apache.zookeeper.ClientCnxn$EventThread.run(ClientCnxn.java:505)
2) Thread[id=1013, name=jetty-launcher-142-thread-2-EventThread, state=TIMED_WAITING, group=TGRP-TestSolrCloudWithSecureImpersonation]
at sun.misc.Unsafe.park(Native Method)
at java.util.concurrent.locks.LockSupport.parkNanos(LockSupport.java:215)
at java.util.concurrent.locks.AbstractQueuedSynchronizer.doAcquireSharedNanos(AbstractQueuedSynchronizer.java:1037)
at java.util.concurrent.locks.AbstractQueuedSynchronizer.tryAcquireSharedNanos(AbstractQueuedSynchronizer.java:1328)
at java.util.concurrent.CountDownLatch.await(CountDownLatch.java:277)
at org.apache.curator.CuratorZookeeperClient.internalBlockUntilConnectedOrTimedOut(CuratorZookeeperClient.java:323)
at org.apache.curator.RetryLoop.callWithRetry(RetryLoop.java:105)
at org.apache.curator.framework.imps.GetDataBuilderImpl.pathInForeground(GetDataBuilderImpl.java:288)
at org.apache.curator.framework.imps.GetDataBuilderImpl.forPath(GetDataBuilderImpl.java:279)
at org.apache.curator.framework.imps.GetDataBuilderImpl.forPath(GetDataBuilderImpl.java:41)
at org.apache.curator.framework.recipes.shared.SharedValue.readValue(SharedValue.java:244)
at org.apache.curator.framework.recipes.shared.SharedValue.access$100(SharedValue.java:44)
at org.apache.curator.framework.recipes.shared.SharedValue$1.process(SharedValue.java:61)
at org.apache.curator.framework.imps.NamespaceWatcher.process(NamespaceWatcher.java:67)
at org.apache.zookeeper.ClientCnxn$EventThread.processEvent(ClientCnxn.java:530)
at org.apache.zookeeper.ClientCnxn$EventThread.run(ClientCnxn.java:505)
at __randomizedtesting.SeedInfo.seed([AE890F42666FC6DA]:0)
FAILED: org.apache.solr.cloud.TestCloudRecovery.corruptedLogTest
Error Message:
Timeout waiting for all live and active
Stack Trace:
java.lang.AssertionError: Timeout waiting for all live and active
at __randomizedtesting.SeedInfo.seed([AE890F42666FC6DA:2DFF50B0B016C87B]:0)
at org.junit.Assert.fail(Assert.java:93)
at org.junit.Assert.assertTrue(Assert.java:43)
at org.apache.solr.cloud.TestCloudRecovery.corruptedLogTest(TestCloudRecovery.java:184)
at sun.reflect.NativeMethodAccessorImpl.invoke0(Native Method)
at sun.reflect.NativeMethodAccessorImpl.invoke(NativeMethodAccessorImpl.java:62)
at sun.reflect.DelegatingMethodAccessorImpl.invoke(DelegatingMethodAccessorImpl.java:43)
at java.lang.reflect.Method.invoke(Method.java:498)
at com.carrotsearch.randomizedtesting.RandomizedRunner.invoke(RandomizedRunner.java:1737)
at com.carrotsearch.randomizedtesting.RandomizedRunner$8.evaluate(RandomizedRunner.java:934)
at com.carrotsearch.randomizedtesting.RandomizedRunner$9.evaluate(RandomizedRunner.java:970)
at com.carrotsearch.randomizedtesting.RandomizedRunner$10.evaluate(RandomizedRunner.java:984)
at com.carrotsearch.randomizedtesting.rules.SystemPropertiesRestoreRule$1.evaluate(SystemPropertiesRestoreRule.java:57)
at org.apache.lucene.util.TestRuleSetupTeardownChained$1.evaluate(TestRuleSetupTeardownChained.java:49)
at org.apache.lucene.util.AbstractBeforeAfterRule$1.evaluate(AbstractBeforeAfterRule.java:45)
at org.apache.lucene.util.TestRuleThreadAndTestName$1.evaluate(TestRuleThreadAndTestName.java:48)
at org.apache.lucene.util.TestRuleIgnoreAfterMaxFailures$1.evaluate(TestRuleIgnoreAfterMaxFailures.java:64)
at org.apache.lucene.util.TestRuleMarkFailure$1.evaluate(TestRuleMarkFailure.java:47)
at com.carrotsearch.randomizedtesting.rules.StatementAdapter.evaluate(StatementAdapter.java:36)
at com.carrotsearch.randomizedtesting.ThreadLeakControl$StatementRunner.run(ThreadLeakControl.java:368)
at com.carrotsearch.randomizedtesting.ThreadLeakControl.forkTimeoutingTask(ThreadLeakControl.java:817)
at com.carrotsearch.randomizedtesting.ThreadLeakControl$3.evaluate(ThreadLeakControl.java:468)
at com.carrotsearch.randomizedtesting.RandomizedRunner.runSingleTest(RandomizedRunner.java:943)
at com.carrotsearch.randomizedtesting.RandomizedRunner$5.evaluate(RandomizedRunner.java:829)
at com.carrotsearch.randomizedtesting.RandomizedRunner$6.evaluate(RandomizedRunner.java:879)
at com.carrotsearch.randomizedtesting.RandomizedRunner$7.evaluate(RandomizedRunner.java:890)
at com.carrotsearch.randomizedtesting.rules.StatementAdapter.evaluate(StatementAdapter.java:36)
at com.carrotsearch.randomizedtesting.rules.SystemPropertiesRestoreRule$1.evaluate(SystemPropertiesRestoreRule.java:57)
at org.apache.lucene.util.AbstractBeforeAfterRule$1.evaluate(AbstractBeforeAfterRule.java:45)
at com.carrotsearch.randomizedtesting.rules.StatementAdapter.evaluate(StatementAdapter.java:36)
at org.apache.lucene.util.TestRuleStoreClassName$1.evaluate(TestRuleStoreClassName.java:41)
at com.carrotsearch.randomizedtesting.rules.NoShadowingOrOverridesOnMethodsRule$1.evaluate(NoShadowingOrOverridesOnMethodsRule.java:40)
at com.carrotsearch.randomizedtesting.rules.NoShadowingOrOverridesOnMethodsRule$1.evaluate(NoShadowingOrOverridesOnMethodsRule.java:40)
at com.carrotsearch.randomizedtesting.rules.StatementAdapter.evaluate(StatementAdapter.java:36)
at com.carrotsearch.randomizedtesting.rules.StatementAdapter.evaluate(StatementAdapter.java:36)
at com.carrotsearch.randomizedtesting.rules.StatementAdapter.evaluate(StatementAdapter.java:36)
at org.apache.lucene.util.TestRuleAssertionsRequired$1.evaluate(TestRuleAssertionsRequired.java:53)
at org.apache.lucene.util.TestRuleMarkFailure$1.evaluate(TestRuleMarkFailure.java:47)
at org.apache.lucene.util.TestRuleIgnoreAfterMaxFailures$1.evaluate(TestRuleIgnoreAfterMaxFailures.java:64)
at org.apache.lucene.util.TestRuleIgnoreTestSuites$1.evaluate(TestRuleIgnoreTestSuites.java:54)
at com.carrotsearch.randomizedtesting.rules.StatementAdapter.evaluate(StatementAdapter.java:36)
at com.carrotsearch.randomizedtesting.ThreadLeakControl$StatementRunner.run(ThreadLeakControl.java:368)
at java.lang.Thread.run(Thread.java:748)
Build Log:
[...truncated 11310 lines...]
[junit4] Suite: org.apache.solr.cloud.TestSolrCloudWithSecureImpersonation
[junit4] 2> 156903 INFO (SUITE-TestSolrCloudWithSecureImpersonation-seed#[AE890F42666FC6DA]-worker) [ ] o.a.s.SolrTestCaseJ4 SecureRandom sanity checks: test.solr.allowed.securerandom=null & java.security.egd=file:/dev/./urandom
[junit4] 2> Creating dataDir: /home/jenkins/workspace/Lucene-Solr-7.x-Linux/solr/build/solr-core/test/J2/temp/solr.cloud.TestSolrCloudWithSecureImpersonation_AE890F42666FC6DA-001/init-core-data-001
[junit4] 2> 156904 INFO (SUITE-TestSolrCloudWithSecureImpersonation-seed#[AE890F42666FC6DA]-worker) [ ] o.a.s.SolrTestCaseJ4 Using PointFields (NUMERIC_POINTS_SYSPROP=true) w/NUMERIC_DOCVALUES_SYSPROP=false
[junit4] 2> 156905 INFO (SUITE-TestSolrCloudWithSecureImpersonation-seed#[AE890F42666FC6DA]-worker) [ ] o.a.s.SolrTestCaseJ4 Randomized ssl (false) and clientAuth (true) via: @org.apache.solr.util.RandomizeSSL(reason=, ssl=NaN, value=NaN, clientAuth=NaN)
[junit4] 2> 156952 WARN (SUITE-TestSolrCloudWithSecureImpersonation-seed#[AE890F42666FC6DA]-worker) [ ] o.a.h.u.NativeCodeLoader Unable to load native-hadoop library for your platform... using builtin-java classes where applicable
[junit4] 2> 157052 INFO (SUITE-TestSolrCloudWithSecureImpersonation-seed#[AE890F42666FC6DA]-worker) [ ] o.a.s.c.MiniSolrCloudCluster Starting cluster of 2 servers in /home/jenkins/workspace/Lucene-Solr-7.x-Linux/solr/build/solr-core/test/J2/temp/solr.cloud.TestSolrCloudWithSecureImpersonation_AE890F42666FC6DA-001/tempDir-001
[junit4] 2> 157052 INFO (SUITE-TestSolrCloudWithSecureImpersonation-seed#[AE890F42666FC6DA]-worker) [ ] o.a.s.c.ZkTestServer STARTING ZK TEST SERVER
[junit4] 2> 157052 INFO (Thread-284) [ ] o.a.s.c.ZkTestServer client port:0.0.0.0/0.0.0.0:0
[junit4] 2> 157053 INFO (Thread-284) [ ] o.a.s.c.ZkTestServer Starting server
[junit4] 2> 157055 ERROR (Thread-284) [ ] o.a.z.s.ZooKeeperServer ZKShutdownHandler is not registered, so ZooKeeper server won't take any action on ERROR or SHUTDOWN server state changes
[junit4] 2> 157153 INFO (SUITE-TestSolrCloudWithSecureImpersonation-seed#[AE890F42666FC6DA]-worker) [ ] o.a.s.c.ZkTestServer start zk server on port:41063
[junit4] 2> 157158 INFO (jetty-launcher-142-thread-1) [ ] o.e.j.s.Server jetty-9.3.20.v20170531
[junit4] 2> 157158 INFO (jetty-launcher-142-thread-2) [ ] o.e.j.s.Server jetty-9.3.20.v20170531
[junit4] 2> 157159 INFO (jetty-launcher-142-thread-1) [ ] o.e.j.s.h.ContextHandler Started o.e.j.s.ServletContextHandler@1647b11{/solr,null,AVAILABLE}
[junit4] 2> 157159 INFO (jetty-launcher-142-thread-2) [ ] o.e.j.s.h.ContextHandler Started o.e.j.s.ServletContextHandler@e8e56{/solr,null,AVAILABLE}
[junit4] 2> 157160 INFO (jetty-launcher-142-thread-1) [ ] o.e.j.s.AbstractConnector Started ServerConnector@d12f26{HTTP/1.1,[http/1.1]}{127.0.0.1:46073}
[junit4] 2> 157160 INFO (jetty-launcher-142-thread-1) [ ] o.e.j.s.Server Started @158111ms
[junit4] 2> 157160 INFO (jetty-launcher-142-thread-2) [ ] o.e.j.s.AbstractConnector Started ServerConnector@e2f51e{HTTP/1.1,[http/1.1]}{127.0.0.1:42671}
[junit4] 2> 157160 INFO (jetty-launcher-142-thread-1) [ ] o.a.s.c.s.e.JettySolrRunner Jetty properties: {hostContext=/solr, hostPort=46073}
[junit4] 2> 157160 INFO (jetty-launcher-142-thread-2) [ ] o.e.j.s.Server Started @158111ms
[junit4] 2> 157160 INFO (jetty-launcher-142-thread-2) [ ] o.a.s.c.s.e.JettySolrRunner Jetty properties: {hostContext=/solr, hostPort=42671}
[junit4] 2> 157160 ERROR (jetty-launcher-142-thread-1) [ ] o.a.s.u.StartupLoggingUtils Missing Java Option solr.log.dir. Logging may be missing or incomplete.
[junit4] 2> 157160 ERROR (jetty-launcher-142-thread-2) [ ] o.a.s.u.StartupLoggingUtils Missing Java Option solr.log.dir. Logging may be missing or incomplete.
[junit4] 2> 157160 INFO (jetty-launcher-142-thread-1) [ ] o.a.s.s.SolrDispatchFilter ___ _ Welcome to Apache Solr? version 7.1.0
[junit4] 2> 157160 INFO (jetty-launcher-142-thread-2) [ ] o.a.s.s.SolrDispatchFilter ___ _ Welcome to Apache Solr? version 7.1.0
[junit4] 2> 157160 INFO (jetty-launcher-142-thread-1) [ ] o.a.s.s.SolrDispatchFilter / __| ___| |_ _ Starting in cloud mode on port null
[junit4] 2> 157160 INFO (jetty-launcher-142-thread-2) [ ] o.a.s.s.SolrDispatchFilter / __| ___| |_ _ Starting in cloud mode on port null
[junit4] 2> 157160 INFO (jetty-launcher-142-thread-1) [ ] o.a.s.s.SolrDispatchFilter \__ \/ _ \ | '_| Install dir: null, Default config dir: null
[junit4] 2> 157160 INFO (jetty-launcher-142-thread-2) [ ] o.a.s.s.SolrDispatchFilter \__ \/ _ \ | '_| Install dir: null, Default config dir: null
[junit4] 2> 157161 INFO (jetty-launcher-142-thread-1) [ ] o.a.s.s.SolrDispatchFilter |___/\___/_|_| Start time: 2017-09-16T20:17:37.480Z
[junit4] 2> 157161 INFO (jetty-launcher-142-thread-2) [ ] o.a.s.s.SolrDispatchFilter |___/\___/_|_| Start time: 2017-09-16T20:17:37.480Z
[junit4] 2> 157168 INFO (jetty-launcher-142-thread-2) [ ] o.a.s.s.SolrDispatchFilter solr.xml found in ZooKeeper. Loading...
[junit4] 2> 157168 INFO (jetty-launcher-142-thread-1) [ ] o.a.s.s.SolrDispatchFilter solr.xml found in ZooKeeper. Loading...
[junit4] 2> 157176 WARN (NIOServerCxn.Factory:0.0.0.0/0.0.0.0:0) [ ] o.a.z.s.NIOServerCnxn caught end of stream exception
[junit4] 2> EndOfStreamException: Unable to read additional data from client sessionid 0x15e8c56e05e0002, likely client has closed socket
[junit4] 2> at org.apache.zookeeper.server.NIOServerCnxn.doIO(NIOServerCnxn.java:239)
[junit4] 2> at org.apache.zookeeper.server.NIOServerCnxnFactory.run(NIOServerCnxnFactory.java:203)
[junit4] 2> at java.lang.Thread.run(Thread.java:748)
[junit4] 2> 157178 INFO (jetty-launcher-142-thread-2) [ ] o.a.s.c.ZkContainer Zookeeper client=127.0.0.1:41063/solr
[junit4] 2> 157178 INFO (jetty-launcher-142-thread-1) [ ] o.a.s.c.ZkContainer Zookeeper client=127.0.0.1:41063/solr
[junit4] 2> 157182 WARN (NIOServerCxn.Factory:0.0.0.0/0.0.0.0:0) [ ] o.a.z.s.NIOServerCnxn caught end of stream exception
[junit4] 2> EndOfStreamException: Unable to read additional data from client sessionid 0x15e8c56e05e0004, likely client has closed socket
[junit4] 2> at org.apache.zookeeper.server.NIOServerCnxn.doIO(NIOServerCnxn.java:239)
[junit4] 2> at org.apache.zookeeper.server.NIOServerCnxnFactory.run(NIOServerCnxnFactory.java:203)
[junit4] 2> at java.lang.Thread.run(Thread.java:748)
[junit4] 2> 157238 INFO (jetty-launcher-142-thread-2) [n:127.0.0.1:42671_solr ] o.a.s.c.Overseer Overseer (id=null) closing
[junit4] 2> 157238 INFO (jetty-launcher-142-thread-1) [n:127.0.0.1:46073_solr ] o.a.s.c.Overseer Overseer (id=null) closing
[junit4] 2> 157239 INFO (jetty-launcher-142-thread-2) [n:127.0.0.1:42671_solr ] o.a.s.c.OverseerElectionContext I am going to be the leader 127.0.0.1:42671_solr
[junit4] 2> 157239 INFO (jetty-launcher-142-thread-1) [n:127.0.0.1:46073_solr ] o.a.s.c.ZkController Register node as live in ZooKeeper:/live_nodes/127.0.0.1:46073_solr
[junit4] 2> 157249 INFO (jetty-launcher-142-thread-2) [n:127.0.0.1:42671_solr ] o.a.s.c.Overseer Overseer (id=98670546608062469-127.0.0.1:42671_solr-n_0000000000) starting
[junit4] 2> 157250 INFO (zkCallback-153-thread-1-processing-n:127.0.0.1:46073_solr) [n:127.0.0.1:46073_solr ] o.a.s.c.c.ZkStateReader Updated live nodes from ZooKeeper... (0) -> (1)
[junit4] 2> 157250 INFO (zkCallback-154-thread-1-processing-n:127.0.0.1:42671_solr) [n:127.0.0.1:42671_solr ] o.a.s.c.c.ZkStateReader Updated live nodes from ZooKeeper... (0) -> (1)
[junit4] 2> 157257 INFO (jetty-launcher-142-thread-2) [n:127.0.0.1:42671_solr ] o.a.s.c.ZkController Register node as live in ZooKeeper:/live_nodes/127.0.0.1:42671_solr
[junit4] 2> 157258 INFO (zkCallback-153-thread-1-processing-n:127.0.0.1:46073_solr) [n:127.0.0.1:46073_solr ] o.a.s.c.c.ZkStateReader Updated live nodes from ZooKeeper... (1) -> (2)
[junit4] 2> 157258 INFO (zkCallback-154-thread-1-processing-n:127.0.0.1:42671_solr) [n:127.0.0.1:42671_solr ] o.a.s.c.c.ZkStateReader Updated live nodes from ZooKeeper... (1) -> (2)
[junit4] 2> 157334 INFO (jetty-launcher-142-thread-1) [n:127.0.0.1:46073_solr ] o.a.s.c.CoreContainer Initializing authentication plugin: org.apache.solr.security.HttpParamDelegationTokenPlugin
[junit4] 2> 157338 WARN (jetty-launcher-142-thread-1) [n:127.0.0.1:46073_solr ] o.a.s.c.s.i.Krb5HttpClientBuilder org.apache.solr.client.solrj.impl.Krb5HttpClientBuilder is configured without specifying system property 'java.security.auth.login.config'
[junit4] 2> 157351 INFO (jetty-launcher-142-thread-1) [n:127.0.0.1:46073_solr ] o.a.s.s.KerberosPlugin Params: {solr.kerberos.impersonator.user.noGroups.hosts=*, solr.kerberos.impersonator.user.bogusGroup.groups=__some_bogus_group, token.valid=30, cookie.domain=127.0.0.1, solr.kerberos.impersonator.user.anyHostAnyUser.groups=*, solr.kerberos.impersonator.user.bogusGroup.hosts=*, solr.kerberos.impersonator.user.anyHostAnyUser.hosts=*, token.validity=36000, solr.kerberos.impersonator.user.noHosts.groups=*, type=kerberos, solr.kerberos.impersonator.user.localHostAnyGroup.groups=*, delegation-token.token-kind=solr-dt, solr.kerberos.impersonator.user.wrongHost.hosts=1.1.1.1.1.1, cookie.path=/, zk-dt-secret-manager.znodeWorkingPath=solr/security/zkdtsm, solr.kerberos.impersonator.user.localHostAnyGroup.hosts=localhost.localdomain,localhost,127.0.0.1, signer.secret.provider.zookeeper.path=/token, solr.kerberos.impersonator.user.anyHostUsersGroup.groups=jenkins, zk-dt-secret-manager.enable=true, solr.kerberos.impersonator.user.wrongHost.groups=*, kerberos.name.rules=DEFAULT, signer.secret.provider=zookeeper, solr.kerberos.impersonator.user.anyHostUsersGroup.hosts=*}
[junit4] 2> 157419 INFO (jetty-launcher-142-thread-1) [n:127.0.0.1:46073_solr ] o.a.c.f.i.CuratorFrameworkImpl Starting
[junit4] 2> 157433 INFO (jetty-launcher-142-thread-1-EventThread) [n:127.0.0.1:46073_solr ] o.a.c.f.s.ConnectionStateManager State change: CONNECTED
[junit4] 2> 157453 INFO (jetty-launcher-142-thread-2) [n:127.0.0.1:42671_solr ] o.a.s.c.CoreContainer Initializing authentication plugin: org.apache.solr.security.HttpParamDelegationTokenPlugin
[junit4] 2> 157454 WARN (jetty-launcher-142-thread-2) [n:127.0.0.1:42671_solr ] o.a.s.c.s.i.Krb5HttpClientBuilder org.apache.solr.client.solrj.impl.Krb5HttpClientBuilder is configured without specifying system property 'java.security.auth.login.config'
[junit4] 2> 157454 INFO (jetty-launcher-142-thread-2) [n:127.0.0.1:42671_solr ] o.a.s.s.KerberosPlugin Params: {solr.kerberos.impersonator.user.noGroups.hosts=*, solr.kerberos.impersonator.user.bogusGroup.groups=__some_bogus_group, token.valid=30, cookie.domain=127.0.0.1, solr.kerberos.impersonator.user.anyHostAnyUser.groups=*, solr.kerberos.impersonator.user.bogusGroup.hosts=*, solr.kerberos.impersonator.user.anyHostAnyUser.hosts=*, token.validity=36000, solr.kerberos.impersonator.user.noHosts.groups=*, type=kerberos, solr.kerberos.impersonator.user.localHostAnyGroup.groups=*, delegation-token.token-kind=solr-dt, solr.kerberos.impersonator.user.wrongHost.hosts=1.1.1.1.1.1, cookie.path=/, zk-dt-secret-manager.znodeWorkingPath=solr/security/zkdtsm, solr.kerberos.impersonator.user.localHostAnyGroup.hosts=localhost.localdomain,localhost,127.0.0.1, signer.secret.provider.zookeeper.path=/token, solr.kerberos.impersonator.user.anyHostUsersGroup.groups=jenkins, zk-dt-secret-manager.enable=true, solr.kerberos.impersonator.user.wrongHost.groups=*, kerberos.name.rules=DEFAULT, signer.secret.provider=zookeeper, solr.kerberos.impersonator.user.anyHostUsersGroup.hosts=*}
[junit4] 2> 157455 INFO (jetty-launcher-142-thread-2) [n:127.0.0.1:42671_solr ] o.a.c.f.i.CuratorFrameworkImpl Starting
[junit4] 2> 157458 INFO (jetty-launcher-142-thread-2-EventThread) [n:127.0.0.1:42671_solr ] o.a.c.f.s.ConnectionStateManager State change: CONNECTED
[junit4] 2> 157562 WARN (jetty-launcher-142-thread-2) [n:127.0.0.1:42671_solr ] o.a.s.c.s.i.Krb5HttpClientBuilder org.apache.solr.client.solrj.impl.Krb5HttpClientBuilder is configured without specifying system property 'java.security.auth.login.config'
[junit4] 2> 157562 WARN (jetty-launcher-142-thread-1) [n:127.0.0.1:46073_solr ] o.a.s.c.s.i.Krb5HttpClientBuilder org.apache.solr.client.solrj.impl.Krb5HttpClientBuilder is configured without specifying system property 'java.security.auth.login.config'
[junit4] 2> 157614 INFO (jetty-launcher-142-thread-2) [n:127.0.0.1:42671_solr ] o.a.s.m.r.SolrJmxReporter JMX monitoring for 'solr_42671.solr.node' (registry 'solr.node') enabled at server: com.sun.jmx.mbeanserver.JmxMBeanServer@2b4b4d
[junit4] 2> 157615 INFO (jetty-launcher-142-thread-2) [n:127.0.0.1:42671_solr ] o.a.s.m.r.SolrJmxReporter JMX monitoring for 'solr_42671.solr.jvm' (registry 'solr.jvm') enabled at server: com.sun.jmx.mbeanserver.JmxMBeanServer@2b4b4d
[junit4] 2> 157615 INFO (jetty-launcher-142-thread-2) [n:127.0.0.1:42671_solr ] o.a.s.m.r.SolrJmxReporter JMX monitoring for 'solr_42671.solr.jetty' (registry 'solr.jetty') enabled at server: com.sun.jmx.mbeanserver.JmxMBeanServer@2b4b4d
[junit4] 2> 157616 INFO (jetty-launcher-142-thread-1) [n:127.0.0.1:46073_solr ] o.a.s.m.r.SolrJmxReporter JMX monitoring for 'solr_46073.solr.node' (registry 'solr.node') enabled at server: com.sun.jmx.mbeanserver.JmxMBeanServer@2b4b4d
[junit4] 2> 157617 INFO (jetty-launcher-142-thread-1) [n:127.0.0.1:46073_solr ] o.a.s.m.r.SolrJmxReporter JMX monitoring for 'solr_46073.solr.jvm' (registry 'solr.jvm') enabled at server: com.sun.jmx.mbeanserver.JmxMBeanServer@2b4b4d
[junit4] 2> 157617 INFO (jetty-launcher-142-thread-1) [n:127.0.0.1:46073_solr ] o.a.s.m.r.SolrJmxReporter JMX monitoring for 'solr_46073.solr.jetty' (registry 'solr.jetty') enabled at server: com.sun.jmx.mbeanserver.JmxMBeanServer@2b4b4d
[junit4] 2> 157617 INFO (jetty-launcher-142-thread-2) [n:127.0.0.1:42671_solr ] o.a.s.c.CorePropertiesLocator Found 0 core definitions underneath /home/jenkins/workspace/Lucene-Solr-7.x-Linux/solr/build/solr-core/test/J2/temp/solr.cloud.TestSolrCloudWithSecureImpersonation_AE890F42666FC6DA-001/tempDir-001/node2/.
[junit4] 2> 157619 INFO (jetty-launcher-142-thread-1) [n:127.0.0.1:46073_solr ] o.a.s.c.CorePropertiesLocator Found 0 core definitions underneath /home/jenkins/workspace/Lucene-Solr-7.x-Linux/solr/build/solr-core/test/J2/temp/solr.cloud.TestSolrCloudWithSecureImpersonation_AE890F42666FC6DA-001/tempDir-001/node1/.
[junit4] 2> 157690 INFO (TEST-TestSolrCloudWithSecureImpersonation.testProxyValidateGroup-seed#[AE890F42666FC6DA]) [ ] o.a.s.SolrTestCaseJ4 ###Starting testProxyValidateGroup
[junit4] 2> 157742 INFO (qtp31554950-975) [n:127.0.0.1:42671_solr ] o.a.s.h.a.CollectionsHandler Invoked Collection Action :list with params doAs=jenkins&action=LIST&wt=javabin&version=2 and sendToOCPQueue=true
[junit4] 2> 157742 INFO (qtp31554950-975) [n:127.0.0.1:42671_solr ] o.a.s.s.HttpSolrCall [admin] webapp=null path=/admin/collections params={doAs=jenkins&action=LIST&wt=javabin&version=2} status=0 QTime=0
[junit4] 2> 157748 WARN (TEST-TestSolrCloudWithSecureImpersonation.testProxyValidateGroup-seed#[AE890F42666FC6DA]) [ ] o.a.h.c.p.ResponseProcessCookies Invalid cookie header: "Set-Cookie: hadoop.auth="u=anyHostUsersGroup&p=anyHostUsersGroup&t=test&e=1505629058020&s=zVNl6yh3hXedhpn6sh08OS+q4xE="; Path=/; Domain=127.0.0.1; Expires= , 17- -2017 06:17:38 GMT; HttpOnly". Invalid 'expires' attribute: , 17- -2017 06:17:38 GMT
[junit4] 2> 157749 INFO (TEST-TestSolrCloudWithSecureImpersonation.testProxyValidateGroup-seed#[AE890F42666FC6DA]) [ ] o.a.s.SolrTestCaseJ4 ###Ending testProxyValidateGroup
[junit4] 2> 157760 INFO (TEST-TestSolrCloudWithSecureImpersonation.testProxyValidateAnyHostAnyUser-seed#[AE890F42666FC6DA]) [ ] o.a.s.SolrTestCaseJ4 ###Starting testProxyValidateAnyHostAnyUser
[junit4] 2> 157762 INFO (qtp31554950-977) [n:127.0.0.1:42671_solr ] o.a.s.h.a.CollectionsHandler Invoked Collection Action :list with params doAs=bar&action=LIST&wt=javabin&version=2 and sendToOCPQueue=true
[junit4] 2> 157762 INFO (qtp31554950-977) [n:127.0.0.1:42671_solr ] o.a.s.s.HttpSolrCall [admin] webapp=null path=/admin/collections params={doAs=bar&action=LIST&wt=javabin&version=2} status=0 QTime=0
[junit4] 2> 157762 WARN (TEST-TestSolrCloudWithSecureImpersonation.testProxyValidateAnyHostAnyUser-seed#[AE890F42666FC6DA]) [ ] o.a.h.c.p.ResponseProcessCookies Invalid cookie header: "Set-Cookie: hadoop.auth="u=anyHostAnyUser&p=anyHostAnyUser&t=test&e=1505629058081&s=bRBE+S1/LEX/3z9QscO36zYv3n0="; Path=/; Domain=127.0.0.1; Expires= , 17- -2017 06:17:38 GMT; HttpOnly". Invalid 'expires' attribute: , 17- -2017 06:17:38 GMT
[junit4] 2> 157762 INFO (TEST-TestSolrCloudWithSecureImpersonation.testProxyValidateAnyHostAnyUser-seed#[AE890F42666FC6DA]) [ ] o.a.s.SolrTestCaseJ4 ###Ending testProxyValidateAnyHostAnyUser
[junit4] 2> 157773 INFO (TEST-TestSolrCloudWithSecureImpersonation.testProxyInvalidProxyUser-seed#[AE890F42666FC6DA]) [ ] o.a.s.SolrTestCaseJ4 ###Starting testProxyInvalidProxyUser
[junit4] 2> 158060 WARN (TEST-TestSolrCloudWithSecureImpersonation.testProxyInvalidProxyUser-seed#[AE890F42666FC6DA]) [ ] o.a.h.c.p.ResponseProcessCookies Invalid cookie header: "Set-Cookie: hadoop.auth="u=bar&p=bar&t=test&e=1505629058094&s=w4QSMjQnT1+tP9hRbH582OE1B4E="; Path=/; Domain=127.0.0.1; Expires= , 17- -2017 06:17:38 GMT; HttpOnly". Invalid 'expires' attribute: , 17- -2017 06:17:38 GMT
[junit4] 2> 158061 INFO (TEST-TestSolrCloudWithSecureImpersonation.testProxyInvalidProxyUser-seed#[AE890F42666FC6DA]) [ ] o.a.s.SolrTestCaseJ4 ###Ending testProxyInvalidProxyUser
[junit4] 2> 158070 INFO (TEST-TestSolrCloudWithSecureImpersonation.testForwarding-seed#[AE890F42666FC6DA]) [ ] o.a.s.SolrTestCaseJ4 ###Starting testForwarding
[junit4] 2> 158242 INFO (TEST-TestSolrCloudWithSecureImpersonation.testForwarding-seed#[AE890F42666FC6DA]) [ ] o.a.s.c.c.ZkStateReader Updated live nodes from ZooKeeper... (0) -> (2)
[junit4] 2> 158243 INFO (TEST-TestSolrCloudWithSecureImpersonation.testForwarding-seed#[AE890F42666FC6DA]) [ ] o.a.s.c.s.i.ZkClientClusterStateProvider Cluster at 127.0.0.1:41063/solr ready
[junit4] 2> 158245 INFO (qtp31554950-975) [n:127.0.0.1:42671_solr ] o.a.s.h.a.CollectionsHandler Invoked Collection Action :create with params pullReplicas=0&replicationFactor=1&collection.configName=conf1&maxShardsPerNode=1&name=forwardingCollection&nrtReplicas=1&action=CREATE&numShards=1&tlogReplicas=0&wt=javabin&version=2 and sendToOCPQueue=true
[junit4] 2> 158246 INFO (OverseerThreadFactory-432-thread-1-processing-n:127.0.0.1:42671_solr) [n:127.0.0.1:42671_solr ] o.a.s.c.CreateCollectionCmd Create collection forwardingCollection
[junit4] 2> 158351 INFO (OverseerStateUpdate-98670546608062469-127.0.0.1:42671_solr-n_0000000000) [n:127.0.0.1:42671_solr ] o.a.s.c.o.SliceMutator createReplica() {
[junit4] 2> "operation":"ADDREPLICA",
[junit4] 2> "collection":"forwardingCollection",
[junit4] 2> "shard":"shard1",
[junit4] 2> "core":"forwardingCollection_shard1_replica_n1",
[junit4] 2> "state":"down",
[junit4] 2> "base_url":"http://127.0.0.1:42671/solr",
[junit4] 2> "type":"NRT"}
[junit4] 2> 158554 INFO (qtp31554950-978) [n:127.0.0.1:42671_solr ] o.a.s.h.a.CoreAdminOperation core create command qt=/admin/cores&coreNodeName=core_node2&collection.configName=conf1&newCollection=true&name=forwardingCollection_shard1_replica_n1&action=CREATE&numShards=1&collection=forwardingCollection&shard=shard1&wt=javabin&version=2&replicaType=NRT
[junit4] 2> 158554 INFO (qtp31554950-978) [n:127.0.0.1:42671_solr ] o.a.s.c.TransientSolrCoreCacheDefault Allocating transient cache for 2147483647 transient cores
[junit4] 2> 158658 INFO (zkCallback-154-thread-1-processing-n:127.0.0.1:42671_solr) [n:127.0.0.1:42671_solr ] o.a.s.c.c.ZkStateReader A cluster state change: [WatchedEvent state:SyncConnected type:NodeDataChanged path:/collections/forwardingCollection/state.json] for collection [forwardingCollection] has occurred - updating... (live nodes size: [2])
[junit4] 2> 158658 INFO (zkCallback-154-thread-2-processing-n:127.0.0.1:42671_solr) [n:127.0.0.1:42671_solr ] o.a.s.c.c.ZkStateReader A cluster state change: [WatchedEvent state:SyncConnected type:NodeDataChanged path:/collections/forwardingCollection/state.json] for collection [forwardingCollection] has occurred - updating... (live nodes size: [2])
[junit4] 2> 159573 INFO (qtp31554950-978) [n:127.0.0.1:42671_solr c:forwardingCollection s:shard1 r:core_node2 x:forwardingCollection_shard1_replica_n1] o.a.s.c.SolrConfig Using Lucene MatchVersion: 7.1.0
[junit4] 2> 159595 INFO (qtp31554950-978) [n:127.0.0.1:42671_solr c:forwardingCollection s:shard1 r:core_node2 x:forwardingCollection_shard1_replica_n1] o.a.s.s.IndexSchema [forwardingCollection_shard1_replica_n1] Schema name=test
[junit4] 2> 159693 INFO (qtp31554950-978) [n:127.0.0.1:42671_solr c:forwardingCollection s:shard1 r:core_node2 x:forwardingCollection_shard1_replica_n1] o.a.s.s.IndexSchema Loaded schema test/1.0 with uniqueid field id
[junit4] 2> 159709 INFO (qtp31554950-978) [n:127.0.0.1:42671_solr c:forwardingCollection s:shard1 r:core_node2 x:forwardingCollection_shard1_replica_n1] o.a.s.c.CoreContainer Creating SolrCore 'forwardingCollection_shard1_replica_n1' using configuration from collection forwardingCollection, trusted=true
[junit4] 2> 159709 INFO (qtp31554950-978) [n:127.0.0.1:42671_solr c:forwardingCollection s:shard1 r:core_node2 x:forwardingCollection_shard1_replica_n1] o.a.s.m.r.SolrJmxReporter JMX monitoring for 'solr_42671.solr.core.forwardingCollection.shard1.replica_n1' (registry 'solr.core.forwardingCollection.shard1.replica_n1') enabled at server: com.sun.jmx.mbeanserver.JmxMBeanServer@2b4b4d
[junit4] 2> 159710 INFO (qtp31554950-978) [n:127.0.0.1:42671_solr c:forwardingCollection s:shard1 r:core_node2 x:forwardingCollection_shard1_replica_n1] o.a.s.c.SolrCore solr.RecoveryStrategy.Builder
[junit4] 2> 159710 INFO (qtp31554950-978) [n:127.0.0.1:42671_solr c:forwardingCollection s:shard1 r:core_node2 x:forwardingCollection_shard1_replica_n1] o.a.s.c.SolrCore [[forwardingCollection_shard1_replica_n1] ] Opening new SolrCore at [/home/jenkins/workspace/Lucene-Solr-7.x-Linux/solr/build/solr-core/test/J2/temp/solr.cloud.TestSolrCloudWithSecureImpersonation_AE890F42666FC6DA-001/tempDir-001/node2/forwardingCollection_shard1_replica_n1], dataDir=[/home/jenkins/workspace/Lucene-Solr-7.x-Linux/solr/build/solr-core/test/J2/temp/solr.cloud.TestSolrCloudWithSecureImpersonation_AE890F42666FC6DA-001/tempDir-001/node2/./forwardingCollection_shard1_replica_n1/data/]
[junit4] 2> 159714 INFO (qtp31554950-978) [n:127.0.0.1:42671_solr c:forwardingCollection s:shard1 r:core_node2 x:forwardingCollection_shard1_replica_n1] o.a.s.u.RandomMergePolicy RandomMergePolicy wrapping class org.apache.lucene.index.TieredMergePolicy: [TieredMergePolicy: maxMergeAtOnce=28, maxMergeAtOnceExplicit=17, maxMergedSegmentMB=40.7236328125, floorSegmentMB=1.142578125, forceMergeDeletesPctAllowed=26.882959658658297, segmentsPerTier=22.0, maxCFSSegmentSizeMB=8.796093022207999E12, noCFSRatio=0.883413471972898
[junit4] 2> 159772 INFO (qtp31554950-978) [n:127.0.0.1:42671_solr c:forwardingCollection s:shard1 r:core_node2 x:forwardingCollection_shard1_replica_n1] o.a.s.u.UpdateHandler Using UpdateLog implementation: org.apache.solr.update.UpdateLog
[junit4] 2> 159772 INFO (qtp31554950-978) [n:127.0.0.1:42671_solr c:forwardingCollection s:shard1 r:core_node2 x:forwardingCollection_shard1_replica_n1] o.a.s.u.UpdateLog Initializing UpdateLog: dataDir= defaultSyncLevel=FLUSH numRecordsToKeep=100 maxNumLogsToKeep=10 numVersionBuckets=65536
[junit4] 2> 159773 INFO (qtp31554950-978) [n:127.0.0.1:42671_solr c:forwardingCollection s:shard1 r:core_node2 x:forwardingCollection_shard1_replica_n1] o.a.s.u.CommitTracker Hard AutoCommit: disabled
[junit4] 2> 159773 INFO (qtp31554950-978) [n:127.0.0.1:42671_solr c:forwardingCollection s:shard1 r:core_node2 x:forwardingCollection_shard1_replica_n1] o.a.s.u.CommitTracker Soft AutoCommit: disabled
[junit4] 2> 159774 INFO (qtp31554950-978) [n:127.0.0.1:42671_solr c:forwardingCollection s:shard1 r:core_node2 x:forwardingCollection_shard1_replica_n1] o.a.s.u.RandomMergePolicy RandomMergePolicy wrapping class org.apache.lucene.index.AlcoholicMergePolicy: [AlcoholicMergePolicy: minMergeSize=0, mergeFactor=10, maxMergeSize=335633989, maxMergeSizeForForcedMerge=9223372036854775807, calibrateSizeByDeletes=true, maxMergeDocs=2147483647, maxCFSSegmentSizeMB=8.796093022207999E12, noCFSRatio=0.1]
[junit4] 2> 159774 INFO (qtp31554950-978) [n:127.0.0.1:42671_solr c:forwardingCollection s:shard1 r:core_node2 x:forwardingCollection_shard1_replica_n1] o.a.s.s.SolrIndexSearcher Opening [Searcher@8dee31[forwardingCollection_shard1_replica_n1] main]
[junit4] 2> 159776 INFO (qtp31554950-978) [n:127.0.0.1:42671_solr c:forwardingCollection s:shard1 r:core_node2 x:forwardingCollection_shard1_replica_n1] o.a.s.h.c.SpellCheckComponent Initializing spell checkers
[junit4] 2> 159820 INFO (qtp31554950-978) [n:127.0.0.1:42671_solr c:forwardingCollection s:shard1 r:core_node2 x:forwardingCollection_shard1_replica_n1] o.a.s.s.DirectSolrSpellChecker init: {name=direct,classname=DirectSolrSpellChecker,field=lowerfilt,minQueryLength=3}
[junit4] 2> 159920 INFO (qtp31554950-978) [n:127.0.0.1:42671_solr c:forwardingCollection s:shard1 r:core_node2 x:forwardingCollection_shard1_replica_n1] o.a.s.h.ReplicationHandler Commits will be reserved for 10000
[junit4] 2> 159920 INFO (searcherExecutor-437-thread-1-processing-n:127.0.0.1:42671_solr x:forwardingCollection_shard1_replica_n1 s:shard1 c:forwardingCollection r:core_node2) [n:127.0.0.1:42671_solr c:forwardingCollection s:shard1 r:core_node2 x:forwardingCollection_shard1_replica_n1] o.a.s.h.c.SpellCheckComponent Loading spell index for spellchecker: default
[junit4] 2> 159920 INFO (qtp31554950-978) [n:127.0.0.1:42671_solr c:forwardingCollection s:shard1 r:core_node2 x:forwardingCollection_shard1_replica_n1] o.a.s.u.UpdateLog Could not find max version in index or recent updates, using new clock 1578728748734218240
[junit4] 2> 159921 INFO (searcherExecutor-437-thread-1-processing-n:127.0.0.1:42671_solr x:forwardingCollection_shard1_replica_n1 s:shard1 c:forwardingCollection r:core_node2) [n:127.0.0.1:42671_solr c:forwardingCollection s:shard1 r:core_node2 x:forwardingCollection_shard1_replica_n1] o.a.s.h.c.SpellCheckComponent Loading spell index for spellchecker: direct
[junit4] 2> 159921 INFO (searcherExecutor-437-thread-1-processing-n:127.0.0.1:42671_solr x:forwardingCollection_shard1_replica_n1 s:shard1 c:forwardingCollection r:core_node2) [n:127.0.0.1:42671_solr c:forwardingCollection s:shard1 r:core_node2 x:forwardingCollection_shard1_replica_n1] o.a.s.h.c.SpellCheckComponent Loading spell index for spellchecker: wordbreak
[junit4] 2> 159921 INFO (searcherExecutor-437-thread-1-processing-n:127.0.0.1:42671_solr x:forwardingCollection_shard1_replica_n1 s:shard1 c:forwardingCollection r:core_node2) [n:127.0.0.1:42671_solr c:forwardingCollection s:shard1 r:core_node2 x:forwardingCollection_shard1_replica_n1] o.a.s.h.c.SpellCheckComponent Loading spell index for spellchecker: multipleFields
[junit4] 2> 159921 INFO (searcherExecutor-437-thread-1-processing-n:127.0.0.1:42671_solr x:forwardingCollection_shard1_replica_n1 s:shard1 c:forwardingCollection r:core_node2) [n:127.0.0.1:42671_solr c:forwardingCollection s:shard1 r:core_node2 x:forwardingCollection_shard1_replica_n1] o.a.s.h.c.SpellCheckComponent Loading spell index for spellchecker: jarowinkler
[junit4] 2> 159921 INFO (searcherExecutor-437-thread-1-processing-n:127.0.0.1:42671_solr x:forwardingCollection_shard1_replica_n1 s:shard1 c:forwardingCollection r:core_node2) [n:127.0.0.1:42671_solr c:forwardingCollection s:shard1 r:core_node2 x:forwardingCollection_shard1_replica_n1] o.a.s.h.c.SpellCheckComponent Loading spell index for spellchecker: external
[junit4] 2> 159921 INFO (searcherExecutor-437-thread-1-processing-n:127.0.0.1:42671_solr x:forwardingCollection_shard1_replica_n1 s:shard1 c:forwardingCollection r:core_node2) [n:127.0.0.1:42671_solr c:forwardingCollection s:shard1 r:core_node2 x:forwardingCollection_shard1_replica_n1] o.a.s.h.c.SpellCheckComponent Loading spell index for spellchecker: freq
[junit4] 2> 159922 INFO (searcherExecutor-437-thread-1-processing-n:127.0.0.1:42671_solr x:forwardingCollection_shard1_replica_n1 s:shard1 c:forwardingCollection r:core_node2) [n:127.0.0.1:42671_solr c:forwardingCollection s:shard1 r:core_node2 x:forwardingCollection_shard1_replica_n1] o.a.s.h.c.SpellCheckComponent Loading spell index for spellchecker: fqcn
[junit4] 2> 159922 INFO (searcherExecutor-437-thread-1-processing-n:127.0.0.1:42671_solr x:forwardingCollection_shard1_replica_n1 s:shard1 c:forwardingCollection r:core_node2) [n:127.0.0.1:42671_solr c:forwardingCollection s:shard1 r:core_node2 x:forwardingCollection_shard1_replica_n1] o.a.s.h.c.SpellCheckComponent Loading spell index for spellchecker: perDict
[junit4] 2> 159924 INFO (searcherExecutor-437-thread-1-processing-n:127.0.0.1:42671_solr x:forwardingCollection_shard1_replica_n1 s:shard1 c:forwardingCollection r:core_node2) [n:127.0.0.1:42671_solr c:forwardingCollection s:shard1 r:core_node2 x:forwardingCollection_shard1_replica_n1] o.a.s.c.SolrCore [forwardingCollection_shard1_replica_n1] Registered new searcher Searcher@8dee31[forwardingCollection_shard1_replica_n1] main{ExitableDirectoryReader(UninvertingDirectoryReader())}
[junit4] 2> 159925 INFO (qtp31554950-978) [n:127.0.0.1:42671_solr c:forwardingCollection s:shard1 r:core_node2 x:forwardingCollection_shard1_replica_n1] o.a.s.c.ShardLeaderElectionContext Enough replicas found to continue.
[junit4] 2> 159925 INFO (qtp31554950-978) [n:127.0.0.1:42671_solr c:forwardingCollection s:shard1 r:core_node2 x:forwardingCollection_shard1_replica_n1] o.a.s.c.ShardLeaderElectionContext I may be the new leader - try and sync
[junit4] 2> 159925 INFO (qtp31554950-978) [n:127.0.0.1:42671_solr c:forwardingCollection s:shard1 r:core_node2 x:forwardingCollection_shard1_replica_n1] o.a.s.c.SyncStrategy Sync replicas to http://127.0.0.1:42671/solr/forwardingCollection_shard1_replica_n1/
[junit4] 2> 159925 INFO (qtp31554950-978) [n:127.0.0.1:42671_solr c:forwardingCollection s:shard1 r:core_node2 x:forwardingCollection_shard1_replica_n1] o.a.s.c.SyncStrategy Sync Success - now sync replicas to me
[junit4] 2> 159925 INFO (qtp31554950-978) [n:127.0.0.1:42671_solr c:forwardingCollection s:shard1 r:core_node2 x:forwardingCollection_shard1_replica_n1] o.a.s.c.SyncStrategy http://127.0.0.1:42671/solr/forwardingCollection_shard1_replica_n1/ has no replicas
[junit4] 2> 159925 INFO (qtp31554950-978) [n:127.0.0.1:42671_solr c:forwardingCollection s:shard1 r:core_node2 x:forwardingCollection_shard1_replica_n1] o.a.s.c.ShardLeaderElectionContext Found all replicas participating in election, clear LIR
[junit4] 2> 159928 INFO (qtp31554950-978) [n:127.0.0.1:42671_solr c:forwardingCollection s:shard1 r:core_node2 x:forwardingCollection_shard1_replica_n1] o.a.s.c.ShardLeaderElectionContext I am the new leader: http://127.0.0.1:42671/solr/forwardingCollection_shard1_replica_n1/ shard1
[junit4] 2> 160030 INFO (zkCallback-154-thread-2-processing-n:127.0.0.1:42671_solr) [n:127.0.0.1:42671_solr ] o.a.s.c.c.ZkStateReader A cluster state change: [WatchedEvent state:SyncConnected type:NodeDataChanged path:/collections/forwardingCollection/state.json] for collection [forwardingCollection] has occurred - updating... (live nodes size: [2])
[junit4] 2> 160030 INFO (zkCallback-154-thread-1-processing-n:127.0.0.1:42671_solr) [n:127.0.0.1:42671_solr ] o.a.s.c.c.ZkStateReader A cluster state change: [WatchedEvent state:SyncConnected type:NodeDataChanged path:/collections/forwardingCollection/state.json] for collection [forwardingCollection] has occurred - updating... (live nodes size: [2])
[junit4] 2> 160078 INFO (qtp31554950-978) [n:127.0.0.1:42671_solr c:forwardingCollection s:shard1 r:core_node2 x:forwardingCollection_shard1_replica_n1] o.a.s.c.ZkController I am the leader, no recovery necessary
[junit4] 2> 160079 INFO (qtp31554950-978) [n:127.0.0.1:42671_solr c:forwardingCollection s:shard1 r:core_node2 x:forwardingCollection_shard1_replica_n1] o.a.s.s.HttpSolrCall [admin] webapp=null path=/admin/cores params={qt=/admin/cores&coreNodeName=core_node2&collection.configName=conf1&newCollection=true&name=forwardingCollection_shard1_replica_n1&action=CREATE&numShards=1&collection=forwardingCollection&shard=shard1&wt=javabin&version=2&replicaType=NRT} status=0 QTime=1525
[junit4] 2> 160080 WARN (httpShardExecutor-429-thread-1-processing-n:127.0.0.1:42671_solr [http:////127.0.0.1:42671//solr] http:////127.0.0.1:42671//solr) [n:127.0.0.1:42671_solr ] o.a.h.c.p.ResponseProcessCookies Invalid cookie header: "Set-Cookie: hadoop.auth="u=$&p=$&t=test&e=1505629058873&s=UkF/qv7iywH2g26jU10ByZeWzl4="; Path=/; Domain=127.0.0.1; Expires= , 17- -2017 06:17:38 GMT; HttpOnly". Invalid 'expires' attribute: , 17- -2017 06:17:38 GMT
[junit4] 2> 160083 INFO (qtp31554950-975) [n:127.0.0.1:42671_solr ] o.a.s.h.a.CollectionsHandler Wait for new collection to be active for at most 30 seconds. Check all shard replicas
[junit4] 2> 160183 INFO (zkCallback-154-thread-1-processing-n:127.0.0.1:42671_solr) [n:127.0.0.1:42671_solr ] o.a.s.c.c.ZkStateReader A cluster state change: [WatchedEvent state:SyncConnected type:NodeDataChanged path:/collections/forwardingCollection/state.json] for collection [forwardingCollection] has occurred - updating... (live nodes size: [2])
[junit4] 2> 160183 INFO (zkCallback-154-thread-2-processing-n:127.0.0.1:42671_solr) [n:127.0.0.1:42671_solr ] o.a.s.c.c.ZkStateReader A cluster state change: [WatchedEvent state:SyncConnected type:NodeDataChanged path:/collections/forwardingCollection/state.json] for collection [forwardingCollection] has occurred - updating... (live nodes size: [2])
[junit4] 2> 160247 INFO (OverseerCollectionConfigSetProcessor-98670546608062469-127.0.0.1:42671_solr-n_0000000000) [n:127.0.0.1:42671_solr ] o.a.s.c.OverseerTaskQueue Response ZK path: /overseer/collection-queue-work/qnr-0000000000 doesn't exist. Requestor may have disconnected from ZooKeeper
[junit4] 2> 161083 INFO (qtp31554950-975) [n:127.0.0.1:42671_solr ] o.a.s.s.HttpSolrCall [admin] webapp=null path=/admin/collections params={pullReplicas=0&replicationFactor=1&collection.configName=conf1&maxShardsPerNode=1&name=forwardingCollection&nrtReplicas=1&action=CREATE&numShards=1&tlogReplicas=0&wt=javabin&version=2} status=0 QTime=2838
[junit4] 2> 161084 WARN (TEST-TestSolrCloudWithSecureImpersonation.testForwarding-seed#[AE890F42666FC6DA]) [ ] o.a.h.c.p.ResponseProcessCookies Invalid cookie header: "Set-Cookie: hadoop.auth="u=user&p=user&t=test&e=1505629058564&s=CiOJJOX2vmodX/Gc0uiqPSnG3B4="; Path=/; Domain=127.0.0.1; Expires= , 17- -2017 06:17:38 GMT; HttpOnly". Invalid 'expires' attribute: , 17- -2017 06:17:38 GMT
[junit4] 2> 161084 INFO (TEST-TestSolrCloudWithSecureImpersonation.testForwarding-seed#[AE890F42666FC6DA]) [ ] o.a.s.c.AbstractDistribZkTestBase Wait for recoveries to finish - collection: forwardingCollection failOnTimeout:true timeout (sec):100
[junit4] 2> 161084 INFO (TEST-TestSolrCloudWithSecureImpersonation.testForwarding-seed#[AE890F42666FC6DA]) [ ] o.a.s.c.AbstractDistribZkTestBase Recoveries finished - collection: forwardingCollection
[junit4] 2> 161087 INFO (qtp31554950-969) [n:127.0.0.1:42671_solr c:forwardingCollection s:shard1 r:core_node2 x:forwardingCollection_shard1_replica_n1] o.a.s.c.S.Request [forwardingCollection_shard1_replica_n1] webapp=/solr path=/select params={q=*:*&wt=javabin&version=2} hits=0 status=0 QTime=0
[junit4] 2> 161088 WARN (TEST-TestSolrCloudWithSecureImpersonation.testForwarding-seed#[AE890F42666FC6DA]) [ ] o.a.h.c.p.ResponseProcessCookies Invalid cookie header: "Set-Cookie: hadoop.auth="u=user&p=user&t=test&e=1505629061407&s=3iZm6ElSc91ZStyvRUnEXRZaLOY="; Path=/; Domain=127.0.0.1; Expires= , 17- -2017 06:17:41 GMT; HttpOnly". Invalid 'expires' attribute: , 17- -2017 06:17:41 GMT
[junit4] 2> 161091 INFO (qtp20947124-972) [n:127.0.0.1:46073_solr ] o.a.s.c.TransientSolrCoreCacheDefault Allocating transient cache for 2147483647 transient cores
[junit4] 2> 161094 INFO (qtp31554950-969) [n:127.0.0.1:42671_solr c:forwardingCollection s:shard1 r:core_node2 x:forwardingCollection_shard1_replica_n1] o.a.s.c.S.Request [forwardingCollection_shard1_replica_n1] webapp=/solr path=/select params={q=*:*&wt=javabin&version=2} hits=0 status=0 QTime=0
[junit4] 2> 161094 WARN (qtp20947124-972) [n:127.0.0.1:46073_solr ] o.a.h.c.p.ResponseProcessCookies Invalid cookie header: "Set-Cookie: hadoop.auth="u=$&p=$&t=test&e=1505629061413&s=8aY1VN/46ohuzC78t84tL+y/NY0="; Path=/; Domain=127.0.0.1; Expires= , 17- -2017 06:17:41 GMT; HttpOnly". Invalid 'expires' attribute: , 17- -2017 06:17:41 GMT
[junit4] 2> 161109 WARN (TEST-TestSolrCloudWithSecureImpersonation.testForwarding-seed#[AE890F42666FC6DA]) [ ] o.a.h.c.p.ResponseProcessCookies Invalid cookie header: "Set-Cookie: hadoop.auth="u=user&p=user&t=test&e=1505629061410&s=ptyRoS0VnpT3VAdCY7OFvUYkijI="; Path=/; Domain=127.0.0.1; Expires= , 17- -2017 06:17:41 GMT; HttpOnly". Invalid 'expires' attribute: , 17- -2017 06:17:41 GMT
[junit4] 2> 161109 WARN (TEST-TestSolrCloudWithSecureImpersonation.testForwarding-seed#[AE890F42666FC6DA]) [ ] o.a.h.c.p.ResponseProcessCookies Invalid cookie header: "Set-Cookie: hadoop.auth="u=$&p=$&t=test&e=1505629061413&s=8aY1VN/46ohuzC78t84tL+y/NY0="; Path=/; Domain=127.0.0.1; Expires= , 17- -2017 06:17:41 GMT; HttpOnly". Invalid 'expires' attribute: , 17- -2017 06:17:41 GMT
[junit4] 2> 161109 INFO (TEST-TestSolrCloudWithSecureImpersonation.testForwarding-seed#[AE890F42666FC6DA]) [ ] o.a.s.SolrTestCaseJ4 ###Ending testForwarding
[junit4] 2> 161123 INFO (TEST-TestSolrCloudWithSecureImpersonation.testProxyNoConfigGroups-seed#[AE890F42666FC6DA]) [ ] o.a.s.SolrTestCaseJ4 ###Starting testProxyNoConfigGroups
[junit4] 2> 161130 WARN (TEST-TestSolrCloudWithSecureImpersonation.testProxyNoConfigGroups-seed#[AE890F42666FC6DA]) [ ] o.a.h.c.p.ResponseProcessCookies Invalid cookie header: "Set-Cookie: hadoop.auth="u=noGroups&p=noGroups&t=test&e=1505629061445&s=NQj/N8IbchE95dAX/jwoM1f2ATQ="; Path=/; Domain=127.0.0.1; Expires= , 17- -2017 06:17:41 GMT; HttpOnly". Invalid 'expires' attribute: , 17- -2017 06:17:41 GMT
[junit4] 2> 161130 INFO (TEST-TestSolrCloudWithSecureImpersonation.testProxyNoConfigGroups-seed#[AE890F42666FC6DA]) [ ] o.a.s.SolrTestCaseJ4 ###Ending testProxyNoConfigGroups
[junit4] 2> 161143 INFO (TEST-TestSolrCloudWithSecureImpersonation.testProxyWrongHost-seed#[AE890F42666FC6DA]) [ ] o.a.s.SolrTestCaseJ4 ###Starting testProxyWrongHost
[junit4] 2> 161153 WARN (TEST-TestSolrCloudWithSecureImpersonation.testProxyWrongHost-seed#[AE890F42666FC6DA]) [ ] o.a.h.c.p.ResponseProcessCookies Invalid cookie header: "Set-Cookie: hadoop.auth="u=wrongHost&p=wrongHost&t=test&e=1505629061463&s=qcKQrOCtPs5z51nGLTI9Rv3Dluo="; Path=/; Domain=127.0.0.1; Expires= , 17- -2017 06:17:41 GMT; HttpOnly". Invalid 'expires' attribute: , 17- -2017 06:17:41 GMT
[junit4] 2> 161153 INFO (TEST-TestSolrCloudWithSecureImpersonation.testProxyWrongHost-seed#[AE890F42666FC6DA]) [ ] o.a.s.SolrTestCaseJ4 ###Ending testProxyWrongHost
[junit4] 2> 161166 INFO (TEST-TestSolrCloudWithSecureImpersonation.testProxyInvalidRemote-seed#[AE890F42666FC6DA]) [ ] o.a.s.SolrTestCaseJ4 ###Starting testProxyInvalidRemote
[junit4] 2> 161173 WARN (TEST-TestSolrCloudWithSecureImpersonation.testProxyInvalidRemote-seed#[AE890F42666FC6DA]) [ ] o.a.h.c.p.ResponseProcessCookies Invalid cookie header: "Set-Cookie: hadoop.auth="u=localHostAnyGroup&p=localHostAnyGroup&t=test&e=1505629061487&s=FCkL+iWIw1efO2cIq4akbbD8aRU="; Path=/; Domain=127.0.0.1; Expires= , 17- -2017 06:17:41 GMT; HttpOnly". Invalid 'expires' attribute: , 17- -2017 06:17:41 GMT
[junit4] 2> 161173 INFO (TEST-TestSolrCloudWithSecureImpersonation.testProxyInvalidRemote-seed#[AE890F42666FC6DA]) [ ] o.a.s.SolrTestCaseJ4 ###Ending testProxyInvalidRemote
[junit4] 2> 161184 INFO (TEST-TestSolrCloudWithSecureImpersonation.testProxyUnknownRemote-seed#[AE890F42666FC6DA]) [ ] o.a.s.SolrTestCaseJ4 ###Starting testProxyUnknownRemote
[junit4] 2> 176336 WARN (TEST-TestSolrCloudWithSecureImpersonation.testForwarding-seed#[AE890F42666FC6DA]-SendThread(127.0.0.1:41063)) [ ] o.a.z.ClientCnxn Client session timed out, have not heard from server in 15252ms for sessionid 0x15e8c56e05e000b
[junit4] 2> 176336 WARN (jetty-launcher-142-thread-1-SendThread(127.0.0.1:41063)) [n:127.0.0.1:46073_solr ] o.a.z.ClientCnxn Client session timed out, have not heard from server in 15245ms for sessionid 0x15e8c56e05e0006
[junit4] 2> 176336 WARN (jetty-launcher-142-thread-2-SendThread(127.0.0.1:41063)) [n:127.0.0.1:42671_solr ] o.a.z.ClientCnxn Client session timed out, have not heard from server in 16088ms for sessionid 0x15e8c56e05e0005
[junit4] 2> 176337 WARN (NIOServerCxn.Factory:0.0.0.0/0.0.0.0:0) [ ] o.a.z.s.NIOServerCnxn caught end of stream exception
[junit4] 2> EndOfStreamException: Unable to read additional data from client sessionid 0x15e8c56e05e0006, likely client has closed socket
[junit4] 2> at org.apache.zookeeper.server.NIOServerCnxn.doIO(NIOServerCnxn.java:239)
[junit4] 2> at org.apache.zookeeper.server.NIOServerCnxnFactory.run(NIOServerCnxnFactory.java:203)
[junit4] 2> at java.lang.Thread.run(Thread.java:748)
[junit4] 2> 176337 WARN (NIOServerCxn.Factory:0.0.0.0/0.0.0.0:0) [ ] o.a.z.s.NIOServerCnxn caught end of stream exception
[junit4] 2> EndOfStreamException: Unable to read additional data from client sessionid 0x15e8c56e05e0005, likely client has closed socket
[junit4] 2> at org.apache.zookeeper.server.NIOServerCnxn.doIO(NIOServerCnxn.java:239)
[junit4] 2> at org.apache.zookeeper.server.NIOServerCnxnFactory.run(NIOServerCnxnFactory.java:203)
[junit4] 2> at java.lang.Thread.run(Thread.java:748)
[junit4] 2> 176336 WARN (jetty-launcher-142-thread-2-SendThread(127.0.0.1:41063)) [n:127.0.0.1:42671_solr ] o.a.z.ClientCnxn Client session timed out, have not heard from server in 18794ms for sessionid 0x15e8c56e05e0008
[junit4] 2> 176336 WARN (jetty-launcher-142-thread-1-SendThread(127.0.0.1:41063)) [n:127.0.0.1:46073_solr ] o.a.z.ClientCnxn Client session timed out, have not heard from server in 18794ms for sessionid 0x15e8c56e05e0007
[junit4] 2> 176337 WARN (NIOServerCxn.Factory:0.0.0.0/0.0.0.0:0) [ ] o.a.z.s.NIOServerCnxn caught end of stream exception
[junit4] 2> EndOfStreamException: Unable to read additional data from client sessionid 0x15e8c56e05e0008, likely client has closed socket
[junit4] 2> at org.apache.zookeeper.server.NIOServerCnxn.doIO(NIOServerCnxn.java:239)
[junit4] 2> at org.apache.zookeeper.server.NIOServerCnxnFactory.run(NIOServerCnxnFactory.java:203)
[junit4] 2> at java.lang.Thread.run(Thread.java:748)
[junit4] 2> 176337 WARN (NIOServerCxn.Factory:0.0.0.0/0.0.0.0:0) [ ] o.a.z.s.NIOServerCnxn caught end of stream exception
[junit4] 2> EndOfStreamException: Unable to read additional data from client sessionid 0x15e8c56e05e0007, likely client has closed socket
[junit4] 2> at org.apache.zookeeper.server.NIOServerCnxn.doIO(NIOServerCnxn.java:239)
[junit4] 2> at org.apache.zookeeper.server.NIOServerCnxnFactory.run(NIOServerCnxnFactory.java:203)
[junit4] 2> at java.lang.Thread.run(Thread.java:748)
[junit4] 2> 176338 WARN (TEST-TestSolrCloudWithSecureImpersonation.testProxyUnknownRemote-seed#[AE890F42666FC6DA]) [ ] o.a.h.c.p.ResponseProcessCookies Invalid cookie header: "Set-Cookie: hadoop.auth="u=localHostAnyGroup&p=localHostAnyGroup&t=test&e=1505629061505&s=CHABYb2lj1YLUbBc7nXXWj7yIS0="; Path=/; Domain=127.0.0.1; Expires= , 17- -2017 06:17:41 GMT; HttpOnly". Invalid 'expires' attribute: , 17- -2017 06:17:41 GMT
[junit4] 2> 176339 INFO (TEST-TestSolrCloudWithSecureImpersonation.testProxyUnknownRemote-seed#[AE890F42666FC6DA]) [ ] o.a.s.SolrTestCaseJ4 ###Ending testProxyUnknownRemote
[junit4] 2> 176348 INFO (TEST-TestSolrCloudWithSecureImpersonation.testProxyNullProxyUser-seed#[AE890F42666FC6DA]) [ ] o.a.s.SolrTestCaseJ4 ###Starting testProxyNullProxyUser
[junit4] 2> 176349 INFO (qtp31554950-965) [ ] o.a.s.s.SolrDispatchFilter Error authenticating
[junit4] 2> java.lang.IllegalArgumentException: userName is NULL, empty or contains a '&'
[junit4] 2> at org.apache.hadoop.security.authentication.util.AuthToken.checkForIllegalArgument(AuthToken.java:87)
[junit4] 2> at org.apache.hadoop.security.authentication.util.AuthToken.<init>(AuthToken.java:70)
[junit4] 2> at org.apache.hadoop.security.authentication.server.AuthenticationToken.<init>(AuthenticationToken.java:58)
[junit4] 2> at org.apache.solr.security.HttpParamDelegationTokenPlugin$HttpParamDelegationTokenAuthenticationHandler$HttpParamAuthenticationHandler.authenticate(HttpParamDelegationTokenPlugin.java:213)
[junit4] 2> at org.apache.hadoop.security.token.delegation.web.DelegationTokenAuthenticationHandler.authenticate(DelegationTokenAuthenticationHandler.java:348)
[junit4] 2> at org.apache.solr.security.RequestContinuesRecorderAuthenticationHandler.authenticate(RequestContinuesRecorderAuthenticationHandler.java:69)
[junit4] 2> at org.apache.hadoop.security.authentication.server.AuthenticationFilter.doFilter(AuthenticationFilter.java:518)
[junit4] 2> at org.apache.solr.security.DelegationTokenKerberosFilter.doFilter(DelegationTokenKerberosFilter.java:134)
[junit4] 2> at org.apache.solr.security.HttpParamDelegationTokenPlugin$HttpParamToRequestFilter.doFilter(HttpParamDelegationTokenPlugin.java:245)
[junit4] 2> at org.apache.solr.security.KerberosPlugin.doAuthenticate(KerberosPlugin.java:243)
[junit4] 2> at org.apache.solr.servlet.SolrDispatchFilter.authenticateRequest(SolrDispatchFilter.java:451)
[junit4] 2> at org.apache.solr.servlet.SolrDispatchFilter.doFilter(SolrDispatchFilter.java:347)
[junit4] 2> at org.apache.solr.servlet.SolrDispatchFilter.doFilter(SolrDispatchFilter.java:326)
[junit4] 2> at org.eclipse.jetty.servlet.ServletHandler$CachedChain.doFilter(ServletHandler.java:1759)
[junit4] 2> at org.apache.solr.client.solrj.embedded.JettySolrRunner$DebugFilter.doFilter(JettySolrRunner.java:139)
[junit4] 2> at org.eclipse.jetty.servlet.ServletHandler$CachedChain.doFilter(ServletHandler.java:1759)
[junit4] 2> at org.eclipse.jetty.servlet.ServletHandler.doHandle(ServletHandler.java:582)
[junit4] 2> at org.eclipse.jetty.server.session.SessionHandler.doHandle(SessionHandler.java:224)
[junit4] 2> at org.eclipse.jetty.server.handler.ContextHandler.doHandle(ContextHandler.java:1180)
[junit4] 2> at org.eclipse.jetty.servlet.ServletHandler.doScope(ServletHandler.java:512)
[junit4] 2> at org.eclipse.jetty.server.session.SessionHandler.doScope(SessionHandler.java:185)
[junit4] 2> at org.eclipse.jetty.server.handler.ContextHandler.doScope(ContextHandler.java:1112)
[junit4] 2> at org.eclipse.jetty.server.handler.ScopedHandler.handle(ScopedHandler.java:141)
[junit4] 2> at org.eclipse.jetty.server.handler.gzip.GzipHandler.handle(GzipHandler.java:493)
[junit4] 2> at org.eclipse.jetty.server.handler.HandlerWrapper.handle(HandlerWrapper.java:134)
[junit4] 2> at org.eclipse.jetty.server.Server.handle(Server.java:534)
[junit4] 2> at org.eclipse.jetty.server.HttpChannel.handle(HttpChannel.java:320)
[junit4] 2> at org.eclipse.jetty.server.HttpConnection.onFillable(HttpConnection.java:251)
[junit4] 2> at org.eclipse.jetty.io.AbstractConnection$ReadCallback.succeeded(AbstractConnection.java:283)
[junit4] 2> at org.eclipse.jetty.io.FillInterest.fillable(FillInterest.java:108)
[junit4] 2> at org.eclipse.jetty.io.SelectChannelEndPoint$2.run(SelectChannelEndPoint.java:93)
[junit4] 2> at org.eclipse.jetty.util.thread.strategy.ExecuteProduceConsume.executeProduceConsume(ExecuteProduceConsume.java:303)
[junit4] 2> at org.eclipse.jetty.util.thread.strategy.ExecuteProduceConsume.produceConsume(ExecuteProduceConsume.java:148)
[junit4] 2> at org.eclipse.jetty.util.thread.strategy.ExecuteProduceConsume.run(ExecuteProduceConsume.java:136)
[junit4] 2> at org.eclipse.jetty.util.thread.QueuedThreadPool.runJob(QueuedThreadPool.java:671)
[junit4] 2> at org.eclipse.jetty.util.thread.QueuedThreadPool$2.run(QueuedThreadPool.java:589)
[junit4] 2> at java.lang.Thread.run(Thread.java:748)
[junit4] 2> 176349 WARN (qtp31554950-965) [ ] o.e.j.s.ServletHandler /solr/admin/collections
[junit4] 2> org.apache.solr.common.SolrException: Error during request authentication,
[junit4] 2> at org.apache.solr.servlet.SolrDispatchFilter.authenticateRequest(SolrDispatchFilter.java:457)
[junit4] 2> at org.apache.solr.servlet.SolrDispatchFilter.doFilter(SolrDispatchFilter.java:347)
[junit4] 2> at org.apache.solr.servlet.SolrDispatchFilter.doFilter(SolrDispatchFilter.java:326)
[junit4] 2> at org.eclipse.jetty.servlet.ServletHandler$CachedChain.doFilter(ServletHandler.java:1759)
[junit4] 2> at org.apache.solr.client.solrj.embedded.JettySolrRunner$DebugFilter.doFilter(JettySolrRunner.java:139)
[junit4] 2> at org.eclipse.jetty.servlet.ServletHandler$CachedChain.doFilter(ServletHandler.java:1759)
[junit4] 2> at org.eclipse.jetty.servlet.ServletHandler.doHandle(ServletHandler.java:582)
[junit4] 2> at org.eclipse.jetty.server.session.SessionHandler.doHandle(SessionHandler.java:224)
[junit4] 2> at org.eclipse.jetty.server.handler.ContextHandler.doHandle(ContextHandler.java:1180)
[junit4] 2> at org.eclipse.jetty.servlet.ServletHandler.doScope(ServletHandler.java:512)
[junit4] 2> at org.eclipse.jetty.server.session.SessionHandler.doScope(SessionHandler.java:185)
[junit4] 2> at org.eclipse.jetty.server.handler.ContextHandler.doScope(ContextHandler.java:1112)
[junit4] 2> at org.eclipse.jetty.server.handler.ScopedHandler.handle(ScopedHandler.java:141)
[junit4] 2> at org.eclipse.jetty.server.handler.gzip.GzipHandler.handle(GzipHandler.java:493)
[junit4] 2> at org.eclipse.jetty.server.handler.HandlerWrapper.handle(HandlerWrapper.java:134)
[junit4] 2> at org.eclipse.jetty.server.Server.handle(Server.java:534)
[junit4] 2> at org.eclipse.jetty.server.HttpChannel.handle(HttpChannel.java:320)
[junit4] 2> at org.eclipse.jetty.server.HttpConnection.onFillable(HttpConnection.java:251)
[junit4] 2> at org.eclipse.jetty.io.AbstractConnection$ReadCallback.succeeded(AbstractConnection.java:283)
[junit4] 2> at org.eclipse.jetty.io.FillInterest.fillable(FillInterest.java:108)
[junit4] 2> at org.eclipse.jetty.io.SelectChannelEndPoint$2.run(SelectChannelEndPoint.java:93)
[junit4] 2> at org.eclipse.jetty.util.thread.strategy.ExecuteProduceConsume.executeProduceConsume(ExecuteProduceConsume.java:303)
[junit4] 2> at org.eclipse.jetty.util.thread.strategy.ExecuteProduceConsume.produceConsume(ExecuteProduceConsume.java:148)
[junit4] 2> at org.eclipse.jetty.util.thread.strategy.ExecuteProduceConsume.run(ExecuteProduceConsume.java:136)
[junit4] 2> at org.eclipse.jetty.util.thread.QueuedThreadPool.runJob(QueuedThreadPool.java:671)
[junit4] 2> at org.eclipse.jetty.util.thread.QueuedThreadPool$2.run(QueuedThreadPool.java:589)
[junit4] 2> at java.lang.Thread.run(Thread.java:748)
[junit4] 2> Caused by: java.lang.IllegalArgumentException: userName is NULL, empty or contains a '&'
[junit4] 2> at org.apache.hadoop.security.authentication.util.AuthToken.checkForIllegalArgument(AuthToken.java:87)
[junit4] 2> at org.apache.hadoop.security.authentication.util.AuthToken.<init>(AuthToken.java:70)
[junit4] 2> at org.apache.hadoop.security.authentication.server.AuthenticationToken.<init>(AuthenticationToken.java:58)
[junit4] 2> at org.apache.solr.security.HttpParamDelegationTokenPlugin$HttpParamDelegationTokenAuthenticationHandler$HttpParamAuthenticationHandler.authenticate(HttpParamDelegationTokenPlugin.java:213)
[junit4] 2> at org.apache.hadoop.security.token.delegation.web.DelegationTokenAuthenticationHandler.authenticate(DelegationTokenAuthenticationHandler.java:348)
[junit4] 2> at org.apache.solr.security.RequestContinuesRecorderAuthenticationHandler.authenticate(RequestContinuesRecorderAuthenticationHandler.java:69)
[junit4] 2> at org.apache.hadoop.security.authentication.server.AuthenticationFilter.doFilter(AuthenticationFilter.java:518)
[junit4] 2> at org.apache.solr.security.DelegationTokenKerberosFilter.doFilter(DelegationTokenKerberosFilter.java:134)
[junit4] 2> at org.apache.solr.security.HttpParamDelegationTokenPlugin$HttpParamToRequestFilter.doFilter(HttpParamDelegationTokenPlugin.java:245)
[junit4] 2> at org.apache.solr.security.KerberosPlugin.doAuthenticate(KerberosPlugin.java:243)
[junit4] 2> at org.apache.solr.servlet.SolrDispatchFilter.authenticateRequest(SolrDispatchFilter.java:451)
[junit4] 2> ... 26 more
[junit4] 2> 176352 INFO (TEST-TestSolrCloudWithSecureImpersonation.testProxyNullProxyUser-seed#[AE890F42666FC6DA]) [ ] o.a.s.SolrTestCaseJ4 ###Ending testProxyNullProxyUser
[junit4] 2> 176360 INFO (TEST-TestSolrCloudWithSecureImpersonation.testProxyInvalidGroup-seed#[AE890F42666FC6DA]) [ ] o.a.s.SolrTestCaseJ4 ###Starting testProxyInvalidGroup
[junit4] 2> 176366 WARN (qtp31554950-969) [n:127.0.0.1:42671_solr c:forwardingCollection s:shard1 r:core_node2 x:forwardingCollection_shard1_replica_n1] o.a.h.s.ShellBasedUnixGroupsMapping got exception trying to get groups for user bar: id: âbarâ: no such user
[junit4] 2> id: âbarâ: no such user
[junit4] 2>
[junit4] 2> 176368 WARN (TEST-TestSolrCloudWithSecureImpersonation.testProxyInvalidGroup-seed#[AE890F42666FC6DA]) [ ] o.a.h.c.p.ResponseProcessCookies Invalid cookie header: "Set-Cookie: hadoop.auth="u=bogusGroup&p=bogusGroup&t=test&e=1505629076681&s=jrKq/XXtzHXkbOp+QxC6OLTEW0Y="; Path=/; Domain=127.0.0.1; Expires= , 17- -2017 06:17:56 GMT; HttpOnly". Invalid 'expires' attribute: , 17- -2017 06:17:56 GMT
[junit4] 2> 176368 INFO (TEST-TestSolrCloudWithSecureImpersonation.testProxyInvalidGroup-seed#[AE890F42666FC6DA]) [ ] o.a.s.SolrTestCaseJ4 ###Ending testProxyInvalidGroup
[junit4] 2> 176376 INFO (TEST-TestSolrCloudWithSecureImpersonation.testProxyNoConfigHosts-seed#[AE890F42666FC6DA]) [ ] o.a.s.SolrTestCaseJ4 ###Starting testProxyNoConfigHosts
[junit4] 2> 176379 WARN (TEST-TestSolrCloudWithSecureImpersonation.testProxyNoConfigHosts-seed#[AE890F42666FC6DA]) [ ] o.a.h.c.p.ResponseProcessCookies Invalid cookie header: "Set-Cookie: hadoop.auth="u=noHosts&p=noHosts&t=test&e=1505629076697&s=BCnNpXAQfFXsPDoLZC0QFIUoYjU="; Path=/; Domain=127.0.0.1; Expires= , 17- -2017 06:17:56 GMT; HttpOnly". Invalid 'expires' attribute: , 17- -2017 06:17:56 GMT
[junit4] 2> 176379 INFO (TEST-TestSolrCloudWithSecureImpersonation.testProxyNoConfigHosts-seed#[AE890F42666FC6DA]) [ ] o.a.s.SolrTestCaseJ4 ###Ending testProxyNoConfigHosts
[junit4] 2> 176389 INFO (TEST-TestSolrCloudWithSecureImpersonation.testProxyValidateHost-seed#[AE890F42666FC6DA]) [ ] o.a.s.SolrTestCaseJ4 ###Starting testProxyValidateHost
[junit4] 2> 176390 INFO (qtp31554950-975) [n:127.0.0.1:42671_solr ] o.a.s.h.a.CollectionsHandler Invoked Collection Action :list with params doAs=bar&action=LIST&wt=javabin&version=2 and sendToOCPQueue=true
[junit4] 2> 176390 INFO (qtp31554950-975) [n:127.0.0.1:42671_solr ] o.a.s.s.HttpSolrCall [admin] webapp=null path=/admin/collections params={doAs=bar&action=LIST&wt=javabin&version=2} status=0 QTime=0
[junit4] 2> 176390 WARN (TEST-TestSolrCloudWithSecureImpersonation.testProxyValidateHost-seed#[AE890F42666FC6DA]) [ ] o.a.h.c.p.ResponseProcessCookies Invalid cookie header: "Set-Cookie: hadoop.auth="u=localHostAnyGroup&p=localHostAnyGroup&t=test&e=1505629076709&s=+oxHx4CXI4fgrkB+olVa+5IWdCg="; Path=/; Domain=127.0.0.1; Expires= , 17- -2017 06:17:56 GMT; HttpOnly". Invalid 'expires' attribute: , 17- -2017 06:17:56 GMT
[junit4] 2> 176390 INFO (TEST-TestSolrCloudWithSecureImpersonation.testProxyValidateHost-seed#[AE890F42666FC6DA]) [ ] o.a.s.SolrTestCaseJ4 ###Ending testProxyValidateHost
[junit4] 2> 176437 WARN (zkCallback-153-thread-1-processing-n:127.0.0.1:46073_solr) [n:127.0.0.1:46073_solr ] o.a.s.c.c.ConnectionManager Watcher org.apache.solr.common.cloud.ConnectionManager@16112ce name: ZooKeeperConnection Watcher:127.0.0.1:41063/solr got event WatchedEvent state:Disconnected type:None path:null path: null type: None
[junit4] 2> 176437 WARN (zkCallback-153-thread-1-processing-n:127.0.0.1:46073_solr) [n:127.0.0.1:46073_solr ] o.a.s.c.c.ConnectionManager zkClient has disconnected
[junit4] 2> 176437 WARN (zkCallback-154-thread-2-processing-n:127.0.0.1:42671_solr) [n:127.0.0.1:42671_solr ] o.a.s.c.c.ConnectionManager Watcher org.apache.solr.common.cloud.ConnectionManager@10590a0 name: ZooKeeperConnection Watcher:127.0.0.1:41063/solr got event WatchedEvent state:Disconnected type:None path:null path: null type: None
[junit4] 2> 176437 WARN (zkCallback-154-thread-2-processing-n:127.0.0.1:42671_solr) [n:127.0.0.1:42671_solr ] o.a.s.c.c.ConnectionManager zkClient has disconnected
[junit4] 2> 176440 INFO (jetty-closer-143-thread-1) [ ] o.e.j.s.AbstractConnector Stopped ServerConnector@e2f51e{HTTP/1.1,[http/1.1]}{127.0.0.1:0}
[junit4] 2> 176440 INFO (jetty-closer-143-thread-2) [ ] o.e.j.s.AbstractConnector Stopped ServerConnector@d12f26{HTTP/1.1,[http/1.1]}{127.0.0.1:0}
[junit4] 2> 176441 INFO (jetty-closer-143-thread-1) [ ] o.a.s.c.CoreContainer Shutting down CoreContainer instance=25927552
[junit4] 2> 176441 INFO (jetty-closer-143-thread-2) [ ] o.a.s.c.CoreContainer Shutting down CoreContainer instance=17844290
[junit4] 2> 176441 INFO (jetty-closer-143-thread-1) [ ] o.a.s.m.SolrMetricManager Closing metric reporters for registry=solr.node, tag=null
[junit4] 2> 176441 INFO (jetty-closer-143-thread-2) [ ] o.a.s.m.SolrMetricManager Closing metric reporters for registry=solr.node, tag=null
[junit4] 2> 176441 INFO (jetty-closer-143-thread-1) [ ] o.a.s.m.r.SolrJmxReporter Closing reporter [org.apache.solr.metrics.reporters.SolrJmxReporter@1343b2d: rootName = solr_42671, domain = solr.node, service url = null, agent id = null] for registry solr.node / com.codahale.metrics.MetricRegistry@fa551d
[junit4] 2> 176441 INFO (jetty-closer-143-thread-2) [ ] o.a.s.m.r.SolrJmxReporter Closing reporter [org.apache.solr.metrics.reporters.SolrJmxReporter@126632e: rootName = solr_46073, domain = solr.node, service url = null, agent id = null] for registry solr.node / com.codahale.metrics.MetricRegistry@a4fcbc
[junit4] 2> 176447 INFO (jetty-closer-143-thread-1) [ ] o.a.s.m.SolrMetricManager Closing metric reporters for registry=solr.jvm, tag=null
[junit4] 2> 176447 INFO (jetty-closer-143-thread-1) [ ] o.a.s.m.r.SolrJmxReporter Closing reporter [org.apache.solr.metrics.reporters.SolrJmxReporter@86093c: rootName = solr_42671, domain = solr.jvm, service url = null, agent id = null] for registry solr.jvm / com.codahale.metrics.MetricRegistry@3da732
[junit4] 2> 176448 INFO (jetty-closer-143-thread-2) [ ] o.a.s.m.SolrMetricManager Closing metric reporters for registry=solr.jvm, tag=null
[junit4] 2> 176448 INFO (jetty-closer-143-thread-2) [ ] o.a.s.m.r.SolrJmxReporter Closing reporter [org.apache.solr.metrics.reporters.SolrJmxReporter@1080e51: rootName = solr_46073, domain = solr.jvm, service url = null, agent id = null] for registry solr.jvm / com.codahale.metrics.MetricRegistry@3da732
[junit4] 2> 176452 INFO (jetty-closer-143-thread-1) [ ] o.a.s.m.SolrMetricManager Closing metric reporters for registry=solr.jetty, tag=null
[junit4] 2> 176452 INFO (jetty-closer-143-thread-1) [ ] o.a.s.m.r.SolrJmxReporter Closing reporter [org.apache.solr.metrics.reporters.SolrJmxReporter@1bae850: rootName = solr_42671, domain = solr.jetty, service url = null, agent id = null] for registry solr.jetty / com.codahale.metrics.MetricRegistry@d5f680
[junit4] 2> 176454 INFO (jetty-closer-143-thread-2) [ ] o.a.s.m.SolrMetricManager Closing metric reporters for registry=solr.jetty, tag=null
[junit4] 2> 176454 INFO (jetty-closer-143-thread-2) [ ] o.a.s.m.r.SolrJmxReporter Closing reporter [org.apache.solr.metrics.reporters.SolrJmxReporter@70ed8a: rootName = solr_46073, domain = solr.jetty, service url = null, agent id = null] for registry solr.jetty / com.codahale.metrics.MetricRegistry@d5f680
[junit4] 2> 177471 INFO (jetty-closer-143-thread-1) [ ] o.a.s.m.SolrMetricManager Closing metric reporters for registry=solr.cluster, tag=null
[junit4] 2> 177471 INFO (coreCloseExecutor-442-thread-1) [n:127.0.0.1:42671_solr c:forwardingCollection s:shard1 r:core_node2 x:forwardingCollection_shard1_replica_n1] o.a.s.c.SolrCore [forwardingCollection_shard1_replica_n1] CLOSING SolrCore org.apache.solr.core.SolrCore@18b5a86
[junit4] 2> 177471 INFO (coreCloseExecutor-442-thread-1) [n:127.0.0.1:42671_solr c:forwardingCollection s:shard1 r:core_node2 x:forwardingCollection_shard1_replica_n1] o.a.s.m.SolrMetricManager Closing metric reporters for registry=solr.core.forwardingCollection.shard1.replica_n1, tag=25909894
[junit4] 2> 177471 INFO (coreCloseExecutor-442-thread-1) [n:127.0.0.1:42671_solr c:forwardingCollection s:shard1 r:core_node2 x:forwardingCollection_shard1_replica_n1] o.a.s.m.r.SolrJmxReporter Closing reporter [org.apache.solr.metrics.reporters.SolrJmxReporter@e06e23: rootName = solr_42671, domain = solr.core.forwardingCollection.shard1.replica_n1, service url = null, agent id = null] for registry solr.core.forwardingCollection.shard1.replica_n1 / com.codahale.metrics.MetricRegistry@bbb685
[junit4] 2> 177473 INFO (zkCallback-154-thread-3-processing-n:127.0.0.1:42671_solr) [n:127.0.0.1:42671_solr ] o.a.s.c.c.ZkStateReader A cluster state change: [WatchedEvent state:SyncConnected type:NodeDataChanged path:/collections/forwardingCollection/state.json] for collection [forwardingCollection] has occurred - updating... (live nodes size: [2])
[junit4] 2> 177473 INFO (zkCallback-154-thread-1-processing-n:127.0.0.1:42671_solr) [n:127.0.0.1:42671_solr ] o.a.s.c.c.ZkStateReader A cluster state change: [WatchedEvent state:SyncConnected type:NodeDataChanged path:/collections/forwardingCollection/state.json] for collection [forwardingCollection] has occurred - updating... (live nodes size: [2])
[junit4] 2> 177494 INFO (coreCloseExecutor-442-thread-1) [n:127.0.0.1:42671_solr c:forwardingCollection s:shard1 r:core_node2 x:forwardingCollection_shard1_replica_n1] o.a.s.m.SolrMetricManager Closing metric reporters for registry=solr.collection.forwardingCollection.shard1.leader, tag=25909894
[junit4] 2> 177496 INFO (jetty-closer-143-thread-1) [ ] o.a.s.c.Overseer Overseer (id=98670546608062469-127.0.0.1:42671_solr-n_0000000000) closing
[junit4] 2> 177497 INFO (OverseerStateUpdate-98670546608062469-127.0.0.1:42671_solr-n_0000000000) [n:127.0.0.1:42671_solr ] o.a.s.c.Overseer Overseer Loop exiting : 127.0.0.1:42671_solr
[junit4] 2> 177497 INFO (OverseerCollectionConfigSetProcessor-98670546608062469-127.0.0.1:42671_solr-n_0000000000) [n:127.0.0.1:42671_solr ] o.a.s.c.OverseerTaskProcessor According to ZK I (id=98670546608062469-127.0.0.1:42671_solr-n_0000000000) am no longer a leader.
[junit4] 2> 177498 ERROR (Thread[Thread-301,5,TGRP-TestSolrCloudWithSecureImpersonation]) [n:127.0.0.1:42671_solr ] o.a.h.s.t.d.AbstractDelegationTokenSecretManager ExpiredTokenRemover received java.lang.InterruptedException: sleep interrupted
[junit4] 2> 178167 WARN (jetty-launcher-142-thread-1-SendThread(127.0.0.1:41063)) [n:127.0.0.1:46073_solr ] o.a.z.ClientCnxn Unable to reconnect to ZooKeeper service, session 0x15e8c56e05e0007 has expired
[junit4] 2> 178237 INFO (zkCallback-153-thread-5-processing-n:127.0.0.1:46073_solr) [n:127.0.0.1:46073_solr ] o.a.s.c.OverseerElectionContext I am going to be the leader 127.0.0.1:46073_solr
[junit4] 2> 178237 INFO (zkCallback-153-thread-3-processing-n:127.0.0.1:46073_solr) [n:127.0.0.1:46073_solr ] o.a.s.c.c.ZkStateReader Updated live nodes from ZooKeeper... (2) -> (1)
[junit4] 2> 178237 INFO (jetty-closer-143-thread-2) [ ] o.a.s.m.SolrMetricManager Closing metric reporters for registry=solr.cluster, tag=null
[junit4] 2> 178291 WARN (jetty-launcher-142-thread-2-SendThread(127.0.0.1:41063)) [n:127.0.0.1:42671_solr ] o.a.z.ClientCnxn Unable to reconnect to ZooKeeper service, session 0x15e8c56e05e0008 has expired
[junit4] 2> 178392 INFO (jetty-closer-143-thread-1) [ ] o.e.j.s.h.ContextHandler Stopped o.e.j.s.ServletContextHandler@e8e56{/solr,null,UNAVAILABLE}
[junit4] 2> 179738 WARN (zkCallback-153-thread-5-processing-n:127.0.0.1:46073_solr) [n:127.0.0.1:46073_solr ] o.a.s.c.c.ZkStateReader ZooKeeper watch triggered, but Solr cannot talk to ZK: [KeeperErrorCode = Session expired for /live_nodes]
[junit4] 2> 179738 ERROR (Thread[Thread-303,5,TGRP-TestSolrCloudWithSecureImpersonation]) [n:127.0.0.1:46073_solr ] o.a.h.s.t.d.AbstractDelegationTokenSecretManager ExpiredTokenRemover received java.lang.InterruptedException: sleep interrupted
[junit4] 2> 179739 INFO (jetty-closer-143-thread-2) [ ] o.e.j.s.h.ContextHandler Stopped o.e.j.s.ServletContextHandler@1647b11{/solr,null,UNAVAILABLE}
[junit4] 2> 179740 ERROR (SUITE-TestSolrCloudWithSecureImpersonation-seed#[AE890F42666FC6DA]-worker) [ ] o.a.z.s.ZooKeeperServer ZKShutdownHandler is not registered, so ZooKeeper server won't take any action on ERROR or SHUTDOWN server state changes
[junit4] 2> 179740 INFO (SUITE-TestSolrCloudWithSecureImpersonation-seed#[AE890F42666FC6DA]-worker) [ ] o.a.s.c.ZkTestServer connecting to 127.0.0.1:41063 41063
[junit4] 2> 179797 INFO (Thread-284) [ ] o.a.s.c.ZkTestServer connecting to 127.0.0.1:41063 41063
[junit4] 2> 179797 WARN (Thread-284) [ ] o.a.s.c.ZkTestServer Watch limit violations:
[junit4] 2> Maximum concurrent create/delete watches above limit:
[junit4] 2>
[junit4] 2> 3 /solr/aliases.json
[junit4] 2> 3 /solr/clusterprops.json
[junit4] 2> 2 /solr/security.json
[junit4] 2>
[junit4] 2> Maximum concurrent data watches above limit:
[junit4] 2>
[junit4] 2> 6 /solr/collections/forwardingCollection/state.json
[junit4] 2> 4 /solr/security/zkdtsm/ZKDTSMRoot/ZKDTSMKeyIdRoot
[junit4] 2> 3 /solr/clusterstate.json
[junit4] 2> 2 /solr/security/zkdtsm/ZKDTSMRoot/ZKDTSMMasterKeyRoot/DK_1
[junit4] 2> 2 /solr/security/zkdtsm/ZKDTSMRoot/ZKDTSMMasterKeyRoot/DK_3
[junit4] 2> 2 /solr/security/zkdtsm/ZKDTSMRoot/ZKDTSMMasterKeyRoot/DK_2
[junit4] 2> 2 /solr/security/zkdtsm/ZKDTSMRoot/ZKDTSMMasterKeyRoot/DK_4
[junit4] 2> 2 /solr/security/zkdtsm/ZKDTSMRoot/ZKDTSMSeqNumRoot
[junit4] 2>
[junit4] 2> Maximum concurrent children watches above limit:
[junit4] 2>
[junit4] 2> 3 /solr/live_nodes
[junit4] 2> 3 /solr/collections
[junit4] 2> 2 /solr/security/zkdtsm/ZKDTSMRoot/ZKDTSMMasterKeyRoot
[junit4] 2> 2 /solr/security/zkdtsm/ZKDTSMRoot/ZKDTSMTokensRoot
[junit4] 2>
[junit4] 2> 179806 INFO (SUITE-TestSolrCloudWithSecureImpersonation-seed#[AE890F42666FC6DA]-worker) [ ] o.a.s.SolrTestCaseJ4 ------------------------------------------------------- Done waiting for tracked resources to be released
[junit4] 2> Sep 16, 2017 8:18:00 PM com.carrotsearch.randomizedtesting.ThreadLeakControl checkThreadLeaks
[junit4] 2> WARNING: Will linger awaiting termination of 3 leaked thread(s).
[junit4] 2> Sep 16, 2017 8:18:20 PM com.carrotsearch.randomizedtesting.ThreadLeakControl checkThreadLeaks
[junit4] 2> SEVERE: 2 threads leaked from SUITE scope at org.apache.solr.cloud.TestSolrCloudWithSecureImpersonation:
[junit4] 2> 1) Thread[id=1008, name=jetty-launcher-142-thread-1-EventThread, state=TIMED_WAITING, group=TGRP-TestSolrCloudWithSecureImpersonation]
[junit4] 2> at sun.misc.Unsafe.park(Native Method)
[junit4] 2> at java.util.concurrent.locks.LockSupport.parkNanos(LockSupport.java:215)
[junit4] 2> at java.util.concurrent.locks.AbstractQueuedSynchronizer.doAcquireSharedNanos(AbstractQueuedSynchronizer.java:1037)
[junit4] 2> at java.util.concurrent.locks.AbstractQueuedSynchronizer.tryAcquireSharedNanos(AbstractQueuedSynchronizer.java:1328)
[junit4] 2> at java.util.concurrent.CountDownLatch.await(CountDownLatch.java:277)
[junit4] 2> at org.apache.curator.CuratorZookeeperClient.internalBlockUntilConnectedOrTimedOut(CuratorZookeeperClient.java:323)
[junit4] 2> at org.apache.curator.RetryLoop.callWithRetry(RetryLoop.java:105)
[junit4] 2> at org.apache.curator.framework.imps.GetDataBuilderImpl.pathInForeground(GetDataBuilderImpl.java:288)
[junit4] 2> at org.apache.curator.framework.imps.GetDataBuilderImpl.forPath(GetDataBuilderImpl.java:279)
[junit4] 2> at org.apache.curator.framework.imps.GetDataBuilderImpl.forPath(GetDataBuilderImpl.java:41)
[junit4] 2> at org.apache.curator.framework.recipes.shared.SharedValue.readValue(SharedValue.java:244)
[junit4] 2> at org.apache.curator.framework.recipes.shared.SharedValue.access$100(SharedValue.java:44)
[junit4] 2> at org.apache.curator.framework.recipes.shared.SharedValue$1.process(SharedValue.java:61)
[junit4] 2> at org.apache.curator.framework.imps.NamespaceWatcher.process(NamespaceWatcher.java:67)
[junit4] 2> at org.apache.zookeeper.ClientCnxn$EventThread.processEvent(ClientCnxn.java:530)
[junit4] 2> at org.apache.zookeeper.ClientCnxn$EventThread.run(ClientCnxn.java:505)
[junit4] 2> 2) Thread[id=1013, name=jetty-launcher-142-thread-2-EventThread, state=TIMED_WAITING, group=TGRP-TestSolrCloudWithSecureImpersonation]
[junit4] 2> at sun.misc.Unsafe.park(Native Method)
[junit4] 2> at java.util.concurrent.locks.LockSupport.parkNanos(LockSupport.java:215)
[junit4] 2> at java.util.concurrent.locks.AbstractQueuedSynchronizer.doAcquireSharedNanos(AbstractQueuedSynchronizer.java:1037)
[junit4] 2> at java.util.concurrent.locks.AbstractQueuedSynchronizer.tryAcquireSharedNanos(AbstractQueuedSynchronizer.java:1328)
[junit4] 2> at java.util.concurrent.CountDownLatch.await(CountDownLatch.java:277)
[junit4] 2> at org.apache.curator.CuratorZookeeperClient.internalBlockUntilConnectedOrTimedOut(CuratorZookeeperClient.java:323)
[junit4] 2> at org.apache.curator.RetryLoop.callWithRetry(RetryLoop.java:105)
[junit4] 2> at org.apache.curator.framework.imps.GetDataBuilderImpl.pathInForeground(GetDataBuilderImpl.java:288)
[junit4] 2> at org.apache.curator.framework.imps.GetDataBuilderImpl.forPath(GetDataBuilderImpl.java:279)
[junit4] 2> at org.apache.curator.framework.imps.GetDataBuilderImpl.forPath(GetDataBuilderImpl.java:41)
[junit4] 2> at org.apache.curator.framework.recipes.shared.SharedValue.readValue(SharedValue.java:244)
[junit4] 2> at org.apache.curator.framework.recipes.shared.SharedValue.access$100(SharedValue.java:44)
[junit4] 2> at org.apache.curator.framework.recipes.shared.SharedValue$1.process(SharedValue.java:61)
[junit4] 2> at org.apache.curator.framework.imps.NamespaceWatcher.process(NamespaceWatcher.java:67)
[junit4] 2> at org.apache.zookeeper.ClientCnxn$EventThread.processEvent(ClientCnxn.java:530)
[junit4] 2> at org.apache.zookeeper.ClientCnxn$EventThread.run(ClientCnxn.java:505)
[junit4] 2> Sep 16, 2017 8:18:20 PM com.carrotsearch.randomizedtesting.ThreadLeakControl tryToInterruptAll
[junit4] 2> INFO: Starting to interrupt leaked threads:
[junit4] 2> 1) Thread[id=1008, name=jetty-launcher-142-thread-1-EventThread, state=TIMED_WAITING, group=TGRP-TestSolrCloudWithSecureImpersonation]
[junit4] 2> 2) Thread[id=1013, name=jetty-launcher-142-thread-2-EventThread, state=TIMED_WAITING, group=TGRP-TestSolrCloudWithSecureImpersonation]
[junit4] 2> 199873 ERROR (jetty-launcher-142-thread-2-EventThread) [n:127.0.0.1:42671_solr ] o.a.c.f.i.CuratorFrameworkImpl Watcher exception
[junit4] 2> java.lang.InterruptedException
[junit4] 2> at java.util.concurrent.locks.AbstractQueuedSynchronizer.doAcquireSharedNanos(AbstractQueuedSynchronizer.java:1039)
[junit4] 2> at java.util.concurrent.locks.AbstractQueuedSynchronizer.tryAcquireSharedNanos(AbstractQueuedSynchronizer.java:1328)
[junit4] 2> at java.util.concurrent.CountDownLatch.await(CountDownLatch.java:277)
[junit4] 2> at org.apache.curator.CuratorZookeeperClient.internalBlockUntilConnectedOrTimedOut(CuratorZookeeperClient.java:323)
[junit4] 2> at org.apache.curator.RetryLoop.callWithRetry(RetryLoop.java:105)
[junit4] 2> at org.apache.curator.framework.imps.GetDataBuilderImpl.pathInForeground(GetDataBuilderImpl.java:288)
[junit4] 2> at org.apache.curator.framework.imps.GetDataBuilderImpl.forPath(GetDataBuilderImpl.java:279)
[junit4] 2> at org.apache.curator.framework.imps.GetDataBuilderImpl.forPath(GetDataBuilderImpl.java:41)
[junit4] 2> at org.apache.curator.framework.recipes.shared.SharedValue.readValue(SharedValue.java:244)
[junit4] 2> at org.apache.curator.framework.recipes.shared.SharedValue.access$100(SharedValue.java:44)
[junit4] 2> at org.apache.curator.framework.recipes.shared.SharedValue$1.process(SharedValue.java:61)
[junit4] 2> at org.apache.curator.framework.imps.NamespaceWatcher.process(NamespaceWatcher.java:67)
[junit4] 2> at org.apache.zookeeper.ClientCnxn$EventThread.processEvent(ClientCnxn.java:530)
[junit4] 2> at org.apache.zookeeper.ClientCnxn$EventThread.run(ClientCnxn.java:505)
[junit4] 2> 199873 ERROR (jetty-launcher-142-thread-1-EventThread) [n:127.0.0.1:46073_solr ] o.a.c.f.i.CuratorFrameworkImpl Watcher exception
[junit4] 2> java.lang.InterruptedException
[junit4] 2> at java.util.concurrent.locks.AbstractQueuedSynchronizer.doAcquireSharedNanos(AbstractQueuedSynchronizer.java:1039)
[junit4] 2> at java.util.concurrent.locks.AbstractQueuedSynchronizer.tryAcquireSharedNanos(AbstractQueuedSynchronizer.java:1328)
[junit4] 2> at java.util.concurrent.CountDownLatch.await(CountDownLatch.java:277)
[junit4] 2> at org.apache.curator.CuratorZookeeperClient.internalBlockUntilConnectedOrTimedOut(CuratorZookeeperClient.java:323)
[junit4] 2> at org.apache.curator.RetryLoop.callWithRetry(RetryLoop.java:105)
[junit4] 2> at org.apache.curator.framework.imps.GetDataBuilderImpl.pathInForeground(GetDataBuilderImpl.java:288)
[junit4] 2> at org.apache.curator.framework.imps.GetDataBuilderImpl.forPath(GetDataBuilderImpl.java:279)
[junit4] 2> at org.apache.curator.framework.imps.GetDataBuilderImpl.forPath(GetDataBuilderImpl.java:41)
[junit4] 2> at org.apache.curator.framework.recipes.shared.SharedValue.readValue(SharedValue.java:244)
[junit4] 2> at org.apache.curator.framework.recipes.shared.SharedValue.access$100(SharedValue.java:44)
[junit4] 2> at org.apache.curator.framework.recipes.shared.SharedValue$1.process(SharedValue.java:61)
[junit4] 2> at org.apache.curator.framework.imps.NamespaceWatcher.process(NamespaceWatcher.java:67)
[junit4] 2> at org.apache.zookeeper.ClientCnxn$EventThread.processEvent(ClientCnxn.java:530)
[junit4] 2> at org.apache.zookeeper.ClientCnxn$EventThread.run(ClientCnxn.java:505)
[junit4] 2> 199874 WARN (jetty-launcher-142-thread-1-EventThread) [n:127.0.0.1:46073_solr ] o.a.c.ConnectionState Session expired event received
[junit4] 2> Sep 16, 2017 8:18:20 PM com.carrotsearch.randomizedtesting.ThreadLeakControl tryToInterruptAll
[junit4] 2> INFO: All leaked threads terminated.
[junit4] 2> 199875 WARN (jetty-launcher-142-thread-1-SendThread(127.0.0.1:41063)) [n:127.0.0.1:46073_solr ] o.a.z.ClientCnxn Session 0x0 for server null, unexpected error, closing socket connection and attempting reconnect
[junit4] 2> java.net.ConnectException: Connection refused
[junit4] 2> at sun.nio.ch.SocketChannelImpl.checkConnect(Native Method)
[junit4] 2> at sun.nio.ch.SocketChannelImpl.finishConnect(SocketChannelImpl.java:717)
[junit4] 2> at org.
[...truncated too long message...]
ck-1799-thread-2-processing-n:127.0.0.1:38977_solr) [n:127.0.0.1:38977_solr c:collection1 s:shard2 r:core_node6 x:collection1_shard2_replica_t4] o.a.s.m.SolrMetricManager Closing metric reporters for registry=solr.core.collection1.shard2.replica_t4, tag=20950005
[junit4] 2> 2517320 INFO (zkCallback-1799-thread-2-processing-n:127.0.0.1:38977_solr) [n:127.0.0.1:38977_solr c:collection1 s:shard2 r:core_node6 x:collection1_shard2_replica_t4] o.a.s.m.r.SolrJmxReporter Closing reporter [org.apache.solr.metrics.reporters.SolrJmxReporter@1726b6d: rootName = solr_38977, domain = solr.core.collection1.shard2.replica_t4, service url = null, agent id = null] for registry solr.core.collection1.shard2.replica_t4 / com.codahale.metrics.MetricRegistry@19a5f23
[junit4] 2> 2517335 INFO (zkCallback-1799-thread-2-processing-n:127.0.0.1:38977_solr) [n:127.0.0.1:38977_solr c:collection1 s:shard2 r:core_node6 x:collection1_shard2_replica_t4] o.a.s.m.SolrMetricManager Closing metric reporters for registry=solr.collection.collection1.shard2.leader, tag=20950005
[junit4] 2> 2517335 WARN (zkCallback-1799-thread-2-processing-n:127.0.0.1:38977_solr) [n:127.0.0.1:38977_solr c:collection1 s:shard2 r:core_node6 x:collection1_shard2_replica_t4] o.a.s.c.RecoveryStrategy Stopping recovery for core=[collection1_shard2_replica_t4] coreNodeName=[core_node6]
[junit4] 2> 2517337 INFO (zkCallback-1799-thread-2-processing-n:127.0.0.1:38977_solr) [n:127.0.0.1:38977_solr c:collection1 s:shard2 r:core_node6 x:collection1_shard2_replica_t4] o.a.s.c.ZkController collection1_shard2_replica_t4 stopping background replication from leader
[junit4] 2> 2517338 ERROR (zkCallback-1799-thread-2-processing-n:127.0.0.1:38977_solr) [n:127.0.0.1:38977_solr c:collection1 s:shard2 r:core_node6 x:collection1_shard2_replica_t4] o.a.s.c.ShardLeaderElectionContext There was a problem trying to register as the leader:java.lang.NullPointerException
[junit4] 2> at org.apache.solr.cloud.ShardLeaderElectionContext.runLeaderProcess(ElectionContext.java:437)
[junit4] 2> at org.apache.solr.cloud.LeaderElector.runIamLeaderProcess(LeaderElector.java:170)
[junit4] 2> at org.apache.solr.cloud.LeaderElector.checkIfIamLeader(LeaderElector.java:135)
[junit4] 2> at org.apache.solr.cloud.LeaderElector.access$200(LeaderElector.java:56)
[junit4] 2> at org.apache.solr.cloud.LeaderElector$ElectionWatcher.process(LeaderElector.java:348)
[junit4] 2> at org.apache.solr.common.cloud.SolrZkClient$3.lambda$process$0(SolrZkClient.java:269)
[junit4] 2> at java.util.concurrent.Executors$RunnableAdapter.call(Executors.java:511)
[junit4] 2> at java.util.concurrent.FutureTask.run(FutureTask.java:266)
[junit4] 2> at org.apache.solr.common.util.ExecutorUtil$MDCAwareThreadPoolExecutor.lambda$execute$0(ExecutorUtil.java:188)
[junit4] 2> at java.util.concurrent.ThreadPoolExecutor.runWorker(ThreadPoolExecutor.java:1149)
[junit4] 2> at java.util.concurrent.ThreadPoolExecutor$Worker.run(ThreadPoolExecutor.java:624)
[junit4] 2> at java.lang.Thread.run(Thread.java:748)
[junit4] 2>
[junit4] 2> 2517542 WARN (zkCallback-1793-thread-1-processing-n:127.0.0.1:40089_solr) [n:127.0.0.1:40089_solr ] o.a.s.c.c.ZkStateReader ZooKeeper watch triggered, but Solr cannot talk to ZK: [KeeperErrorCode = Session expired for /live_nodes]
[junit4] 2> 2517542 INFO (jetty-closer-1757-thread-1) [ ] o.e.j.s.h.ContextHandler Stopped o.e.j.s.ServletContextHandler@147c69a{/solr,null,UNAVAILABLE}
[junit4] 2> 2518842 ERROR (recoveryExecutor-1797-thread-1-processing-n:127.0.0.1:38977_solr x:collection1_shard2_replica_t4 s:shard2 c:collection1 r:core_node6) [n:127.0.0.1:38977_solr c:collection1 s:shard2 r:core_node6 x:collection1_shard2_replica_t4] o.a.s.c.RecoveryStrategy SolrCore not found - cannot recover:collection1_shard2_replica_t4
[junit4] 2> 2518846 ERROR (recoveryExecutor-1797-thread-1-processing-n:127.0.0.1:38977_solr x:collection1_shard1_replica_t1 s:shard1 c:collection1 r:core_node2) [n:127.0.0.1:38977_solr c:collection1 s:shard1 r:core_node2 x:collection1_shard1_replica_t1] o.a.s.c.RecoveryStrategy SolrCore not found - cannot recover:collection1_shard1_replica_t1
[junit4] 2> 2518847 INFO (jetty-closer-1757-thread-2) [ ] o.e.j.s.h.ContextHandler Stopped o.e.j.s.ServletContextHandler@7ae390{/solr,null,UNAVAILABLE}
[junit4] 2> 2518847 ERROR (SUITE-TestCloudRecovery-seed#[AE890F42666FC6DA]-worker) [ ] o.a.z.s.ZooKeeperServer ZKShutdownHandler is not registered, so ZooKeeper server won't take any action on ERROR or SHUTDOWN server state changes
[junit4] 2> 2518847 INFO (SUITE-TestCloudRecovery-seed#[AE890F42666FC6DA]-worker) [ ] o.a.s.c.ZkTestServer connecting to 127.0.0.1:39193 39193
[junit4] 2> 2518854 INFO (Thread-2957) [ ] o.a.s.c.ZkTestServer connecting to 127.0.0.1:39193 39193
[junit4] 2> 2518854 WARN (Thread-2957) [ ] o.a.s.c.ZkTestServer Watch limit violations:
[junit4] 2> Maximum concurrent create/delete watches above limit:
[junit4] 2>
[junit4] 2> 7 /solr/aliases.json
[junit4] 2> 7 /solr/clusterprops.json
[junit4] 2> 6 /solr/security.json
[junit4] 2> 6 /solr/configs/config
[junit4] 2>
[junit4] 2> Maximum concurrent data watches above limit:
[junit4] 2>
[junit4] 2> 209 /solr/collections/collection1/state.json
[junit4] 2> 7 /solr/clusterstate.json
[junit4] 2>
[junit4] 2> Maximum concurrent children watches above limit:
[junit4] 2>
[junit4] 2> 7 /solr/collections
[junit4] 2> 5 /solr/overseer/collection-queue-work
[junit4] 2> 4 /solr/overseer/queue
[junit4] 2> 3 /solr/live_nodes
[junit4] 2> 2 /solr/overseer/queue-work
[junit4] 2>
[junit4] 2> NOTE: leaving temporary files on disk at: /home/jenkins/workspace/Lucene-Solr-7.x-Linux/solr/build/solr-core/test/J0/temp/solr.cloud.TestCloudRecovery_AE890F42666FC6DA-001
[junit4] 2> Sep 16, 2017 8:56:59 PM com.carrotsearch.randomizedtesting.ThreadLeakControl checkThreadLeaks
[junit4] 2> WARNING: Will linger awaiting termination of 2 leaked thread(s).
[junit4] 2> NOTE: test params are: codec=Asserting(Lucene70): {id=PostingsFormat(name=MockRandom)}, docValues:{_version_=DocValuesFormat(name=Memory)}, maxPointsInLeafNode=1981, maxMBSortInHeap=5.103060588980279, sim=RandomSimilarity(queryNorm=false): {}, locale=es, timezone=Iceland
[junit4] 2> NOTE: Linux 4.10.0-33-generic i386/Oracle Corporation 1.8.0_144 (32-bit)/cpus=8,threads=1,free=213971968,total=392814592
[junit4] 2> NOTE: All tests run in this JVM: [AsyncCallRequestStatusResponseTest, TestDocumentBuilder, TestSmileRequest, SolrMetricReporterTest, SuggestComponentContextFilterQueryTest, BasicZkTest, TestLMDirichletSimilarityFactory, TestSolrCoreSnapshots, RequestHandlersTest, TestLuceneMatchVersion, WrapperMergePolicyFactoryTest, MissingSegmentRecoveryTest, ConfigSetsAPITest, CollectionsAPIAsyncDistributedZkTest, TestCustomDocTransformer, MetricUtilsTest, DistributedExpandComponentTest, CoreMergeIndexesAdminHandlerTest, TestSolrCloudWithDelegationTokens, TestExactSharedStatsCache, CursorPagingTest, SynonymTokenizerTest, TestConfigSetProperties, FieldMutatingUpdateProcessorTest, TestSolrCloudWithHadoopAuthPlugin, ImplicitSnitchTest, TestPHPSerializedResponseWriter, JSONWriterTest, TestHashQParserPlugin, TestUnifiedSolrHighlighter, MBeansHandlerTest, TestDistributedSearch, TestSolrCLIRunExample, CurrencyFieldTypeTest, TestRangeQuery, TestTrackingShardHandlerFactory, TestDynamicFieldCollectionResource, BinaryUpdateRequestHandlerTest, ConfigureRecoveryStrategyTest, SuggesterWFSTTest, DistributedFacetPivotLongTailTest, TestSchemalessBufferedUpdates, TestReplicationHandler, SolrIndexSplitterTest, BasicAuthIntegrationTest, TestFaceting, TestAnalyzeInfixSuggestions, TestJoin, TestNumericTerms32, CdcrVersionReplicationTest, TestQuerySenderNoQuery, TestCollectionsAPIViaSolrCloudCluster, TestRandomFaceting, SolrCloudExampleTest, DistributedSuggestComponentTest, SortSpecParsingTest, OutputWriterTest, TestChildDocTransformer, TestComplexPhraseLeadingWildcard, TestSchemaNameResource, VersionInfoTest, TestWriterPerf, ZkFailoverTest, TestConfig, TestBlobHandler, HdfsSyncSliceTest, TestClusterStateMutator, ClassificationUpdateProcessorTest, TestFieldSortValues, DefaultValueUpdateProcessorTest, SolrCoreTest, TlogReplayBufferedWhileIndexingTest, TestFastOutputStream, StatsReloadRaceTest, SpellingQueryConverterTest, TestRemoteStreaming, EchoParamsTest, TestSolrQueryParser, TestSchemaVersionResource, TestSolrDeletionPolicy1, RestartWhileUpdatingTest, TestDFISimilarityFactory, TestNumericTokenStream, DistributedFacetPivotWhiteBoxTest, TestScoreJoinQPNoScore, OverseerModifyCollectionTest, TestReloadDeadlock, TestSha256AuthenticationProvider, TestMergePolicyConfig, UpdateParamsTest, SolrIndexConfigTest, SaslZkACLProviderTest, TestDistribDocBasedVersion, TestStreamBody, BasicDistributedZkTest, TestFieldCacheVsDocValues, RAMDirectoryFactoryTest, HdfsBasicDistributedZk2Test, LeaderElectionContextKeyTest, FieldAnalysisRequestHandlerTest, TestMiniSolrCloudClusterSSL, HdfsUnloadDistributedZkTest, TestFieldResource, TestOrdValues, TestConfigSetsAPIZkFailure, TestSolrConfigHandlerConcurrent, QueryElevationComponentTest, SubstringBytesRefFilterTest, TestBadConfig, TestRawResponseWriter, TestExpandComponent, TestPullReplica, ExitableDirectoryReaderTest, HLLSerializationTest, SolrRequestParserTest, TestEmbeddedSolrServerAdminHandler, OutOfBoxZkACLAndCredentialsProvidersTest, OverriddenZkACLAndCredentialsProvidersTest, OverseerTaskQueueTest, ReplicationFactorTest, SSLMigrationTest, SharedFSAutoReplicaFailoverUtilsTest, SolrCLIZkUtilsTest, TestAuthenticationFramework, TestCloudDeleteByQuery, TestCloudPseudoReturnFields, TestCloudRecovery]
[junit4] Completed [540/731 (2!)] on J0 in 172.00s, 2 tests, 1 failure <<< FAILURES!
[...truncated 42712 lines...]