You are viewing a plain text version of this content. The canonical link for it is here.
Posted to issues@tajo.apache.org by Apache Jenkins Server <je...@builds.apache.org> on 2014/09/11 04:32:40 UTC
Build failed in Jenkins: Tajo-master-nightly #460
See <https://builds.apache.org/job/Tajo-master-nightly/460/changes>
Changes:
[babokim] TAJO-1028: JDBC should support SET command.
[jhkim] TAJO-1029: TAJO_PULLSERVER_STANDALONE should be false in default tajo-env.sh. (jinho)
[babokim] TAJO-1022: tsql does not work as background process
------------------------------------------
[...truncated 317689 lines...]
TestSQLDateTimeTypes>ExprTestBase.setUp:81 ? Runtime java.io.FileNotFoundExcep...
TestSQLExpression>ExprTestBase.setUp:81 ? Runtime java.io.FileNotFoundExceptio...
TestSQLAnalyzer.testJoin1:126 ? FileNotFound src/test/resources/queries/defaul...
TestSQLAnalyzer.testJoin2:132 ? FileNotFound src/test/resources/queries/defaul...
TestSQLAnalyzer.testJoin3:138 ? FileNotFound src/test/resources/queries/defaul...
TestSQLAnalyzer.testJoin4:144 ? FileNotFound src/test/resources/queries/defaul...
TestSQLAnalyzer.testJoin5:150 ? FileNotFound src/test/resources/queries/defaul...
TestSQLAnalyzer.testJoin6:156 ? FileNotFound src/test/resources/queries/defaul...
TestSQLAnalyzer.testJoin7:162 ? FileNotFound src/test/resources/queries/defaul...
TestSQLAnalyzer.testJoin8:168 ? FileNotFound src/test/resources/queries/defaul...
TestSQLAnalyzer.testJoin9:174 ? FileNotFound src/test/resources/queries/defaul...
TestSQLAnalyzer.testSet1:192 ? FileNotFound src/test/resources/queries/default...
TestSQLAnalyzer.testSet2:198 ? FileNotFound src/test/resources/queries/default...
TestSQLAnalyzer.testSet3:204 ? FileNotFound src/test/resources/queries/default...
TestSQLAnalyzer.testSet4:210 ? FileNotFound src/test/resources/queries/default...
TestSQLAnalyzer.testExistsPredicate1:395 ? FileNotFound src/test/resources/que...
TestSQLAnalyzer.testExistsPredicate2:401 ? FileNotFound src/test/resources/que...
TestSQLAnalyzer.testCreateTableLike1:282 ? FileNotFound src/test/resources/que...
TestSQLAnalyzer.testTableSubQuery1:371 ? FileNotFound src/test/resources/queri...
TestSQLAnalyzer.testTableSubQuery2:377 ? FileNotFound src/test/resources/queri...
TestSQLAnalyzer.testInsertIntoLocation:413 ? FileNotFound src/test/resources/q...
TestSQLAnalyzer.testCreateTablePartitionByList:331 ? FileNotFound src/test/res...
TestSQLAnalyzer.testInsertOverwriteIntoTable2:437 ? FileNotFound src/test/reso...
TestSQLAnalyzer.testCreateTablePartitionByColumn:356 ? FileNotFound src/test/r...
TestSQLAnalyzer.testDropTable:216 ? FileNotFound src/test/resources/queries/de...
TestSQLAnalyzer.testGroupby1:120 ? FileNotFound src/test/resources/queries/def...
TestSQLAnalyzer.testInsertIntoTable2:419 ? FileNotFound src/test/resources/que...
TestSQLAnalyzer.testJoin10:180 ? FileNotFound src/test/resources/queries/defau...
TestSQLAnalyzer.testJoin11:186 ? FileNotFound src/test/resources/queries/defau...
TestSQLAnalyzer.testCreateTablePartitionByHash1:291 ? FileNotFound src/test/re...
TestSQLAnalyzer.testCreateTablePartitionByHash2:304 ? FileNotFound src/test/re...
TestSQLAnalyzer.testCreateTablePartitionByRange:318 ? FileNotFound src/test/re...
TestSQLAnalyzer.testSelect1:66 ? FileNotFound src/test/resources/queries/defau...
TestSQLAnalyzer.testSelect2:72 ? FileNotFound src/test/resources/queries/defau...
TestSQLAnalyzer.testSelect3:78 ? FileNotFound src/test/resources/queries/defau...
TestSQLAnalyzer.testSelect4:84 ? FileNotFound src/test/resources/queries/defau...
TestSQLAnalyzer.testSelect5:90 ? FileNotFound src/test/resources/queries/defau...
TestSQLAnalyzer.windowFunction1:493->assertParseResult:56 ? NullPointer
TestSQLAnalyzer.windowFunction2:498->assertParseResult:56 ? NullPointer
TestSQLAnalyzer.windowFunction3:503->assertParseResult:56 ? NullPointer
TestSQLAnalyzer.windowFunction4:508->assertParseResult:56 ? NullPointer
TestSQLAnalyzer.windowFunction5:513->assertParseResult:56 ? NullPointer
TestSQLAnalyzer.windowFunction6:518->assertParseResult:56 ? NullPointer
TestSQLAnalyzer.windowFunction7:523->assertParseResult:56 ? NullPointer
TestSQLAnalyzer.windowFunction8:528->assertParseResult:56 ? NullPointer
TestSQLAnalyzer.windowFunction9:533->assertParseResult:56 ? NullPointer
TestSQLAnalyzer.testInSubquery1:383 ? FileNotFound src/test/resources/queries/...
TestSQLAnalyzer.testInSubquery2:389 ? FileNotFound src/test/resources/queries/...
TestSimpleDirectedGraph.test:69 NoClassDefFound org/apache/tajo/engine/planner...
TestBroadcastJoinPlan.setUp:81 ? Runtime java.io.FileNotFoundException: /home/...
TestBroadcastJoinPlan.tearDown:176 NullPointer
TestBroadcastJoinPlan.setUp:81 ? Runtime java.io.FileNotFoundException: /home/...
TestBroadcastJoinPlan.tearDown:176 NullPointer
TestBroadcastJoinPlan.setUp:81 ? Runtime java.io.FileNotFoundException: /home/...
TestBroadcastJoinPlan.tearDown:176 NullPointer
TestBroadcastJoinPlan.setUp:81 ? Runtime java.io.FileNotFoundException: /home/...
TestBroadcastJoinPlan.tearDown:176 NullPointer
TestBroadcastJoinPlan.setUp:87 ? Catalog org.jboss.netty.channel.ChannelExcept...
TestBroadcastJoinPlan.setUp:87 ? Catalog org.jboss.netty.channel.ChannelExcept...
TestBroadcastJoinPlan.setUp:87 ? Catalog org.jboss.netty.channel.ChannelExcept...
TestBroadcastJoinPlan.setUp:87 ? Catalog org.jboss.netty.channel.ChannelExcept...
TestBroadcastJoinPlan.setUp:87 ? Catalog org.jboss.netty.channel.ChannelExcept...
TestBroadcastJoinPlan.setUp:87 ? Catalog org.jboss.netty.channel.ChannelExcept...
TestBroadcastJoinPlan.setUp:81 ? Runtime java.io.FileNotFoundException: /home/...
TestBroadcastJoinPlan.tearDown:176 NullPointer
TestBroadcastJoinPlan.setUp:81 ? Runtime java.io.FileNotFoundException: /home/...
TestBroadcastJoinPlan.tearDown:176 NullPointer
TestBroadcastJoinPlan.setUp:81 ? Runtime java.io.FileNotFoundException: /home/...
TestBroadcastJoinPlan.tearDown:176 NullPointer
TestBroadcastJoinPlan.setUp:81 ? Runtime java.io.FileNotFoundException: /home/...
TestBroadcastJoinPlan.tearDown:176 NullPointer
TestHashJoinExec.setUp:71 ? Runtime java.io.FileNotFoundException: /home/jenki...
TestHashJoinExec.tearDown:134 NullPointer
TestHashJoinExec.setUp:71 ? Runtime java.io.FileNotFoundException: /home/jenki...
TestHashJoinExec.tearDown:134 NullPointer
TestFullOuterHashJoinExec.setUp:77 ? Runtime java.io.FileNotFoundException: /h...
TestFullOuterHashJoinExec.tearDown:244 NullPointer
TestFullOuterHashJoinExec.setUp:77 ? Runtime java.io.FileNotFoundException: /h...
TestFullOuterHashJoinExec.tearDown:244 NullPointer
TestFullOuterHashJoinExec.setUp:77 ? Runtime java.io.FileNotFoundException: /h...
TestFullOuterHashJoinExec.tearDown:244 NullPointer
TestFullOuterHashJoinExec.setUp:77 ? Runtime java.io.FileNotFoundException: /h...
TestFullOuterHashJoinExec.tearDown:244 NullPointer
TestLeftOuterHashJoinExec.setUp:78 ? Runtime java.io.FileNotFoundException: /h...
TestLeftOuterHashJoinExec.tearDown:246 NullPointer
TestLeftOuterHashJoinExec.setUp:78 ? Runtime java.io.FileNotFoundException: /h...
TestLeftOuterHashJoinExec.tearDown:246 NullPointer
TestLeftOuterHashJoinExec.setUp:78 ? Runtime java.io.FileNotFoundException: /h...
TestLeftOuterHashJoinExec.tearDown:246 NullPointer
TestLeftOuterHashJoinExec.setUp:78 ? Runtime java.io.FileNotFoundException: /h...
TestLeftOuterHashJoinExec.tearDown:246 NullPointer
TestLeftOuterHashJoinExec.setUp:78 ? Runtime java.io.FileNotFoundException: /h...
TestLeftOuterHashJoinExec.tearDown:246 NullPointer
TestNLJoinExec.setUp:73 ? Runtime java.io.FileNotFoundException: /home/jenkins...
TestNLJoinExec.tearDown:136 NullPointer
TestNLJoinExec.setUp:73 ? Runtime java.io.FileNotFoundException: /home/jenkins...
TestNLJoinExec.tearDown:136 NullPointer
TestHashSemiJoinExec.setUp:68 ? Runtime java.io.FileNotFoundException: /home/j...
TestHashSemiJoinExec.tearDown:139 NullPointer
TestRightOuterHashJoinExec.setUp:76 ? Runtime java.io.FileNotFoundException: /...
TestRightOuterHashJoinExec.tearDown:221 NullPointer
TestRightOuterHashJoinExec.setUp:76 ? Runtime java.io.FileNotFoundException: /...
TestRightOuterHashJoinExec.tearDown:221 NullPointer
TestRightOuterHashJoinExec.setUp:76 ? Runtime java.io.FileNotFoundException: /...
TestRightOuterHashJoinExec.tearDown:221 NullPointer
TestFullOuterMergeJoinExec.setUp:80 ? Runtime java.io.FileNotFoundException: /...
TestFullOuterMergeJoinExec.tearDown:287 NullPointer
TestFullOuterMergeJoinExec.setUp:80 ? Runtime java.io.FileNotFoundException: /...
TestFullOuterMergeJoinExec.tearDown:287 NullPointer
TestFullOuterMergeJoinExec.setUp:80 ? Runtime java.io.FileNotFoundException: /...
TestFullOuterMergeJoinExec.tearDown:287 NullPointer
TestFullOuterMergeJoinExec.setUp:80 ? Runtime java.io.FileNotFoundException: /...
TestFullOuterMergeJoinExec.tearDown:287 NullPointer
TestFullOuterMergeJoinExec.setUp:80 ? Runtime java.io.FileNotFoundException: /...
TestFullOuterMergeJoinExec.tearDown:287 NullPointer
TestFullOuterMergeJoinExec.setUp:80 ? Runtime java.io.FileNotFoundException: /...
TestFullOuterMergeJoinExec.tearDown:287 NullPointer
TestExternalSortExec.setUp:70 ? Runtime java.io.FileNotFoundException: /home/j...
TestExternalSortExec.tearDown:111 ? Runtime java.io.FileNotFoundException: /ho...
TestLeftOuterNLJoinExec.setUp:78 ? Runtime java.io.FileNotFoundException: /hom...
TestLeftOuterNLJoinExec.tearDown:244 NullPointer
TestLeftOuterNLJoinExec.setUp:78 ? Runtime java.io.FileNotFoundException: /hom...
TestLeftOuterNLJoinExec.tearDown:244 NullPointer
TestLeftOuterNLJoinExec.setUp:78 ? Runtime java.io.FileNotFoundException: /hom...
TestLeftOuterNLJoinExec.tearDown:244 NullPointer
TestLeftOuterNLJoinExec.setUp:78 ? Runtime java.io.FileNotFoundException: /hom...
TestLeftOuterNLJoinExec.tearDown:244 NullPointer
TestLeftOuterNLJoinExec.setUp:78 ? Runtime java.io.FileNotFoundException: /hom...
TestLeftOuterNLJoinExec.tearDown:244 NullPointer
TestBNLJoinExec.setUp:73 ? Runtime java.io.FileNotFoundException: /home/jenkin...
TestBNLJoinExec.tearDown:131 NullPointer
TestBNLJoinExec.setUp:73 ? Runtime java.io.FileNotFoundException: /home/jenkin...
TestBNLJoinExec.tearDown:131 NullPointer
TestPhysicalPlanner.setUp:99 ? Runtime java.io.FileNotFoundException: /home/je...
TestPhysicalPlanner.tearDown:219 NullPointer
TestSortExec.setUp:70 ? Runtime java.io.FileNotFoundException: /home/jenkins/j...
TestRightOuterMergeJoinExec.setUp:80 ? Runtime java.io.FileNotFoundException: ...
TestRightOuterMergeJoinExec.tearDown:287 NullPointer
TestRightOuterMergeJoinExec.setUp:80 ? Runtime java.io.FileNotFoundException: ...
TestRightOuterMergeJoinExec.tearDown:287 NullPointer
TestRightOuterMergeJoinExec.setUp:80 ? Runtime java.io.FileNotFoundException: ...
TestRightOuterMergeJoinExec.tearDown:287 NullPointer
TestRightOuterMergeJoinExec.setUp:80 ? Runtime java.io.FileNotFoundException: ...
TestRightOuterMergeJoinExec.tearDown:287 NullPointer
TestRightOuterMergeJoinExec.setUp:80 ? Runtime java.io.FileNotFoundException: ...
TestRightOuterMergeJoinExec.tearDown:287 NullPointer
TestRightOuterMergeJoinExec.setUp:80 ? Runtime java.io.FileNotFoundException: ...
TestRightOuterMergeJoinExec.tearDown:287 NullPointer
TestProgressExternalSortExec.setUp:77 ? Runtime java.io.FileNotFoundException:...
TestProgressExternalSortExec.tearDown:120 ? Runtime java.io.FileNotFoundExcept...
TestProgressExternalSortExec.setUp:77 ? Runtime java.io.FileNotFoundException:...
TestProgressExternalSortExec.tearDown:120 ? Runtime java.io.FileNotFoundExcept...
TestHashAntiJoinExec.setUp:70 ? Catalog org.jboss.netty.channel.ChannelExcepti...
TestBSTIndexExec.setup:88 ? Catalog org.jboss.netty.channel.ChannelException: ...
TestMergeJoinExec.setUp:70 ? Runtime java.io.FileNotFoundException: /home/jenk...
TestMergeJoinExec.tearDown:146 NullPointer
TestLogicalOptimizer.setUp:55 ? Runtime java.io.FileNotFoundException: /home/j...
TestLogicalOptimizer.tearDown:110 NullPointer
TestLogicalPlanner.setUp:70 ? Runtime java.io.FileNotFoundException: /home/jen...
TestLogicalPlanner.tearDown:136 NullPointer
TestPlannerUtil.setUp:57 ? Runtime java.io.FileNotFoundException: /home/jenkin...
TestPlannerUtil.tearDown:105 NullPointer
TestLogicalPlan.setup:47 ? Runtime java.io.FileNotFoundException: /home/jenkin...
TestEvalCodeGenerator>ExprTestBase.setUp:81 ? Runtime java.io.FileNotFoundExce...
TestGeneratorAdapter.getMethodDescription:38 NoClassDefFound org/apache/tajo/e...
TestGeneratorAdapter.testGetDescription:32 NoClassDefFound org/apache/tajo/eng...
TestBuiltinFunctions>QueryTestCaseBase.setUpClass:164 ? Channel Failed to crea...
TestPatternMatchingPredicates>ExprTestBase.setUp:81 ? Runtime java.io.FileNotF...
TestMathFunctions>ExprTestBase.setUp:81 ? Runtime java.io.FileNotFoundExceptio...
TestDateTimeFunctions>ExprTestBase.setUp:81 ? Runtime java.io.FileNotFoundExce...
TestStringOperatorsAndFunctions>ExprTestBase.setUp:81 ? Runtime java.io.FileNo...
TestConditionalExpressions>ExprTestBase.setUp:81 ? Runtime java.io.FileNotFoun...
TestTajoCli.setUp:75 ? Channel Failed to create a selector.
TestTajoCli.setUp:75 ? Channel Failed to create a selector.
TestTajoCli.setUp:75 ? Channel Failed to create a selector.
TestTajoCli.setUp:75 ? Channel Failed to create a selector.
TestTajoCli.setUp:75 ? Channel Failed to create a selector.
TestTajoCli.setUp:75 ? Channel Failed to create a selector.
TestTajoCli.setUp:75 ? Channel Failed to create a selector.
TestTajoCli.setUp:75 ? Channel Failed to create a selector.
TestTajoCli.setUp:75 ? Channel Failed to create a selector.
TestTajoCli.setUp:75 ? Channel Failed to create a selector.
TestTajoCli.setUp:75 ? Channel Failed to create a selector.
TestTajoCli.setUp:75 ? Channel Failed to create a selector.
TestTajoCli.setUp:75 ? Channel Failed to create a selector.
TestTajoCli.setUp:75 ? Channel Failed to create a selector.
TestHdfsCommand.testHdfCommand:39 ? Channel Failed to create a selector.
TestExecExternalShellCommand.testCommand:36 ? Channel Failed to create a selec...
TestDefaultCliOutputFormatter.setUp:69 ? Channel Failed to create a selector.
TestDefaultCliOutputFormatter.setUp:69 ? Channel Failed to create a selector.
TestDefaultCliOutputFormatter.setUp:69 ? Channel Failed to create a selector.
TestTajoDatabaseMetaData>QueryTestCaseBase.setUpClass:164 ? Channel Failed to ...
TestResultSet.testDateTimeType:215 NullPointer
TestTajoJdbc.testDatabaseMetaDataGetColumns:240 ? SQL Cannot create TajoClient...
TestTajoJdbc.testStatement:79 ? SQL Cannot create TajoClient instance:java.io....
TestTajoJdbc.testSetPreparedStatement:452 ? SQL Cannot create TajoClient insta...
TestTajoJdbc.testDatabaseMetaDataGetTable:205 ? SQL Cannot create TajoClient i...
TestTajoJdbc.testMultipleConnectionsSequentialClose:344 ? SQL Cannot create Ta...
TestTajoJdbc.testSetStatement:410 ? SQL Cannot create TajoClient instance:Fail...
TestTajoJdbc.testMultipleConnections:286 ? SQL Cannot create TajoClient instan...
TestTajoJdbc.testPreparedStatement:124 ? SQL Cannot create TajoClient instance...
TestTajoJdbc>QueryTestCaseBase.tearDownClass:180 ? Service Giving up after tri...
Tests run: 996, Failures: 0, Errors: 207, Skipped: 0
[INFO] ------------------------------------------------------------------------
[INFO] Reactor Summary:
[INFO]
[INFO] Tajo Main ......................................... SUCCESS [ 4.795 s]
[INFO] Tajo Project POM .................................. SUCCESS [ 2.896 s]
[INFO] Tajo Maven Plugins ................................ SUCCESS [ 7.041 s]
[INFO] Tajo Common ....................................... SUCCESS [01:14 min]
[INFO] Tajo Algebra ...................................... SUCCESS [ 3.242 s]
[INFO] Tajo Catalog Common ............................... SUCCESS [ 12.100 s]
[INFO] Tajo Rpc .......................................... SUCCESS [ 25.658 s]
[INFO] Tajo Catalog Client ............................... SUCCESS [ 1.996 s]
[INFO] Tajo Catalog Server ............................... SUCCESS [ 13.676 s]
[INFO] Tajo Storage ...................................... SUCCESS [01:30 min]
[INFO] Tajo Core PullServer .............................. SUCCESS [ 1.951 s]
[INFO] Tajo Client ....................................... SUCCESS [ 6.581 s]
[INFO] Tajo JDBC Driver .................................. SUCCESS [ 1.405 s]
[INFO] ASM (thirdparty) .................................. SUCCESS [ 1.882 s]
[INFO] Tajo Catalog Drivers HCatalog ..................... SUCCESS [ 24.332 s]
[INFO] Tajo Core ......................................... FAILURE [25:06 min]
[INFO] Tajo Catalog Drivers .............................. SKIPPED
[INFO] Tajo Catalog ...................................... SKIPPED
[INFO] Tajo Distribution ................................. SKIPPED
[INFO] ------------------------------------------------------------------------
[INFO] BUILD FAILURE
[INFO] ------------------------------------------------------------------------
[INFO] Total time: 29:41 min
[INFO] Finished at: 2014-09-11T02:28:49+00:00
[INFO] Final Memory: 91M/1108M
[INFO] ------------------------------------------------------------------------
[ERROR] Failed to execute goal org.apache.maven.plugins:maven-surefire-plugin:2.16:test (default-test) on project tajo-core: There are test failures.
[ERROR]
[ERROR] Please refer to <https://builds.apache.org/job/Tajo-master-nightly/ws/tajo-core/target/surefire-reports> for the individual test results.
[ERROR] -> [Help 1]
[ERROR]
[ERROR] To see the full stack trace of the errors, re-run Maven with the -e switch.
[ERROR] Re-run Maven using the -X switch to enable full debug logging.
[ERROR]
[ERROR] For more information about the errors and possible solutions, please read the following articles:
[ERROR] [Help 1] http://cwiki.apache.org/confluence/display/MAVEN/MojoFailureException
[ERROR]
[ERROR] After correcting the problems, you can resume the build with the command
[ERROR] mvn <goals> -rf :tajo-core
Build step 'Execute shell' marked build as failure
Recording test results
Jenkins build is back to normal : Tajo-master-nightly #461
Posted by Apache Jenkins Server <je...@builds.apache.org>.
See <https://builds.apache.org/job/Tajo-master-nightly/461/changes>