You are viewing a plain text version of this content. The canonical link for it is here.
Posted to commits@phoenix.apache.org by Apache Jenkins Server <je...@builds.apache.org> on 2015/11/12 19:54:42 UTC
Build failed in Jenkins: Phoenix | Master #952
See <https://builds.apache.org/job/Phoenix-master/952/changes>
Changes:
[maryannxue] PHOENIX-2406 ClassCastException in isCoercibleTo() of unsigned primitive
------------------------------------------
[...truncated 7506 lines...]
-------------------------------------------------------
T E S T S
-------------------------------------------------------
Running org.apache.phoenix.flume.PhoenixSinkIT
Running org.apache.phoenix.flume.RegexEventSerializerIT
Tests run: 9, Failures: 0, Errors: 0, Skipped: 0, Time elapsed: 19.502 sec - in org.apache.phoenix.flume.PhoenixSinkIT
Tests run: 6, Failures: 0, Errors: 0, Skipped: 0, Time elapsed: 44.525 sec - in org.apache.phoenix.flume.RegexEventSerializerIT
Results :
Tests run: 15, Failures: 0, Errors: 0, Skipped: 0
[INFO]
[INFO] --- maven-failsafe-plugin:2.19:integration-test (NeedTheirOwnClusterTests) @ phoenix-flume ---
-------------------------------------------------------
T E S T S
-------------------------------------------------------
Results :
Tests run: 0, Failures: 0, Errors: 0, Skipped: 0
[INFO]
[INFO] --- maven-failsafe-plugin:2.19:verify (ClientManagedTimeTests) @ phoenix-flume ---
[INFO]
[INFO] --- maven-failsafe-plugin:2.19:verify (HBaseManagedTimeTests) @ phoenix-flume ---
[INFO]
[INFO] --- maven-failsafe-plugin:2.19:verify (NeedTheirOwnClusterTests) @ phoenix-flume ---
[INFO]
[INFO] --- maven-install-plugin:2.5.1:install (default-install) @ phoenix-flume ---
[INFO] Installing <https://builds.apache.org/job/Phoenix-master/952/artifact/phoenix-flume/target/phoenix-flume-4.7.0-HBase-1.1-SNAPSHOT.jar> to /home/jenkins/.m2/repository/org/apache/phoenix/phoenix-flume/4.7.0-HBase-1.1-SNAPSHOT/phoenix-flume-4.7.0-HBase-1.1-SNAPSHOT.jar
[INFO] Installing <https://builds.apache.org/job/Phoenix-master/ws/phoenix-flume/pom.xml> to /home/jenkins/.m2/repository/org/apache/phoenix/phoenix-flume/4.7.0-HBase-1.1-SNAPSHOT/phoenix-flume-4.7.0-HBase-1.1-SNAPSHOT.pom
[INFO] Installing <https://builds.apache.org/job/Phoenix-master/952/artifact/phoenix-flume/target/phoenix-flume-4.7.0-HBase-1.1-SNAPSHOT-sources.jar> to /home/jenkins/.m2/repository/org/apache/phoenix/phoenix-flume/4.7.0-HBase-1.1-SNAPSHOT/phoenix-flume-4.7.0-HBase-1.1-SNAPSHOT-sources.jar
[INFO] Installing <https://builds.apache.org/job/Phoenix-master/952/artifact/phoenix-flume/target/phoenix-flume-4.7.0-HBase-1.1-SNAPSHOT-tests.jar> to /home/jenkins/.m2/repository/org/apache/phoenix/phoenix-flume/4.7.0-HBase-1.1-SNAPSHOT/phoenix-flume-4.7.0-HBase-1.1-SNAPSHOT-tests.jar
[INFO]
[INFO] ------------------------------------------------------------------------
[INFO] Building Phoenix - Pig 4.7.0-HBase-1.1-SNAPSHOT
[INFO] ------------------------------------------------------------------------
Downloading: https://repository.apache.org/content/repositories/releases/org/apache/hbase/hbase-client/1.1.0/hbase-client-1.1.0-tests.jar
4/172 KB
8/172 KB
8/172 KB
12/172 KB
16/172 KB
16/172 KB
20/172 KB
23/172 KB
24/172 KB
28/172 KB
31/172 KB
32/172 KB
36/172 KB
39/172 KB
40/172 KB
44/172 KB
47/172 KB
48/172 KB
52/172 KB
55/172 KB
56/172 KB
60/172 KB
63/172 KB
64/172 KB
67/172 KB
71/172 KB
74/172 KB
75/172 KB
79/172 KB
82/172 KB
83/172 KB
87/172 KB
90/172 KB
91/172 KB
95/172 KB
98/172 KB
99/172 KB
103/172 KB
106/172 KB
107/172 KB
111/172 KB
113/172 KB
115/172 KB
119/172 KB
121/172 KB
123/172 KB
127/172 KB
129/172 KB
131/172 KB
135/172 KB
137/172 KB
139/172 KB
143/172 KB
145/172 KB
147/172 KB
151/172 KB
152/172 KB
155/172 KB
159/172 KB
160/172 KB
163/172 KB
167/172 KB
168/172 KB
171/172 KB
172/172 KB
Downloaded: https://repository.apache.org/content/repositories/releases/org/apache/hbase/hbase-client/1.1.0/hbase-client-1.1.0-tests.jar (172 KB at 285.1 KB/sec)
[INFO]
[INFO] --- maven-clean-plugin:2.5:clean (default-clean) @ phoenix-pig ---
[INFO] Deleting <https://builds.apache.org/job/Phoenix-master/ws/phoenix-pig/target>
[INFO]
[INFO] --- maven-checkstyle-plugin:2.13:check (validate) @ phoenix-pig ---
[INFO]
[INFO] --- build-helper-maven-plugin:1.9.1:add-test-source (add-test-source) @ phoenix-pig ---
[INFO] Test Source directory: <https://builds.apache.org/job/Phoenix-master/ws/phoenix-pig/src/it/java> added.
[INFO]
[INFO] --- build-helper-maven-plugin:1.9.1:add-test-resource (add-test-resource) @ phoenix-pig ---
[INFO]
[INFO] --- maven-remote-resources-plugin:1.5:process (default) @ phoenix-pig ---
[INFO]
[INFO] --- maven-resources-plugin:2.6:resources (default-resources) @ phoenix-pig ---
[INFO] Using 'UTF-8' encoding to copy filtered resources.
[INFO] skip non existing resourceDirectory <https://builds.apache.org/job/Phoenix-master/ws/phoenix-pig/src/main/resources>
[INFO] Copying 3 resources
[INFO]
[INFO] --- maven-compiler-plugin:3.0:compile (default-compile) @ phoenix-pig ---
[INFO] Changes detected - recompiling the module!
[INFO] Compiling 9 source files to <https://builds.apache.org/job/Phoenix-master/ws/phoenix-pig/target/classes>
[INFO]
[INFO] --- maven-dependency-plugin:2.1:build-classpath (create-mrapp-generated-classpath) @ phoenix-pig ---
[INFO] Wrote classpath file '<https://builds.apache.org/job/Phoenix-master/ws/phoenix-pig/target/classes/mrapp-generated-classpath'.>
[INFO]
[INFO] --- maven-resources-plugin:2.6:testResources (default-testResources) @ phoenix-pig ---
[INFO] Using 'UTF-8' encoding to copy filtered resources.
[INFO] skip non existing resourceDirectory <https://builds.apache.org/job/Phoenix-master/ws/phoenix-pig/src/test/resources>
[INFO] skip non existing resourceDirectory <https://builds.apache.org/job/Phoenix-master/ws/phoenix-pig/src/it/resources>
[INFO] Copying 3 resources
[INFO]
[INFO] --- maven-compiler-plugin:3.0:testCompile (default-testCompile) @ phoenix-pig ---
[INFO] Changes detected - recompiling the module!
[INFO] Compiling 8 source files to <https://builds.apache.org/job/Phoenix-master/ws/phoenix-pig/target/test-classes>
[INFO]
[INFO] --- maven-surefire-plugin:2.19:test (default-test) @ phoenix-pig ---
-------------------------------------------------------
T E S T S
-------------------------------------------------------
Running org.apache.phoenix.pig.util.TableSchemaParserFunctionTest
Running org.apache.phoenix.pig.util.PhoenixPigSchemaUtilTest
Running org.apache.phoenix.pig.util.SqlQueryToColumnInfoFunctionTest
Tests run: 3, Failures: 0, Errors: 0, Skipped: 0, Time elapsed: 0.152 sec - in org.apache.phoenix.pig.util.TableSchemaParserFunctionTest
Running org.apache.phoenix.pig.util.TypeUtilTest
Tests run: 1, Failures: 0, Errors: 0, Skipped: 0, Time elapsed: 0.441 sec - in org.apache.phoenix.pig.util.TypeUtilTest
Running org.apache.phoenix.pig.util.QuerySchemaParserFunctionTest
Tests run: 2, Failures: 0, Errors: 0, Skipped: 0, Time elapsed: 0.727 sec - in org.apache.phoenix.pig.util.PhoenixPigSchemaUtilTest
Tests run: 1, Failures: 0, Errors: 0, Skipped: 0, Time elapsed: 2.599 sec - in org.apache.phoenix.pig.util.SqlQueryToColumnInfoFunctionTest
Tests run: 4, Failures: 0, Errors: 0, Skipped: 0, Time elapsed: 2.096 sec - in org.apache.phoenix.pig.util.QuerySchemaParserFunctionTest
Results :
Tests run: 11, Failures: 0, Errors: 0, Skipped: 0
[INFO]
[INFO] --- maven-source-plugin:2.2.1:jar-no-fork (attach-sources) @ phoenix-pig ---
[INFO] Building jar: <https://builds.apache.org/job/Phoenix-master/952/artifact/phoenix-pig/target/phoenix-pig-4.7.0-HBase-1.1-SNAPSHOT-sources.jar>
[INFO]
[INFO] --- maven-jar-plugin:2.4:test-jar (default) @ phoenix-pig ---
[INFO] Building jar: <https://builds.apache.org/job/Phoenix-master/952/artifact/phoenix-pig/target/phoenix-pig-4.7.0-HBase-1.1-SNAPSHOT-tests.jar>
[INFO]
[INFO] --- maven-jar-plugin:2.4:jar (default-jar) @ phoenix-pig ---
[INFO] Building jar: <https://builds.apache.org/job/Phoenix-master/952/artifact/phoenix-pig/target/phoenix-pig-4.7.0-HBase-1.1-SNAPSHOT.jar>
[INFO]
[INFO] --- maven-site-plugin:3.2:attach-descriptor (attach-descriptor) @ phoenix-pig ---
[INFO]
[INFO] --- maven-failsafe-plugin:2.19:integration-test (ClientManagedTimeTests) @ phoenix-pig ---
-------------------------------------------------------
T E S T S
-------------------------------------------------------
Results :
Tests run: 0, Failures: 0, Errors: 0, Skipped: 0
[INFO]
[INFO] --- maven-failsafe-plugin:2.19:integration-test (HBaseManagedTimeTests) @ phoenix-pig ---
-------------------------------------------------------
T E S T S
-------------------------------------------------------
Running org.apache.phoenix.pig.PhoenixHBaseLoaderIT
Running org.apache.phoenix.pig.udf.ReserveNSequenceTestIT
Tests run: 10, Failures: 0, Errors: 0, Skipped: 0, Time elapsed: 2.957 sec - in org.apache.phoenix.pig.udf.ReserveNSequenceTestIT
Running org.apache.phoenix.pig.PhoenixHBaseStorerIT
Tests run: 4, Failures: 0, Errors: 0, Skipped: 0, Time elapsed: 41.87 sec - in org.apache.phoenix.pig.PhoenixHBaseStorerIT
Tests run: 16, Failures: 0, Errors: 0, Skipped: 0, Time elapsed: 135.559 sec - in org.apache.phoenix.pig.PhoenixHBaseLoaderIT
Results :
Tests run: 30, Failures: 0, Errors: 0, Skipped: 0
[INFO]
[INFO] --- maven-failsafe-plugin:2.19:integration-test (NeedTheirOwnClusterTests) @ phoenix-pig ---
-------------------------------------------------------
T E S T S
-------------------------------------------------------
Results :
Tests run: 0, Failures: 0, Errors: 0, Skipped: 0
[INFO]
[INFO] --- maven-failsafe-plugin:2.19:verify (ClientManagedTimeTests) @ phoenix-pig ---
[INFO] ------------------------------------------------------------------------
[INFO] Reactor Summary:
[INFO]
[INFO] Apache Phoenix .................................... SUCCESS [3.799s]
[INFO] Phoenix Core ...................................... SUCCESS [1:01:42.789s]
[INFO] Phoenix - Flume ................................... SUCCESS [1:29.460s]
[INFO] Phoenix - Pig ..................................... FAILURE [3:08.255s]
[INFO] Phoenix Query Server Client ....................... SKIPPED
[INFO] Phoenix Query Server .............................. SKIPPED
[INFO] Phoenix - Pherf ................................... SKIPPED
[INFO] Phoenix - Spark ................................... SKIPPED
[INFO] Phoenix Assembly .................................. SKIPPED
[INFO] Phoenix - Tracing Web Application ................. SKIPPED
[INFO] ------------------------------------------------------------------------
[INFO] BUILD FAILURE
[INFO] ------------------------------------------------------------------------
[INFO] Total time: 1:06:24.943s
[INFO] Finished at: Thu Nov 12 18:51:20 UTC 2015
[INFO] Final Memory: 67M/1025M
[INFO] ------------------------------------------------------------------------
[ERROR] Failed to execute goal org.apache.maven.plugins:maven-failsafe-plugin:2.19:verify (ClientManagedTimeTests) on project phoenix-pig: There was a timeout or other error in the fork -> [Help 1]
[ERROR]
[ERROR] To see the full stack trace of the errors, re-run Maven with the -e switch.
[ERROR] Re-run Maven using the -X switch to enable full debug logging.
[ERROR]
[ERROR] For more information about the errors and possible solutions, please read the following articles:
[ERROR] [Help 1] http://cwiki.apache.org/confluence/display/MAVEN/MojoExecutionException
[ERROR]
[ERROR] After correcting the problems, you can resume the build with the command
[ERROR] mvn <goals> -rf :phoenix-pig
Build step 'Invoke top-level Maven targets' marked build as failure
Archiving artifacts
Compressed 1.18 GB of artifacts by 50.4% relative to #951
Updating PHOENIX-2406
Recording test results
Jenkins build is back to normal : Phoenix | Master #958
Posted by Apache Jenkins Server <je...@builds.apache.org>.
See <https://builds.apache.org/job/Phoenix-master/958/changes>
Build failed in Jenkins: Phoenix | Master #957
Posted by Apache Jenkins Server <je...@builds.apache.org>.
See <https://builds.apache.org/job/Phoenix-master/957/changes>
Changes:
[jmahonin] PHOENIX-2288: PDecimal precision and scale aren't carried through to
------------------------------------------
[...truncated 7251 lines...]
Tests run: 3, Failures: 0, Errors: 0, Skipped: 0, Time elapsed: 55.577 sec - in org.apache.phoenix.end2end.index.SaltedIndexIT
Running org.apache.phoenix.end2end.index.MutableIndexIT
Tests run: 108, Failures: 0, Errors: 0, Skipped: 0, Time elapsed: 627.41 sec - in org.apache.phoenix.end2end.SpooledSortMergeJoinIT
Running org.apache.phoenix.end2end.index.IndexExpressionIT
Tests run: 6, Failures: 0, Errors: 0, Skipped: 0, Time elapsed: 103.892 sec - in org.apache.phoenix.end2end.index.IndexMetadataIT
Running org.apache.phoenix.end2end.index.DropViewIT
Tests run: 1, Failures: 0, Errors: 0, Skipped: 0, Time elapsed: 13.423 sec - in org.apache.phoenix.end2end.index.DropViewIT
Running org.apache.phoenix.end2end.index.ViewIndexIT
Tests run: 1, Failures: 0, Errors: 0, Skipped: 0, Time elapsed: 15.14 sec - in org.apache.phoenix.end2end.index.ViewIndexIT
Running org.apache.phoenix.end2end.index.ImmutableIndexIT
Tests run: 2, Failures: 0, Errors: 0, Skipped: 0, Time elapsed: 28.866 sec - in org.apache.phoenix.end2end.index.ImmutableIndexIT
Running org.apache.phoenix.end2end.ServerExceptionIT
Tests run: 1, Failures: 0, Errors: 0, Skipped: 0, Time elapsed: 7.417 sec - in org.apache.phoenix.end2end.ServerExceptionIT
Running org.apache.phoenix.end2end.CSVCommonsLoaderIT
Tests run: 12, Failures: 0, Errors: 0, Skipped: 0, Time elapsed: 161.299 sec - in org.apache.phoenix.end2end.index.MutableIndexIT
Running org.apache.phoenix.end2end.ReverseFunctionIT
Tests run: 5, Failures: 0, Errors: 0, Skipped: 0, Time elapsed: 10.011 sec - in org.apache.phoenix.end2end.ReverseFunctionIT
Running org.apache.phoenix.end2end.GetSetByteBitFunctionEnd2EndIT
Tests run: 1, Failures: 0, Errors: 0, Skipped: 0, Time elapsed: 6.873 sec - in org.apache.phoenix.end2end.GetSetByteBitFunctionEnd2EndIT
Running org.apache.phoenix.end2end.ArrayAppendFunctionIT
Tests run: 16, Failures: 0, Errors: 0, Skipped: 0, Time elapsed: 49.794 sec - in org.apache.phoenix.end2end.CSVCommonsLoaderIT
Running org.apache.phoenix.end2end.LnLogFunctionEnd2EndIT
Tests run: 1, Failures: 0, Errors: 0, Skipped: 0, Time elapsed: 14.87 sec - in org.apache.phoenix.end2end.LnLogFunctionEnd2EndIT
Running org.apache.phoenix.end2end.AutoCommitIT
Tests run: 34, Failures: 0, Errors: 0, Skipped: 0, Time elapsed: 45.061 sec - in org.apache.phoenix.end2end.ArrayAppendFunctionIT
Running org.apache.phoenix.end2end.TenantIdTypeIT
Tests run: 1, Failures: 0, Errors: 0, Skipped: 0, Time elapsed: 5.448 sec - in org.apache.phoenix.end2end.AutoCommitIT
Running org.apache.phoenix.end2end.PowerFunctionEnd2EndIT
Tests run: 20, Failures: 0, Errors: 0, Skipped: 0, Time elapsed: 391.872 sec - in org.apache.phoenix.end2end.index.LocalIndexIT
Running org.apache.phoenix.end2end.TenantSpecificViewIndexSaltedIT
Tests run: 1, Failures: 0, Errors: 0, Skipped: 0, Time elapsed: 12.714 sec - in org.apache.phoenix.end2end.PowerFunctionEnd2EndIT
Running org.apache.phoenix.end2end.DateTimeIT
Tests run: 19, Failures: 0, Errors: 0, Skipped: 0, Time elapsed: 19.507 sec - in org.apache.phoenix.end2end.DateTimeIT
Running org.apache.phoenix.end2end.SpooledTmpFileDeleteIT
Tests run: 4, Failures: 0, Errors: 0, Skipped: 0, Time elapsed: 23.395 sec - in org.apache.phoenix.end2end.TenantSpecificViewIndexSaltedIT
Running org.apache.phoenix.end2end.CbrtFunctionEnd2EndIT
Tests run: 1, Failures: 0, Errors: 0, Skipped: 0, Time elapsed: 9.579 sec - in org.apache.phoenix.end2end.SpooledTmpFileDeleteIT
Running org.apache.phoenix.end2end.DecodeFunctionIT
Tests run: 2, Failures: 0, Errors: 0, Skipped: 0, Time elapsed: 17.788 sec - in org.apache.phoenix.end2end.CbrtFunctionEnd2EndIT
Tests run: 6, Failures: 0, Errors: 0, Skipped: 0, Time elapsed: 8.765 sec - in org.apache.phoenix.end2end.DecodeFunctionIT
Running org.apache.phoenix.end2end.ModulusExpressionIT
Running org.apache.phoenix.end2end.OctetLengthFunctionEnd2EndIT
Tests run: 1, Failures: 0, Errors: 0, Skipped: 0, Time elapsed: 7.583 sec - in org.apache.phoenix.end2end.OctetLengthFunctionEnd2EndIT
Running org.apache.phoenix.end2end.LastValueFunctionIT
Tests run: 11, Failures: 0, Errors: 0, Skipped: 0, Time elapsed: 13.443 sec - in org.apache.phoenix.end2end.ModulusExpressionIT
Running org.apache.phoenix.end2end.UpgradeIT
Tests run: 11, Failures: 0, Errors: 0, Skipped: 0, Time elapsed: 20.24 sec - in org.apache.phoenix.end2end.LastValueFunctionIT
Running org.apache.phoenix.end2end.FirstValueFunctionIT
Tests run: 7, Failures: 0, Errors: 0, Skipped: 0, Time elapsed: 8.117 sec - in org.apache.phoenix.end2end.FirstValueFunctionIT
Running org.apache.phoenix.end2end.DisableLocalIndexIT
Tests run: 1, Failures: 0, Errors: 0, Skipped: 0, Time elapsed: 13.333 sec - in org.apache.phoenix.end2end.DisableLocalIndexIT
Running org.apache.phoenix.end2end.HashJoinLocalIndexIT
Tests run: 1, Failures: 0, Errors: 0, Skipped: 0, Time elapsed: 49.732 sec - in org.apache.phoenix.end2end.HashJoinLocalIndexIT
Running org.apache.phoenix.end2end.UpsertBigValuesIT
Tests run: 6, Failures: 0, Errors: 0, Skipped: 0, Time elapsed: 105.464 sec - in org.apache.phoenix.end2end.UpgradeIT
Running org.apache.phoenix.end2end.MD5FunctionIT
Tests run: 3, Failures: 0, Errors: 0, Skipped: 0, Time elapsed: 18.167 sec - in org.apache.phoenix.end2end.MD5FunctionIT
Tests run: 4, Failures: 0, Errors: 0, Skipped: 0, Time elapsed: 37.35 sec - in org.apache.phoenix.end2end.UpsertBigValuesIT
Running org.apache.phoenix.end2end.LpadFunctionIT
Running org.apache.phoenix.end2end.SignFunctionEnd2EndIT
Tests run: 15, Failures: 0, Errors: 0, Skipped: 0, Time elapsed: 206.757 sec - in org.apache.phoenix.end2end.TenantIdTypeIT
Running org.apache.phoenix.end2end.SortOrderIT
Tests run: 2, Failures: 0, Errors: 0, Skipped: 0, Time elapsed: 19.044 sec - in org.apache.phoenix.end2end.SignFunctionEnd2EndIT
Running org.apache.phoenix.end2end.ArrayToStringFunctionIT
Tests run: 62, Failures: 0, Errors: 0, Skipped: 0, Time elapsed: 352.727 sec - in org.apache.phoenix.end2end.index.IndexExpressionIT
Running org.apache.phoenix.end2end.QueryExecWithoutSCNIT
Tests run: 1, Failures: 0, Errors: 0, Skipped: 0, Time elapsed: 10.183 sec - in org.apache.phoenix.end2end.QueryExecWithoutSCNIT
Running org.apache.phoenix.end2end.RegexpReplaceFunctionIT
Tests run: 12, Failures: 0, Errors: 0, Skipped: 0, Time elapsed: 36.922 sec - in org.apache.phoenix.end2end.LpadFunctionIT
Running org.apache.phoenix.end2end.DynamicFamilyIT
Tests run: 2, Failures: 0, Errors: 0, Skipped: 0, Time elapsed: 7.623 sec - in org.apache.phoenix.end2end.RegexpReplaceFunctionIT
Running org.apache.phoenix.end2end.RoundFloorCeilFunctionsEnd2EndIT
Tests run: 36, Failures: 0, Errors: 0, Skipped: 0, Time elapsed: 28.959 sec - in org.apache.phoenix.end2end.ArrayToStringFunctionIT
Running org.apache.phoenix.end2end.DeleteIT
Tests run: 4, Failures: 0, Errors: 0, Skipped: 0, Time elapsed: 19.456 sec - in org.apache.phoenix.end2end.DynamicFamilyIT
Running org.apache.phoenix.end2end.InListIT
Tests run: 31, Failures: 0, Errors: 0, Skipped: 0, Time elapsed: 35.986 sec - in org.apache.phoenix.end2end.RoundFloorCeilFunctionsEnd2EndIT
Running org.apache.phoenix.end2end.EvaluationOfORIT
Tests run: 2, Failures: 0, Errors: 0, Skipped: 0, Time elapsed: 7.142 sec - in org.apache.phoenix.end2end.EvaluationOfORIT
Running org.apache.phoenix.end2end.ReverseScanIT
Tests run: 3, Failures: 0, Errors: 0, Skipped: 0, Time elapsed: 17.701 sec - in org.apache.phoenix.end2end.ReverseScanIT
Running org.apache.phoenix.end2end.RTrimFunctionIT
Tests run: 2, Failures: 0, Errors: 0, Skipped: 0, Time elapsed: 7.599 sec - in org.apache.phoenix.end2end.RTrimFunctionIT
Running org.apache.phoenix.end2end.NthValueFunctionIT
Tests run: 22, Failures: 0, Errors: 0, Skipped: 0, Time elapsed: 67.574 sec - in org.apache.phoenix.end2end.DeleteIT
Running org.apache.phoenix.end2end.ReadOnlyIT
Tests run: 1, Failures: 0, Errors: 0, Skipped: 0, Time elapsed: 15.92 sec - in org.apache.phoenix.end2end.ReadOnlyIT
Running org.apache.phoenix.end2end.ArrayPrependFunctionIT
Tests run: 11, Failures: 0, Errors: 0, Skipped: 0, Time elapsed: 22.157 sec - in org.apache.phoenix.end2end.NthValueFunctionIT
Running org.apache.phoenix.end2end.ExecuteStatementsIT
Tests run: 45, Failures: 0, Errors: 0, Skipped: 0, Time elapsed: 132.198 sec - in org.apache.phoenix.end2end.SortOrderIT
Running org.apache.phoenix.iterate.RoundRobinResultIteratorIT
Tests run: 34, Failures: 0, Errors: 0, Skipped: 0, Time elapsed: 39.083 sec - in org.apache.phoenix.end2end.ArrayPrependFunctionIT
Running org.apache.phoenix.iterate.PhoenixQueryTimeoutIT
Tests run: 2, Failures: 0, Errors: 0, Skipped: 0, Time elapsed: 38.916 sec - in org.apache.phoenix.end2end.ExecuteStatementsIT
Tests run: 2, Failures: 0, Errors: 0, Skipped: 0, Time elapsed: 7.182 sec - in org.apache.phoenix.iterate.PhoenixQueryTimeoutIT
Tests run: 60, Failures: 0, Errors: 0, Skipped: 4, Time elapsed: 823.536 sec - in org.apache.phoenix.end2end.index.IndexIT
Tests run: 28, Failures: 0, Errors: 0, Skipped: 0, Time elapsed: 137.657 sec - in org.apache.phoenix.end2end.InListIT
Tests run: 9, Failures: 0, Errors: 0, Skipped: 0, Time elapsed: 111.027 sec - in org.apache.phoenix.iterate.RoundRobinResultIteratorIT
Results :
Tests run: 1208, Failures: 0, Errors: 0, Skipped: 4
[INFO]
[INFO] --- maven-failsafe-plugin:2.19:integration-test (NeedTheirOwnClusterTests) @ phoenix-core ---
-------------------------------------------------------
T E S T S
-------------------------------------------------------
Running org.apache.phoenix.mapreduce.IndexToolIT
Running org.apache.phoenix.rpc.PhoenixClientRpcIT
Running org.apache.phoenix.rpc.PhoenixServerRpcIT
Tests run: 2, Failures: 0, Errors: 0, Skipped: 0, Time elapsed: 9.91 sec - in org.apache.phoenix.rpc.PhoenixClientRpcIT
Running org.apache.phoenix.execute.PartialCommitIT
Running org.apache.phoenix.mapreduce.CsvBulkLoadToolIT
Tests run: 2, Failures: 0, Errors: 0, Skipped: 0, Time elapsed: 19.662 sec - in org.apache.phoenix.rpc.PhoenixServerRpcIT
Tests run: 6, Failures: 0, Errors: 0, Skipped: 0, Time elapsed: 9.671 sec - in org.apache.phoenix.execute.PartialCommitIT
Running org.apache.phoenix.end2end.ConnectionUtilIT
Running org.apache.phoenix.end2end.MultiCfQueryExecIT
Running org.apache.phoenix.end2end.ViewIT
Tests run: 7, Failures: 0, Errors: 0, Skipped: 0, Time elapsed: 24.551 sec - in org.apache.phoenix.end2end.MultiCfQueryExecIT
Tests run: 1, Failures: 0, Errors: 0, Skipped: 0, Time elapsed: 28.535 sec - in org.apache.phoenix.end2end.ConnectionUtilIT
Running org.apache.phoenix.end2end.StatsCollectorIT
Tests run: 22, Failures: 0, Errors: 0, Skipped: 0, Time elapsed: 93.245 sec - in org.apache.phoenix.end2end.ViewIT
Tests run: 4, Failures: 0, Errors: 0, Skipped: 0, Time elapsed: 63.485 sec - in org.apache.phoenix.end2end.StatsCollectorIT
Running org.apache.phoenix.end2end.SaltedViewIT
Running org.apache.phoenix.end2end.index.ImmutableIndexWithStatsIT
Tests run: 1, Failures: 0, Errors: 0, Skipped: 0, Time elapsed: 14.184 sec - in org.apache.phoenix.end2end.index.ImmutableIndexWithStatsIT
Tests run: 2, Failures: 0, Errors: 0, Skipped: 0, Time elapsed: 26.093 sec - in org.apache.phoenix.end2end.SaltedViewIT
Running org.apache.phoenix.end2end.index.MutableIndexFailureIT
Running org.apache.phoenix.end2end.index.MutableIndexReplicationIT
Tests run: 5, Failures: 0, Errors: 0, Skipped: 0, Time elapsed: 189.896 sec - in org.apache.phoenix.mapreduce.CsvBulkLoadToolIT
Tests run: 3, Failures: 0, Errors: 0, Skipped: 2, Time elapsed: 45.577 sec - in org.apache.phoenix.end2end.index.MutableIndexFailureIT
Running org.apache.phoenix.end2end.SpillableGroupByIT
Tests run: 1, Failures: 0, Errors: 0, Skipped: 0, Time elapsed: 36.377 sec - in org.apache.phoenix.end2end.index.MutableIndexReplicationIT
Tests run: 1, Failures: 0, Errors: 0, Skipped: 0, Time elapsed: 12.674 sec - in org.apache.phoenix.end2end.SpillableGroupByIT
Running org.apache.phoenix.end2end.CountDistinctCompressionIT
Tests run: 1, Failures: 0, Errors: 0, Skipped: 0, Time elapsed: 5.021 sec - in org.apache.phoenix.end2end.CountDistinctCompressionIT
Running org.apache.phoenix.end2end.KeyOnlyIT
Running org.apache.phoenix.end2end.TenantSpecificTablesDMLIT
Running org.apache.phoenix.end2end.TenantSpecificTablesDDLIT
Tests run: 3, Failures: 0, Errors: 0, Skipped: 0, Time elapsed: 14.657 sec - in org.apache.phoenix.end2end.KeyOnlyIT
Running org.apache.phoenix.end2end.ContextClassloaderIT
Tests run: 3, Failures: 0, Errors: 0, Skipped: 0, Time elapsed: 11.446 sec - in org.apache.phoenix.end2end.ContextClassloaderIT
Tests run: 16, Failures: 0, Errors: 0, Skipped: 0, Time elapsed: 54.786 sec - in org.apache.phoenix.end2end.TenantSpecificTablesDMLIT
Running org.apache.phoenix.end2end.QueryTimeoutIT
Tests run: 17, Failures: 0, Errors: 0, Skipped: 0, Time elapsed: 60.516 sec - in org.apache.phoenix.end2end.TenantSpecificTablesDDLIT
Tests run: 1, Failures: 0, Errors: 0, Skipped: 0, Time elapsed: 15.429 sec - in org.apache.phoenix.end2end.QueryTimeoutIT
Running org.apache.phoenix.end2end.UserDefinedFunctionsIT
Running org.apache.phoenix.end2end.QueryWithLimitIT
Running org.apache.phoenix.end2end.StatsCollectorWithSplitsAndMultiCFIT
Tests run: 2, Failures: 0, Errors: 0, Skipped: 0, Time elapsed: 23.083 sec - in org.apache.phoenix.end2end.QueryWithLimitIT
Tests run: 2, Failures: 0, Errors: 0, Skipped: 0, Time elapsed: 35.359 sec - in org.apache.phoenix.end2end.StatsCollectorWithSplitsAndMultiCFIT
Tests run: 13, Failures: 0, Errors: 0, Skipped: 0, Time elapsed: 46.386 sec - in org.apache.phoenix.end2end.UserDefinedFunctionsIT
Running org.apache.phoenix.end2end.UnionAllIT
Tests run: 9, Failures: 0, Errors: 0, Skipped: 0, Time elapsed: 421.608 sec - in org.apache.phoenix.mapreduce.IndexToolIT
Running org.apache.phoenix.iterate.RoundRobinResultIteratorWithStatsIT
Running org.apache.phoenix.end2end.ParallelIteratorsIT
Running org.apache.phoenix.hbase.index.covered.EndToEndCoveredColumnsIndexBuilderIT
Tests run: 1, Failures: 0, Errors: 0, Skipped: 0, Time elapsed: 14.343 sec - in org.apache.phoenix.iterate.RoundRobinResultIteratorWithStatsIT
Tests run: 12, Failures: 0, Errors: 0, Skipped: 0, Time elapsed: 41.64 sec - in org.apache.phoenix.end2end.UnionAllIT
Running org.apache.phoenix.hbase.index.covered.example.EndtoEndIndexingWithCompressionIT
Tests run: 2, Failures: 0, Errors: 0, Skipped: 0, Time elapsed: 27.912 sec - in org.apache.phoenix.hbase.index.covered.EndToEndCoveredColumnsIndexBuilderIT
Tests run: 3, Failures: 0, Errors: 0, Skipped: 0, Time elapsed: 44.565 sec - in org.apache.phoenix.end2end.ParallelIteratorsIT
Running org.apache.phoenix.hbase.index.covered.example.FailWithoutRetriesIT
Running org.apache.phoenix.hbase.index.balancer.IndexLoadBalancerIT
Tests run: 1, Failures: 0, Errors: 0, Skipped: 0, Time elapsed: 7.911 sec - in org.apache.phoenix.hbase.index.covered.example.FailWithoutRetriesIT
Running org.apache.phoenix.hbase.index.FailForUnsupportedHBaseVersionsIT
Running org.apache.phoenix.hbase.index.covered.example.EndToEndCoveredIndexingIT
Tests run: 2, Failures: 0, Errors: 0, Skipped: 0, Time elapsed: 18.94 sec - in org.apache.phoenix.hbase.index.FailForUnsupportedHBaseVersionsIT
Running org.apache.phoenix.monitoring.PhoenixMetricsIT
Tests run: 11, Failures: 0, Errors: 1, Skipped: 0, Time elapsed: 154.401 sec <<< FAILURE! - in org.apache.phoenix.hbase.index.covered.example.EndtoEndIndexingWithCompressionIT
testExceedVersionsOutOfOrderPut(org.apache.phoenix.hbase.index.covered.example.EndtoEndIndexingWithCompressionIT) Time elapsed: 3.743 sec <<< ERROR!
java.lang.RuntimeException: java.util.concurrent.RejectedExecutionException: Task org.apache.hadoop.hbase.client.ResultBoundedCompletionService$QueueingFuture@117f39f1 rejected from java.util.concurrent.ThreadPoolExecutor@37b50630[Running, pool size = 2, active threads = 2, queued tasks = 0, completed tasks = 13]
Caused by: java.util.concurrent.RejectedExecutionException: Task org.apache.hadoop.hbase.client.ResultBoundedCompletionService$QueueingFuture@117f39f1 rejected from java.util.concurrent.ThreadPoolExecutor@37b50630[Running, pool size = 2, active threads = 2, queued tasks = 0, completed tasks = 13]
Running org.apache.hadoop.hbase.regionserver.wal.WALReplayWithIndexWritesAndCompressedWALIT
Tests run: 17, Failures: 2, Errors: 0, Skipped: 0, Time elapsed: 88.788 sec <<< FAILURE! - in org.apache.phoenix.monitoring.PhoenixMetricsIT
testMetricsForUpsertSelectWithAutoCommit(org.apache.phoenix.monitoring.PhoenixMetricsIT) Time elapsed: 8.022 sec <<< FAILURE!
java.lang.AssertionError: Unequal values for metric MUTATION_BYTES expected:<5600> but was:<16240>
at org.apache.phoenix.monitoring.PhoenixMetricsIT.assertMetricsHaveSameValues(PhoenixMetricsIT.java:654)
at org.apache.phoenix.monitoring.PhoenixMetricsIT.assertMetricsAreSame(PhoenixMetricsIT.java:643)
at org.apache.phoenix.monitoring.PhoenixMetricsIT.testMetricsForUpsertSelectWithAutoCommit(PhoenixMetricsIT.java:462)
testMetricsForUpsertSelectSameTable(org.apache.phoenix.monitoring.PhoenixMetricsIT) Time elapsed: 3.018 sec <<< FAILURE!
java.lang.AssertionError: Unequal values for metric MUTATION_BYTES expected:<5600> but was:<16240>
at org.apache.phoenix.monitoring.PhoenixMetricsIT.assertMetricsHaveSameValues(PhoenixMetricsIT.java:654)
at org.apache.phoenix.monitoring.PhoenixMetricsIT.assertMetricsAreSame(PhoenixMetricsIT.java:643)
at org.apache.phoenix.monitoring.PhoenixMetricsIT.testMetricsForUpsertSelectSameTable(PhoenixMetricsIT.java:615)
Running org.apache.hadoop.hbase.regionserver.wal.WALReplayWithIndexWritesAndUncompressedWALInHBase_094_9_IT
Tests run: 1, Failures: 0, Errors: 0, Skipped: 0, Time elapsed: 27.856 sec - in org.apache.hadoop.hbase.regionserver.wal.WALReplayWithIndexWritesAndCompressedWALIT
Tests run: 1, Failures: 0, Errors: 0, Skipped: 0, Time elapsed: 27.619 sec - in org.apache.hadoop.hbase.regionserver.wal.WALReplayWithIndexWritesAndUncompressedWALInHBase_094_9_IT
Tests run: 11, Failures: 0, Errors: 0, Skipped: 0, Time elapsed: 180.376 sec - in org.apache.phoenix.hbase.index.covered.example.EndToEndCoveredIndexingIT
Tests run: 9, Failures: 0, Errors: 0, Skipped: 0, Time elapsed: 253.492 sec - in org.apache.phoenix.hbase.index.balancer.IndexLoadBalancerIT
Running org.apache.phoenix.end2end.AlterTableIT
Tests run: 55, Failures: 0, Errors: 0, Skipped: 0, Time elapsed: 470.17 sec - in org.apache.phoenix.end2end.AlterTableIT
Results :
Failed tests:
PhoenixMetricsIT.testMetricsForUpsertSelectSameTable:615->assertMetricsAreSame:643->assertMetricsHaveSameValues:654 Unequal values for metric MUTATION_BYTES expected:<5600> but was:<16240>
PhoenixMetricsIT.testMetricsForUpsertSelectWithAutoCommit:462->assertMetricsAreSame:643->assertMetricsHaveSameValues:654 Unequal values for metric MUTATION_BYTES expected:<5600> but was:<16240>
Tests in error:
EndtoEndIndexingWithCompressionIT>EndToEndCoveredIndexingIT.testExceedVersionsOutOfOrderPut:675 » Runtime
Tests run: 250, Failures: 2, Errors: 1, Skipped: 2
[INFO]
[INFO] --- maven-failsafe-plugin:2.19:verify (ClientManagedTimeTests) @ phoenix-core ---
[INFO] ------------------------------------------------------------------------
[INFO] Reactor Summary:
[INFO]
[INFO] Apache Phoenix .................................... SUCCESS [2.882s]
[INFO] Phoenix Core ...................................... FAILURE [1:06:33.334s]
[INFO] Phoenix - Flume ................................... SKIPPED
[INFO] Phoenix - Pig ..................................... SKIPPED
[INFO] Phoenix Query Server Client ....................... SKIPPED
[INFO] Phoenix Query Server .............................. SKIPPED
[INFO] Phoenix - Pherf ................................... SKIPPED
[INFO] Phoenix - Spark ................................... SKIPPED
[INFO] Phoenix Assembly .................................. SKIPPED
[INFO] Phoenix - Tracing Web Application ................. SKIPPED
[INFO] ------------------------------------------------------------------------
[INFO] BUILD FAILURE
[INFO] ------------------------------------------------------------------------
[INFO] Total time: 1:06:36.762s
[INFO] Finished at: Fri Nov 13 19:00:06 UTC 2015
[INFO] Final Memory: 50M/1055M
[INFO] ------------------------------------------------------------------------
[ERROR] Failed to execute goal org.apache.maven.plugins:maven-failsafe-plugin:2.19:verify (ClientManagedTimeTests) on project phoenix-core: There are test failures.
[ERROR]
[ERROR] Please refer to <https://builds.apache.org/job/Phoenix-master/ws/phoenix-core/target/failsafe-reports> for the individual test results.
[ERROR] -> [Help 1]
[ERROR]
[ERROR] To see the full stack trace of the errors, re-run Maven with the -e switch.
[ERROR] Re-run Maven using the -X switch to enable full debug logging.
[ERROR]
[ERROR] For more information about the errors and possible solutions, please read the following articles:
[ERROR] [Help 1] http://cwiki.apache.org/confluence/display/MAVEN/MojoFailureException
[ERROR]
[ERROR] After correcting the problems, you can resume the build with the command
[ERROR] mvn <goals> -rf :phoenix-core
Build step 'Invoke top-level Maven targets' marked build as failure
Archiving artifacts
Compressed 1.23 GB of artifacts by 51.3% relative to #951
Updating PHOENIX-2288
Recording test results
Build failed in Jenkins: Phoenix | Master #956
Posted by Apache Jenkins Server <je...@builds.apache.org>.
See <https://builds.apache.org/job/Phoenix-master/956/changes>
Changes:
[jtaylor] PHOENIX-2414 Parameterize index tests
------------------------------------------
[...truncated 7259 lines...]
Tests run: 6, Failures: 0, Errors: 0, Skipped: 0, Time elapsed: 102.583 sec - in org.apache.phoenix.end2end.index.IndexMetadataIT
Running org.apache.phoenix.end2end.index.IndexExpressionIT
Tests run: 108, Failures: 0, Errors: 0, Skipped: 0, Time elapsed: 626.617 sec - in org.apache.phoenix.end2end.SpooledSortMergeJoinIT
Running org.apache.phoenix.end2end.index.DropViewIT
Tests run: 1, Failures: 0, Errors: 0, Skipped: 0, Time elapsed: 14.501 sec - in org.apache.phoenix.end2end.index.DropViewIT
Running org.apache.phoenix.end2end.index.ViewIndexIT
Tests run: 1, Failures: 0, Errors: 0, Skipped: 0, Time elapsed: 12.748 sec - in org.apache.phoenix.end2end.index.ViewIndexIT
Running org.apache.phoenix.end2end.index.ImmutableIndexIT
Tests run: 12, Failures: 0, Errors: 0, Skipped: 0, Time elapsed: 159.293 sec - in org.apache.phoenix.end2end.index.MutableIndexIT
Running org.apache.phoenix.end2end.ServerExceptionIT
Tests run: 1, Failures: 0, Errors: 0, Skipped: 0, Time elapsed: 9.063 sec - in org.apache.phoenix.end2end.ServerExceptionIT
Running org.apache.phoenix.end2end.CSVCommonsLoaderIT
Tests run: 2, Failures: 0, Errors: 0, Skipped: 0, Time elapsed: 28.877 sec - in org.apache.phoenix.end2end.index.ImmutableIndexIT
Running org.apache.phoenix.end2end.ReverseFunctionIT
Tests run: 5, Failures: 0, Errors: 0, Skipped: 0, Time elapsed: 7.353 sec - in org.apache.phoenix.end2end.ReverseFunctionIT
Running org.apache.phoenix.end2end.GetSetByteBitFunctionEnd2EndIT
Tests run: 1, Failures: 0, Errors: 0, Skipped: 0, Time elapsed: 9.371 sec - in org.apache.phoenix.end2end.GetSetByteBitFunctionEnd2EndIT
Running org.apache.phoenix.end2end.ArrayAppendFunctionIT
Tests run: 16, Failures: 0, Errors: 0, Skipped: 0, Time elapsed: 55.965 sec - in org.apache.phoenix.end2end.CSVCommonsLoaderIT
Running org.apache.phoenix.end2end.LnLogFunctionEnd2EndIT
Tests run: 20, Failures: 0, Errors: 0, Skipped: 0, Time elapsed: 379.124 sec - in org.apache.phoenix.end2end.index.LocalIndexIT
Running org.apache.phoenix.end2end.AutoCommitIT
Tests run: 34, Failures: 0, Errors: 0, Skipped: 0, Time elapsed: 30.315 sec - in org.apache.phoenix.end2end.ArrayAppendFunctionIT
Running org.apache.phoenix.end2end.TenantIdTypeIT
Tests run: 1, Failures: 0, Errors: 0, Skipped: 0, Time elapsed: 13.86 sec - in org.apache.phoenix.end2end.LnLogFunctionEnd2EndIT
Tests run: 1, Failures: 0, Errors: 0, Skipped: 0, Time elapsed: 9.459 sec - in org.apache.phoenix.end2end.AutoCommitIT
Running org.apache.phoenix.end2end.PowerFunctionEnd2EndIT
Running org.apache.phoenix.end2end.TenantSpecificViewIndexSaltedIT
Tests run: 1, Failures: 0, Errors: 0, Skipped: 0, Time elapsed: 15.512 sec - in org.apache.phoenix.end2end.PowerFunctionEnd2EndIT
Running org.apache.phoenix.end2end.DateTimeIT
Tests run: 4, Failures: 0, Errors: 0, Skipped: 0, Time elapsed: 23.516 sec - in org.apache.phoenix.end2end.TenantSpecificViewIndexSaltedIT
Running org.apache.phoenix.end2end.SpooledTmpFileDeleteIT
Tests run: 1, Failures: 0, Errors: 0, Skipped: 0, Time elapsed: 7.509 sec - in org.apache.phoenix.end2end.SpooledTmpFileDeleteIT
Running org.apache.phoenix.end2end.CbrtFunctionEnd2EndIT
Tests run: 2, Failures: 0, Errors: 0, Skipped: 0, Time elapsed: 13 sec - in org.apache.phoenix.end2end.CbrtFunctionEnd2EndIT
Running org.apache.phoenix.end2end.DecodeFunctionIT
Tests run: 19, Failures: 0, Errors: 0, Skipped: 0, Time elapsed: 33.66 sec - in org.apache.phoenix.end2end.DateTimeIT
Running org.apache.phoenix.end2end.ModulusExpressionIT
Tests run: 6, Failures: 0, Errors: 0, Skipped: 0, Time elapsed: 8.678 sec - in org.apache.phoenix.end2end.DecodeFunctionIT
Running org.apache.phoenix.end2end.OctetLengthFunctionEnd2EndIT
Tests run: 1, Failures: 0, Errors: 0, Skipped: 0, Time elapsed: 6.339 sec - in org.apache.phoenix.end2end.OctetLengthFunctionEnd2EndIT
Running org.apache.phoenix.end2end.LastValueFunctionIT
Tests run: 11, Failures: 0, Errors: 0, Skipped: 0, Time elapsed: 16.692 sec - in org.apache.phoenix.end2end.ModulusExpressionIT
Running org.apache.phoenix.end2end.UpgradeIT
Tests run: 11, Failures: 0, Errors: 0, Skipped: 0, Time elapsed: 18.909 sec - in org.apache.phoenix.end2end.LastValueFunctionIT
Running org.apache.phoenix.end2end.FirstValueFunctionIT
Tests run: 7, Failures: 0, Errors: 0, Skipped: 0, Time elapsed: 7.789 sec - in org.apache.phoenix.end2end.FirstValueFunctionIT
Running org.apache.phoenix.end2end.DisableLocalIndexIT
Tests run: 1, Failures: 0, Errors: 0, Skipped: 0, Time elapsed: 14.311 sec - in org.apache.phoenix.end2end.DisableLocalIndexIT
Running org.apache.phoenix.end2end.HashJoinLocalIndexIT
Tests run: 1, Failures: 0, Errors: 0, Skipped: 0, Time elapsed: 50.495 sec - in org.apache.phoenix.end2end.HashJoinLocalIndexIT
Running org.apache.phoenix.end2end.UpsertBigValuesIT
Tests run: 6, Failures: 0, Errors: 0, Skipped: 0, Time elapsed: 112.208 sec - in org.apache.phoenix.end2end.UpgradeIT
Running org.apache.phoenix.end2end.MD5FunctionIT
Tests run: 62, Failures: 0, Errors: 0, Skipped: 0, Time elapsed: 330.993 sec - in org.apache.phoenix.end2end.index.IndexExpressionIT
Tests run: 4, Failures: 0, Errors: 0, Skipped: 0, Time elapsed: 30.042 sec - in org.apache.phoenix.end2end.UpsertBigValuesIT
Running org.apache.phoenix.end2end.LpadFunctionIT
Running org.apache.phoenix.end2end.SignFunctionEnd2EndIT
Tests run: 2, Failures: 0, Errors: 0, Skipped: 0, Time elapsed: 15.255 sec - in org.apache.phoenix.end2end.SignFunctionEnd2EndIT
Running org.apache.phoenix.end2end.SortOrderIT
Tests run: 3, Failures: 0, Errors: 0, Skipped: 0, Time elapsed: 18.056 sec - in org.apache.phoenix.end2end.MD5FunctionIT
Running org.apache.phoenix.end2end.ArrayToStringFunctionIT
Tests run: 15, Failures: 0, Errors: 0, Skipped: 0, Time elapsed: 209.799 sec - in org.apache.phoenix.end2end.TenantIdTypeIT
Running org.apache.phoenix.end2end.QueryExecWithoutSCNIT
Tests run: 1, Failures: 0, Errors: 0, Skipped: 0, Time elapsed: 7.637 sec - in org.apache.phoenix.end2end.QueryExecWithoutSCNIT
Running org.apache.phoenix.end2end.RegexpReplaceFunctionIT
Tests run: 2, Failures: 0, Errors: 0, Skipped: 0, Time elapsed: 6.689 sec - in org.apache.phoenix.end2end.RegexpReplaceFunctionIT
Running org.apache.phoenix.end2end.DynamicFamilyIT
Tests run: 12, Failures: 0, Errors: 0, Skipped: 0, Time elapsed: 36.718 sec - in org.apache.phoenix.end2end.LpadFunctionIT
Running org.apache.phoenix.end2end.RoundFloorCeilFunctionsEnd2EndIT
Tests run: 4, Failures: 0, Errors: 0, Skipped: 0, Time elapsed: 15.566 sec - in org.apache.phoenix.end2end.DynamicFamilyIT
Running org.apache.phoenix.end2end.DeleteIT
Tests run: 31, Failures: 0, Errors: 0, Skipped: 0, Time elapsed: 22.069 sec - in org.apache.phoenix.end2end.RoundFloorCeilFunctionsEnd2EndIT
Running org.apache.phoenix.end2end.InListIT
Tests run: 36, Failures: 0, Errors: 0, Skipped: 0, Time elapsed: 46.491 sec - in org.apache.phoenix.end2end.ArrayToStringFunctionIT
Running org.apache.phoenix.end2end.EvaluationOfORIT
Tests run: 2, Failures: 0, Errors: 0, Skipped: 0, Time elapsed: 8.508 sec - in org.apache.phoenix.end2end.EvaluationOfORIT
Running org.apache.phoenix.end2end.ReverseScanIT
Tests run: 3, Failures: 0, Errors: 0, Skipped: 0, Time elapsed: 16.255 sec - in org.apache.phoenix.end2end.ReverseScanIT
Running org.apache.phoenix.end2end.RTrimFunctionIT
Tests run: 2, Failures: 0, Errors: 0, Skipped: 0, Time elapsed: 7.674 sec - in org.apache.phoenix.end2end.RTrimFunctionIT
Running org.apache.phoenix.end2end.NthValueFunctionIT
Tests run: 45, Failures: 0, Errors: 0, Skipped: 0, Time elapsed: 104.826 sec - in org.apache.phoenix.end2end.SortOrderIT
Running org.apache.phoenix.end2end.ReadOnlyIT
Tests run: 11, Failures: 0, Errors: 0, Skipped: 0, Time elapsed: 22.266 sec - in org.apache.phoenix.end2end.NthValueFunctionIT
Running org.apache.phoenix.end2end.ArrayPrependFunctionIT
Tests run: 22, Failures: 0, Errors: 0, Skipped: 0, Time elapsed: 76.352 sec - in org.apache.phoenix.end2end.DeleteIT
Running org.apache.phoenix.end2end.ExecuteStatementsIT
Tests run: 1, Failures: 0, Errors: 0, Skipped: 0, Time elapsed: 12.865 sec - in org.apache.phoenix.end2end.ReadOnlyIT
Running org.apache.phoenix.iterate.RoundRobinResultIteratorIT
Tests run: 60, Failures: 0, Errors: 0, Skipped: 4, Time elapsed: 787.406 sec - in org.apache.phoenix.end2end.index.IndexIT
Running org.apache.phoenix.iterate.PhoenixQueryTimeoutIT
Tests run: 2, Failures: 0, Errors: 0, Skipped: 0, Time elapsed: 7.101 sec - in org.apache.phoenix.iterate.PhoenixQueryTimeoutIT
Tests run: 2, Failures: 0, Errors: 0, Skipped: 0, Time elapsed: 35.17 sec - in org.apache.phoenix.end2end.ExecuteStatementsIT
Tests run: 34, Failures: 0, Errors: 0, Skipped: 0, Time elapsed: 49.732 sec - in org.apache.phoenix.end2end.ArrayPrependFunctionIT
Tests run: 28, Failures: 0, Errors: 0, Skipped: 0, Time elapsed: 135.334 sec - in org.apache.phoenix.end2end.InListIT
Tests run: 9, Failures: 0, Errors: 0, Skipped: 0, Time elapsed: 99.042 sec - in org.apache.phoenix.iterate.RoundRobinResultIteratorIT
Results :
Tests run: 1208, Failures: 0, Errors: 0, Skipped: 4
[INFO]
[INFO] --- maven-failsafe-plugin:2.19:integration-test (NeedTheirOwnClusterTests) @ phoenix-core ---
-------------------------------------------------------
T E S T S
-------------------------------------------------------
Running org.apache.phoenix.rpc.PhoenixServerRpcIT
Running org.apache.phoenix.rpc.PhoenixClientRpcIT
Running org.apache.phoenix.mapreduce.IndexToolIT
Running org.apache.phoenix.execute.PartialCommitIT
Tests run: 6, Failures: 0, Errors: 0, Skipped: 0, Time elapsed: 3.037 sec - in org.apache.phoenix.execute.PartialCommitIT
Tests run: 2, Failures: 0, Errors: 0, Skipped: 0, Time elapsed: 12.629 sec - in org.apache.phoenix.rpc.PhoenixClientRpcIT
Running org.apache.phoenix.mapreduce.CsvBulkLoadToolIT
Tests run: 2, Failures: 0, Errors: 0, Skipped: 0, Time elapsed: 22.653 sec - in org.apache.phoenix.rpc.PhoenixServerRpcIT
Running org.apache.phoenix.end2end.ConnectionUtilIT
Running org.apache.phoenix.end2end.ViewIT
Tests run: 1, Failures: 0, Errors: 0, Skipped: 0, Time elapsed: 28.904 sec - in org.apache.phoenix.end2end.ConnectionUtilIT
Running org.apache.phoenix.end2end.StatsCollectorIT
Tests run: 22, Failures: 0, Errors: 0, Skipped: 0, Time elapsed: 83.729 sec - in org.apache.phoenix.end2end.ViewIT
Running org.apache.phoenix.end2end.AlterTableIT
Tests run: 4, Failures: 0, Errors: 0, Skipped: 0, Time elapsed: 64.436 sec - in org.apache.phoenix.end2end.StatsCollectorIT
Running org.apache.phoenix.end2end.SaltedViewIT
Tests run: 2, Failures: 0, Errors: 0, Skipped: 0, Time elapsed: 23.04 sec - in org.apache.phoenix.end2end.SaltedViewIT
Tests run: 5, Failures: 0, Errors: 0, Skipped: 0, Time elapsed: 185.558 sec - in org.apache.phoenix.mapreduce.CsvBulkLoadToolIT
Running org.apache.phoenix.end2end.index.ImmutableIndexWithStatsIT
Tests run: 1, Failures: 0, Errors: 0, Skipped: 0, Time elapsed: 15.317 sec - in org.apache.phoenix.end2end.index.ImmutableIndexWithStatsIT
Running org.apache.phoenix.end2end.index.MutableIndexFailureIT
Running org.apache.phoenix.end2end.index.MutableIndexReplicationIT
Tests run: 1, Failures: 0, Errors: 0, Skipped: 0, Time elapsed: 40.123 sec - in org.apache.phoenix.end2end.index.MutableIndexReplicationIT
Tests run: 3, Failures: 0, Errors: 0, Skipped: 2, Time elapsed: 45.738 sec - in org.apache.phoenix.end2end.index.MutableIndexFailureIT
Running org.apache.phoenix.end2end.CountDistinctCompressionIT
Running org.apache.phoenix.end2end.SpillableGroupByIT
Tests run: 1, Failures: 0, Errors: 0, Skipped: 0, Time elapsed: 5.236 sec - in org.apache.phoenix.end2end.CountDistinctCompressionIT
Tests run: 1, Failures: 0, Errors: 0, Skipped: 0, Time elapsed: 12.126 sec - in org.apache.phoenix.end2end.SpillableGroupByIT
Running org.apache.phoenix.end2end.KeyOnlyIT
Running org.apache.phoenix.end2end.TenantSpecificTablesDDLIT
Tests run: 3, Failures: 0, Errors: 0, Skipped: 0, Time elapsed: 14.794 sec - in org.apache.phoenix.end2end.KeyOnlyIT
Running org.apache.phoenix.end2end.TenantSpecificTablesDMLIT
Tests run: 17, Failures: 0, Errors: 0, Skipped: 0, Time elapsed: 63.684 sec - in org.apache.phoenix.end2end.TenantSpecificTablesDDLIT
Tests run: 16, Failures: 0, Errors: 0, Skipped: 0, Time elapsed: 54.884 sec - in org.apache.phoenix.end2end.TenantSpecificTablesDMLIT
Tests run: 9, Failures: 0, Errors: 0, Skipped: 0, Time elapsed: 410.327 sec - in org.apache.phoenix.mapreduce.IndexToolIT
Running org.apache.phoenix.end2end.ContextClassloaderIT
Running org.apache.phoenix.end2end.QueryTimeoutIT
Tests run: 3, Failures: 0, Errors: 0, Skipped: 0, Time elapsed: 9.762 sec - in org.apache.phoenix.end2end.ContextClassloaderIT
Running org.apache.phoenix.end2end.UserDefinedFunctionsIT
Tests run: 1, Failures: 0, Errors: 0, Skipped: 0, Time elapsed: 13.289 sec - in org.apache.phoenix.end2end.QueryTimeoutIT
Running org.apache.phoenix.end2end.QueryWithLimitIT
Running org.apache.phoenix.end2end.StatsCollectorWithSplitsAndMultiCFIT
Tests run: 2, Failures: 0, Errors: 0, Skipped: 0, Time elapsed: 24.052 sec - in org.apache.phoenix.end2end.QueryWithLimitIT
Tests run: 13, Failures: 0, Errors: 0, Skipped: 0, Time elapsed: 51.447 sec - in org.apache.phoenix.end2end.UserDefinedFunctionsIT
Tests run: 2, Failures: 0, Errors: 0, Skipped: 0, Time elapsed: 34.851 sec - in org.apache.phoenix.end2end.StatsCollectorWithSplitsAndMultiCFIT
Running org.apache.phoenix.end2end.UnionAllIT
Running org.apache.phoenix.end2end.ParallelIteratorsIT
Running org.apache.phoenix.iterate.RoundRobinResultIteratorWithStatsIT
Tests run: 1, Failures: 0, Errors: 0, Skipped: 0, Time elapsed: 12.776 sec - in org.apache.phoenix.iterate.RoundRobinResultIteratorWithStatsIT
Running org.apache.phoenix.hbase.index.covered.EndToEndCoveredColumnsIndexBuilderIT
Tests run: 12, Failures: 0, Errors: 0, Skipped: 0, Time elapsed: 45.587 sec - in org.apache.phoenix.end2end.UnionAllIT
Tests run: 2, Failures: 0, Errors: 0, Skipped: 0, Time elapsed: 18.588 sec - in org.apache.phoenix.hbase.index.covered.EndToEndCoveredColumnsIndexBuilderIT
Tests run: 3, Failures: 0, Errors: 0, Skipped: 0, Time elapsed: 41.987 sec - in org.apache.phoenix.end2end.ParallelIteratorsIT
Running org.apache.phoenix.hbase.index.covered.example.EndtoEndIndexingWithCompressionIT
Running org.apache.phoenix.hbase.index.covered.example.FailWithoutRetriesIT
Tests run: 1, Failures: 0, Errors: 0, Skipped: 0, Time elapsed: 8.31 sec - in org.apache.phoenix.hbase.index.covered.example.FailWithoutRetriesIT
Running org.apache.phoenix.hbase.index.covered.example.EndToEndCoveredIndexingIT
Running org.apache.phoenix.hbase.index.balancer.IndexLoadBalancerIT
Tests run: 55, Failures: 0, Errors: 0, Skipped: 0, Time elapsed: 464.803 sec - in org.apache.phoenix.end2end.AlterTableIT
Running org.apache.phoenix.hbase.index.FailForUnsupportedHBaseVersionsIT
Tests run: 2, Failures: 0, Errors: 0, Skipped: 0, Time elapsed: 17.187 sec - in org.apache.phoenix.hbase.index.FailForUnsupportedHBaseVersionsIT
Running org.apache.phoenix.monitoring.PhoenixMetricsIT
Tests run: 17, Failures: 2, Errors: 0, Skipped: 0, Time elapsed: 74.682 sec <<< FAILURE! - in org.apache.phoenix.monitoring.PhoenixMetricsIT
testMetricsForUpsertSelectWithAutoCommit(org.apache.phoenix.monitoring.PhoenixMetricsIT) Time elapsed: 6.042 sec <<< FAILURE!
java.lang.AssertionError: Unequal values for metric MUTATION_BYTES expected:<5600> but was:<16240>
at org.apache.phoenix.monitoring.PhoenixMetricsIT.assertMetricsHaveSameValues(PhoenixMetricsIT.java:654)
at org.apache.phoenix.monitoring.PhoenixMetricsIT.assertMetricsAreSame(PhoenixMetricsIT.java:643)
at org.apache.phoenix.monitoring.PhoenixMetricsIT.testMetricsForUpsertSelectWithAutoCommit(PhoenixMetricsIT.java:462)
testMetricsForUpsertSelectSameTable(org.apache.phoenix.monitoring.PhoenixMetricsIT) Time elapsed: 3.037 sec <<< FAILURE!
java.lang.AssertionError: Unequal values for metric MUTATION_BYTES expected:<5600> but was:<16240>
at org.apache.phoenix.monitoring.PhoenixMetricsIT.assertMetricsHaveSameValues(PhoenixMetricsIT.java:654)
at org.apache.phoenix.monitoring.PhoenixMetricsIT.assertMetricsAreSame(PhoenixMetricsIT.java:643)
at org.apache.phoenix.monitoring.PhoenixMetricsIT.testMetricsForUpsertSelectSameTable(PhoenixMetricsIT.java:615)
Running org.apache.hadoop.hbase.regionserver.wal.WALReplayWithIndexWritesAndCompressedWALIT
Tests run: 11, Failures: 0, Errors: 0, Skipped: 0, Time elapsed: 162.767 sec - in org.apache.phoenix.hbase.index.covered.example.EndtoEndIndexingWithCompressionIT
Running org.apache.hadoop.hbase.regionserver.wal.WALReplayWithIndexWritesAndUncompressedWALInHBase_094_9_IT
Tests run: 1, Failures: 0, Errors: 0, Skipped: 0, Time elapsed: 28.441 sec - in org.apache.hadoop.hbase.regionserver.wal.WALReplayWithIndexWritesAndCompressedWALIT
Tests run: 11, Failures: 0, Errors: 1, Skipped: 0, Time elapsed: 164.689 sec <<< FAILURE! - in org.apache.phoenix.hbase.index.covered.example.EndToEndCoveredIndexingIT
testExceedVersionsOutOfOrderPut(org.apache.phoenix.hbase.index.covered.example.EndToEndCoveredIndexingIT) Time elapsed: 4.708 sec <<< ERROR!
java.lang.RuntimeException: java.util.concurrent.RejectedExecutionException: Task org.apache.hadoop.hbase.client.ResultBoundedCompletionService$QueueingFuture@5eec1486 rejected from java.util.concurrent.ThreadPoolExecutor@5d379a19[Running, pool size = 2, active threads = 2, queued tasks = 0, completed tasks = 6]
at org.apache.phoenix.hbase.index.covered.example.EndToEndCoveredIndexingIT.testExceedVersionsOutOfOrderPut(EndToEndCoveredIndexingIT.java:656)
Caused by: java.util.concurrent.RejectedExecutionException: Task org.apache.hadoop.hbase.client.ResultBoundedCompletionService$QueueingFuture@5eec1486 rejected from java.util.concurrent.ThreadPoolExecutor@5d379a19[Running, pool size = 2, active threads = 2, queued tasks = 0, completed tasks = 6]
at org.apache.phoenix.hbase.index.covered.example.EndToEndCoveredIndexingIT.testExceedVersionsOutOfOrderPut(EndToEndCoveredIndexingIT.java:656)
Tests run: 1, Failures: 0, Errors: 0, Skipped: 0, Time elapsed: 27.459 sec - in org.apache.hadoop.hbase.regionserver.wal.WALReplayWithIndexWritesAndUncompressedWALInHBase_094_9_IT
Tests run: 9, Failures: 0, Errors: 0, Skipped: 0, Time elapsed: 252.359 sec - in org.apache.phoenix.hbase.index.balancer.IndexLoadBalancerIT
Running org.apache.phoenix.end2end.MultiCfQueryExecIT
Tests run: 7, Failures: 0, Errors: 0, Skipped: 0, Time elapsed: 20.698 sec - in org.apache.phoenix.end2end.MultiCfQueryExecIT
Results :
Failed tests:
PhoenixMetricsIT.testMetricsForUpsertSelectSameTable:615->assertMetricsAreSame:643->assertMetricsHaveSameValues:654 Unequal values for metric MUTATION_BYTES expected:<5600> but was:<16240>
PhoenixMetricsIT.testMetricsForUpsertSelectWithAutoCommit:462->assertMetricsAreSame:643->assertMetricsHaveSameValues:654 Unequal values for metric MUTATION_BYTES expected:<5600> but was:<16240>
Tests in error:
EndToEndCoveredIndexingIT.testExceedVersionsOutOfOrderPut:656 » Runtime java.u...
Tests run: 250, Failures: 2, Errors: 1, Skipped: 2
[INFO]
[INFO] --- maven-failsafe-plugin:2.19:verify (ClientManagedTimeTests) @ phoenix-core ---
[INFO] ------------------------------------------------------------------------
[INFO] Reactor Summary:
[INFO]
[INFO] Apache Phoenix .................................... SUCCESS [3.325s]
[INFO] Phoenix Core ...................................... FAILURE [57:20.285s]
[INFO] Phoenix - Flume ................................... SKIPPED
[INFO] Phoenix - Pig ..................................... SKIPPED
[INFO] Phoenix Query Server Client ....................... SKIPPED
[INFO] Phoenix Query Server .............................. SKIPPED
[INFO] Phoenix - Pherf ................................... SKIPPED
[INFO] Phoenix - Spark ................................... SKIPPED
[INFO] Phoenix Assembly .................................. SKIPPED
[INFO] Phoenix - Tracing Web Application ................. SKIPPED
[INFO] ------------------------------------------------------------------------
[INFO] BUILD FAILURE
[INFO] ------------------------------------------------------------------------
[INFO] Total time: 57:24.142s
[INFO] Finished at: Fri Nov 13 09:20:55 UTC 2015
[INFO] Final Memory: 49M/1146M
[INFO] ------------------------------------------------------------------------
[ERROR] Failed to execute goal org.apache.maven.plugins:maven-failsafe-plugin:2.19:verify (ClientManagedTimeTests) on project phoenix-core: There are test failures.
[ERROR]
[ERROR] Please refer to <https://builds.apache.org/job/Phoenix-master/ws/phoenix-core/target/failsafe-reports> for the individual test results.
[ERROR] -> [Help 1]
[ERROR]
[ERROR] To see the full stack trace of the errors, re-run Maven with the -e switch.
[ERROR] Re-run Maven using the -X switch to enable full debug logging.
[ERROR]
[ERROR] For more information about the errors and possible solutions, please read the following articles:
[ERROR] [Help 1] http://cwiki.apache.org/confluence/display/MAVEN/MojoFailureException
[ERROR]
[ERROR] After correcting the problems, you can resume the build with the command
[ERROR] mvn <goals> -rf :phoenix-core
Build step 'Invoke top-level Maven targets' marked build as failure
Archiving artifacts
Compressed 1.27 GB of artifacts by 52.4% relative to #951
Updating PHOENIX-2414
Recording test results
Build failed in Jenkins: Phoenix | Master #955
Posted by Apache Jenkins Server <je...@builds.apache.org>.
See <https://builds.apache.org/job/Phoenix-master/955/changes>
Changes:
[jtaylor] PHOENIX-2413 Implement BaseMutationPlan for common method implementation
------------------------------------------
[...truncated 7240 lines...]
Tests run: 1, Failures: 0, Errors: 0, Skipped: 0, Time elapsed: 58.844 sec - in org.apache.phoenix.end2end.HashJoinLocalIndexIT
Running org.apache.phoenix.end2end.ExpFunctionEnd2EndIT
Tests run: 3, Failures: 0, Errors: 0, Skipped: 0, Time elapsed: 43.874 sec - in org.apache.phoenix.end2end.StoreNullsIT
Running org.apache.phoenix.end2end.GetSetByteBitFunctionEnd2EndIT
Tests run: 1, Failures: 0, Errors: 0, Skipped: 0, Time elapsed: 12.318 sec - in org.apache.phoenix.end2end.GetSetByteBitFunctionEnd2EndIT
Running org.apache.phoenix.end2end.PowerFunctionEnd2EndIT
Tests run: 3, Failures: 0, Errors: 0, Skipped: 0, Time elapsed: 28.978 sec - in org.apache.phoenix.end2end.ExpFunctionEnd2EndIT
Running org.apache.phoenix.end2end.ArithmeticQueryIT
Tests run: 1, Failures: 0, Errors: 0, Skipped: 0, Time elapsed: 19.965 sec - in org.apache.phoenix.end2end.PowerFunctionEnd2EndIT
Running org.apache.phoenix.end2end.UpgradeIT
Tests run: 15, Failures: 0, Errors: 0, Skipped: 0, Time elapsed: 284.75 sec - in org.apache.phoenix.end2end.AlterTableWithViewsIT
Running org.apache.phoenix.end2end.LikeExpressionIT
Tests run: 26, Failures: 0, Errors: 0, Skipped: 0, Time elapsed: 84.491 sec - in org.apache.phoenix.end2end.ArithmeticQueryIT
Running org.apache.phoenix.end2end.DecodeFunctionIT
Tests run: 2, Failures: 0, Errors: 0, Skipped: 0, Time elapsed: 13.604 sec - in org.apache.phoenix.end2end.LikeExpressionIT
Running org.apache.phoenix.end2end.ExecuteStatementsIT
Tests run: 6, Failures: 0, Errors: 0, Skipped: 0, Time elapsed: 8.539 sec - in org.apache.phoenix.end2end.DecodeFunctionIT
Running org.apache.phoenix.end2end.ArraysWithNullsIT
Tests run: 2, Failures: 0, Errors: 0, Skipped: 0, Time elapsed: 44.884 sec - in org.apache.phoenix.end2end.ExecuteStatementsIT
Running org.apache.phoenix.end2end.SpooledTmpFileDeleteIT
Tests run: 1, Failures: 0, Errors: 0, Skipped: 0, Time elapsed: 9.758 sec - in org.apache.phoenix.end2end.SpooledTmpFileDeleteIT
Running org.apache.phoenix.end2end.ServerExceptionIT
Tests run: 6, Failures: 0, Errors: 0, Skipped: 0, Time elapsed: 129.008 sec - in org.apache.phoenix.end2end.UpgradeIT
Running org.apache.phoenix.end2end.ToDateFunctionIT
Tests run: 1, Failures: 0, Errors: 0, Skipped: 0, Time elapsed: 9.332 sec - in org.apache.phoenix.end2end.ServerExceptionIT
Running org.apache.phoenix.end2end.CSVCommonsLoaderIT
Tests run: 11, Failures: 0, Errors: 0, Skipped: 0, Time elapsed: 21.376 sec - in org.apache.phoenix.end2end.ToDateFunctionIT
Running org.apache.phoenix.end2end.CbrtFunctionEnd2EndIT
Tests run: 2, Failures: 0, Errors: 0, Skipped: 0, Time elapsed: 18.032 sec - in org.apache.phoenix.end2end.CbrtFunctionEnd2EndIT
Running org.apache.phoenix.end2end.AlterSessionIT
Tests run: 2, Failures: 0, Errors: 0, Skipped: 0, Time elapsed: 10.618 sec - in org.apache.phoenix.end2end.AlterSessionIT
Running org.apache.phoenix.end2end.MappingTableDataTypeIT
Tests run: 1, Failures: 0, Errors: 0, Skipped: 0, Time elapsed: 15.932 sec - in org.apache.phoenix.end2end.MappingTableDataTypeIT
Running org.apache.phoenix.end2end.TenantSpecificViewIndexIT
Tests run: 16, Failures: 0, Errors: 0, Skipped: 0, Time elapsed: 62.357 sec - in org.apache.phoenix.end2end.CSVCommonsLoaderIT
Running org.apache.phoenix.end2end.AbsFunctionEnd2EndIT
Tests run: 111, Failures: 0, Errors: 0, Skipped: 0, Time elapsed: 355.165 sec - in org.apache.phoenix.end2end.HashJoinIT
Running org.apache.phoenix.end2end.InListIT
Tests run: 16, Failures: 0, Errors: 0, Skipped: 0, Time elapsed: 128.298 sec - in org.apache.phoenix.end2end.ArraysWithNullsIT
Running org.apache.phoenix.end2end.StatementHintsIT
Tests run: 1, Failures: 0, Errors: 0, Skipped: 0, Time elapsed: 9.713 sec - in org.apache.phoenix.end2end.AbsFunctionEnd2EndIT
Running org.apache.phoenix.end2end.TenantSpecificViewIndexSaltedIT
Tests run: 2, Failures: 0, Errors: 0, Skipped: 0, Time elapsed: 7.072 sec - in org.apache.phoenix.end2end.StatementHintsIT
Running org.apache.phoenix.end2end.TimezoneOffsetFunctionIT
Tests run: 7, Failures: 0, Errors: 0, Skipped: 0, Time elapsed: 15.628 sec - in org.apache.phoenix.end2end.TimezoneOffsetFunctionIT
Running org.apache.phoenix.end2end.QueryExecWithoutSCNIT
Tests run: 1, Failures: 0, Errors: 0, Skipped: 0, Time elapsed: 9.334 sec - in org.apache.phoenix.end2end.QueryExecWithoutSCNIT
Running org.apache.phoenix.end2end.LpadFunctionIT
Tests run: 4, Failures: 0, Errors: 0, Skipped: 0, Time elapsed: 31.307 sec - in org.apache.phoenix.end2end.TenantSpecificViewIndexSaltedIT
Running org.apache.phoenix.end2end.SortOrderIT
Tests run: 8, Failures: 0, Errors: 0, Skipped: 0, Time elapsed: 61.369 sec - in org.apache.phoenix.end2end.TenantSpecificViewIndexIT
Running org.apache.phoenix.end2end.CoalesceFunctionIT
Tests run: 12, Failures: 0, Errors: 0, Skipped: 0, Time elapsed: 36.216 sec - in org.apache.phoenix.end2end.LpadFunctionIT
Running org.apache.phoenix.end2end.RegexpReplaceFunctionIT
Tests run: 2, Failures: 0, Errors: 0, Skipped: 0, Time elapsed: 9.647 sec - in org.apache.phoenix.end2end.RegexpReplaceFunctionIT
Running org.apache.phoenix.end2end.EvaluationOfORIT
Tests run: 2, Failures: 0, Errors: 0, Skipped: 0, Time elapsed: 6.525 sec - in org.apache.phoenix.end2end.EvaluationOfORIT
Running org.apache.phoenix.end2end.LastValueFunctionIT
Tests run: 10, Failures: 0, Errors: 0, Skipped: 0, Time elapsed: 32.374 sec - in org.apache.phoenix.end2end.CoalesceFunctionIT
Running org.apache.phoenix.end2end.SkipScanAfterManualSplitIT
Tests run: 11, Failures: 0, Errors: 0, Skipped: 0, Time elapsed: 18.885 sec - in org.apache.phoenix.end2end.LastValueFunctionIT
Running org.apache.phoenix.end2end.salted.SaltedTableVarLengthRowKeyIT
Tests run: 1, Failures: 0, Errors: 0, Skipped: 0, Time elapsed: 7.392 sec - in org.apache.phoenix.end2end.salted.SaltedTableVarLengthRowKeyIT
Running org.apache.phoenix.end2end.salted.SaltedTableUpsertSelectIT
Tests run: 3, Failures: 0, Errors: 0, Skipped: 0, Time elapsed: 50.025 sec - in org.apache.phoenix.end2end.SkipScanAfterManualSplitIT
Running org.apache.phoenix.end2end.DynamicFamilyIT
Tests run: 5, Failures: 0, Errors: 0, Skipped: 0, Time elapsed: 29.915 sec - in org.apache.phoenix.end2end.salted.SaltedTableUpsertSelectIT
Running org.apache.phoenix.end2end.MinMaxAggregateFunctionIT
Tests run: 1, Failures: 0, Errors: 0, Skipped: 0, Time elapsed: 7.409 sec - in org.apache.phoenix.end2end.MinMaxAggregateFunctionIT
Running org.apache.phoenix.end2end.ArrayToStringFunctionIT
Tests run: 28, Failures: 0, Errors: 0, Skipped: 0, Time elapsed: 161.45 sec - in org.apache.phoenix.end2end.InListIT
Running org.apache.phoenix.end2end.SubqueryIT
Tests run: 4, Failures: 0, Errors: 0, Skipped: 0, Time elapsed: 21.998 sec - in org.apache.phoenix.end2end.DynamicFamilyIT
Running org.apache.phoenix.end2end.ArrayAppendFunctionIT
Tests run: 45, Failures: 0, Errors: 0, Skipped: 0, Time elapsed: 128.616 sec - in org.apache.phoenix.end2end.SortOrderIT
Running org.apache.phoenix.end2end.ReverseScanIT
Tests run: 3, Failures: 0, Errors: 0, Skipped: 0, Time elapsed: 19.545 sec - in org.apache.phoenix.end2end.ReverseScanIT
Running org.apache.phoenix.end2end.RTrimFunctionIT
Tests run: 36, Failures: 0, Errors: 0, Skipped: 0, Time elapsed: 37.905 sec - in org.apache.phoenix.end2end.ArrayToStringFunctionIT
Running org.apache.phoenix.end2end.SortMergeJoinIT
Tests run: 2, Failures: 0, Errors: 0, Skipped: 0, Time elapsed: 11.823 sec - in org.apache.phoenix.end2end.RTrimFunctionIT
Running org.apache.phoenix.end2end.SignFunctionEnd2EndIT
Tests run: 34, Failures: 0, Errors: 0, Skipped: 0, Time elapsed: 53.23 sec - in org.apache.phoenix.end2end.ArrayAppendFunctionIT
Tests run: 2, Failures: 0, Errors: 0, Skipped: 0, Time elapsed: 19.45 sec - in org.apache.phoenix.end2end.SignFunctionEnd2EndIT
Running org.apache.phoenix.end2end.QueryMoreIT
Running org.apache.phoenix.end2end.TenantIdTypeIT
Tests run: 5, Failures: 0, Errors: 0, Skipped: 0, Time elapsed: 70.307 sec - in org.apache.phoenix.end2end.QueryMoreIT
Running org.apache.phoenix.end2end.ArrayConcatFunctionIT
Tests run: 108, Failures: 0, Errors: 0, Skipped: 0, Time elapsed: 712.434 sec - in org.apache.phoenix.end2end.SpooledSortMergeJoinIT
Running org.apache.phoenix.end2end.ConvertTimezoneFunctionIT
Tests run: 21, Failures: 0, Errors: 0, Skipped: 0, Time elapsed: 161.291 sec - in org.apache.phoenix.end2end.SubqueryIT
Running org.apache.phoenix.end2end.LnLogFunctionEnd2EndIT
Tests run: 7, Failures: 0, Errors: 0, Skipped: 0, Time elapsed: 15.55 sec - in org.apache.phoenix.end2end.ConvertTimezoneFunctionIT
Running org.apache.phoenix.trace.PhoenixTraceReaderIT
Tests run: 2, Failures: 0, Errors: 0, Skipped: 0, Time elapsed: 3.515 sec - in org.apache.phoenix.trace.PhoenixTraceReaderIT
Running org.apache.phoenix.trace.PhoenixTracingEndToEndIT
Tests run: 30, Failures: 0, Errors: 0, Skipped: 0, Time elapsed: 52.277 sec - in org.apache.phoenix.end2end.ArrayConcatFunctionIT
Running org.apache.phoenix.trace.PhoenixTableMetricsWriterIT
Tests run: 1, Failures: 0, Errors: 0, Skipped: 0, Time elapsed: 20.97 sec - in org.apache.phoenix.end2end.LnLogFunctionEnd2EndIT
Running org.apache.phoenix.rpc.UpdateCacheIT
Tests run: 2, Failures: 0, Errors: 0, Skipped: 0, Time elapsed: 3.522 sec - in org.apache.phoenix.trace.PhoenixTableMetricsWriterIT
Tests run: 1, Failures: 0, Errors: 0, Skipped: 0, Time elapsed: 9.829 sec - in org.apache.phoenix.rpc.UpdateCacheIT
Tests run: 6, Failures: 0, Errors: 0, Skipped: 0, Time elapsed: 97.597 sec - in org.apache.phoenix.trace.PhoenixTracingEndToEndIT
Tests run: 15, Failures: 0, Errors: 0, Skipped: 0, Time elapsed: 298.882 sec - in org.apache.phoenix.end2end.TenantIdTypeIT
Tests run: 108, Failures: 0, Errors: 0, Skipped: 0, Time elapsed: 356.461 sec - in org.apache.phoenix.end2end.SortMergeJoinIT
Results :
Tests run: 1179, Failures: 0, Errors: 0, Skipped: 0
[INFO]
[INFO] --- maven-failsafe-plugin:2.19:integration-test (NeedTheirOwnClusterTests) @ phoenix-core ---
-------------------------------------------------------
T E S T S
-------------------------------------------------------
Running org.apache.phoenix.end2end.ConnectionUtilIT
Running org.apache.phoenix.end2end.ViewIT
Running org.apache.phoenix.end2end.TenantSpecificTablesDMLIT
Running org.apache.phoenix.iterate.RoundRobinResultIteratorWithStatsIT
Running org.apache.phoenix.execute.PartialCommitIT
Tests run: 1, Failures: 0, Errors: 0, Skipped: 0, Time elapsed: 27.148 sec - in org.apache.phoenix.end2end.ConnectionUtilIT
Running org.apache.phoenix.end2end.index.MutableIndexFailureIT
Tests run: 1, Failures: 0, Errors: 0, Skipped: 0, Time elapsed: 16.234 sec - in org.apache.phoenix.iterate.RoundRobinResultIteratorWithStatsIT
Tests run: 6, Failures: 0, Errors: 0, Skipped: 0, Time elapsed: 8.852 sec - in org.apache.phoenix.execute.PartialCommitIT
Running org.apache.phoenix.end2end.index.ImmutableIndexWithStatsIT
Tests run: 1, Failures: 0, Errors: 0, Skipped: 0, Time elapsed: 16.514 sec - in org.apache.phoenix.end2end.index.ImmutableIndexWithStatsIT
Tests run: 3, Failures: 0, Errors: 0, Skipped: 2, Time elapsed: 55.783 sec - in org.apache.phoenix.end2end.index.MutableIndexFailureIT
Tests run: 16, Failures: 0, Errors: 0, Skipped: 0, Time elapsed: 68.016 sec - in org.apache.phoenix.end2end.TenantSpecificTablesDMLIT
Running org.apache.phoenix.end2end.QueryTimeoutIT
Running org.apache.phoenix.end2end.QueryWithLimitIT
Running org.apache.phoenix.end2end.StatsCollectorIT
Tests run: 22, Failures: 0, Errors: 0, Skipped: 0, Time elapsed: 99.306 sec - in org.apache.phoenix.end2end.ViewIT
Tests run: 1, Failures: 0, Errors: 0, Skipped: 0, Time elapsed: 20.695 sec - in org.apache.phoenix.end2end.QueryTimeoutIT
Running org.apache.phoenix.end2end.KeyOnlyIT
Tests run: 2, Failures: 0, Errors: 0, Skipped: 0, Time elapsed: 30.088 sec - in org.apache.phoenix.end2end.QueryWithLimitIT
Running org.apache.phoenix.end2end.ContextClassloaderIT
Tests run: 3, Failures: 0, Errors: 0, Skipped: 0, Time elapsed: 23.016 sec - in org.apache.phoenix.end2end.KeyOnlyIT
Tests run: 3, Failures: 0, Errors: 0, Skipped: 0, Time elapsed: 9.81 sec - in org.apache.phoenix.end2end.ContextClassloaderIT
Running org.apache.phoenix.end2end.UnionAllIT
Tests run: 4, Failures: 0, Errors: 0, Skipped: 0, Time elapsed: 70.25 sec - in org.apache.phoenix.end2end.StatsCollectorIT
Running org.apache.phoenix.end2end.MultiCfQueryExecIT
Running org.apache.phoenix.end2end.UserDefinedFunctionsIT
Running org.apache.phoenix.end2end.SaltedViewIT
Tests run: 7, Failures: 0, Errors: 0, Skipped: 0, Time elapsed: 22.923 sec - in org.apache.phoenix.end2end.MultiCfQueryExecIT
Tests run: 12, Failures: 0, Errors: 0, Skipped: 0, Time elapsed: 49.568 sec - in org.apache.phoenix.end2end.UnionAllIT
Tests run: 2, Failures: 0, Errors: 0, Skipped: 0, Time elapsed: 23.019 sec - in org.apache.phoenix.end2end.SaltedViewIT
Running org.apache.phoenix.end2end.AlterTableIT
Running org.apache.phoenix.end2end.TenantSpecificTablesDDLIT
Running org.apache.phoenix.end2end.CountDistinctCompressionIT
Tests run: 13, Failures: 0, Errors: 0, Skipped: 0, Time elapsed: 61.126 sec - in org.apache.phoenix.end2end.UserDefinedFunctionsIT
Tests run: 1, Failures: 0, Errors: 0, Skipped: 0, Time elapsed: 10.255 sec - in org.apache.phoenix.end2end.CountDistinctCompressionIT
Running org.apache.phoenix.end2end.SpillableGroupByIT
Running org.apache.phoenix.end2end.StatsCollectorWithSplitsAndMultiCFIT
Tests run: 1, Failures: 0, Errors: 0, Skipped: 0, Time elapsed: 11.482 sec - in org.apache.phoenix.end2end.SpillableGroupByIT
Tests run: 2, Failures: 0, Errors: 0, Skipped: 0, Time elapsed: 31.52 sec - in org.apache.phoenix.end2end.StatsCollectorWithSplitsAndMultiCFIT
Running org.apache.phoenix.end2end.ParallelIteratorsIT
Tests run: 17, Failures: 0, Errors: 0, Skipped: 0, Time elapsed: 81.183 sec - in org.apache.phoenix.end2end.TenantSpecificTablesDDLIT
Running org.apache.phoenix.mapreduce.IndexToolIT
Tests run: 3, Failures: 0, Errors: 0, Skipped: 0, Time elapsed: 43.372 sec - in org.apache.phoenix.end2end.ParallelIteratorsIT
Running org.apache.phoenix.mapreduce.CsvBulkLoadToolIT
Running org.apache.phoenix.monitoring.PhoenixMetricsIT
Tests run: 17, Failures: 2, Errors: 0, Skipped: 0, Time elapsed: 97.601 sec <<< FAILURE! - in org.apache.phoenix.monitoring.PhoenixMetricsIT
testMetricsForUpsertSelectWithAutoCommit(org.apache.phoenix.monitoring.PhoenixMetricsIT) Time elapsed: 9.849 sec <<< FAILURE!
java.lang.AssertionError: Unequal values for metric MUTATION_BYTES expected:<5600> but was:<16240>
at org.apache.phoenix.monitoring.PhoenixMetricsIT.assertMetricsHaveSameValues(PhoenixMetricsIT.java:654)
at org.apache.phoenix.monitoring.PhoenixMetricsIT.assertMetricsAreSame(PhoenixMetricsIT.java:643)
at org.apache.phoenix.monitoring.PhoenixMetricsIT.testMetricsForUpsertSelectWithAutoCommit(PhoenixMetricsIT.java:462)
testMetricsForUpsertSelectSameTable(org.apache.phoenix.monitoring.PhoenixMetricsIT) Time elapsed: 4.988 sec <<< FAILURE!
java.lang.AssertionError: Unequal values for metric MUTATION_BYTES expected:<5600> but was:<16240>
at org.apache.phoenix.monitoring.PhoenixMetricsIT.assertMetricsHaveSameValues(PhoenixMetricsIT.java:654)
at org.apache.phoenix.monitoring.PhoenixMetricsIT.assertMetricsAreSame(PhoenixMetricsIT.java:643)
at org.apache.phoenix.monitoring.PhoenixMetricsIT.testMetricsForUpsertSelectSameTable(PhoenixMetricsIT.java:615)
Running org.apache.phoenix.hbase.index.FailForUnsupportedHBaseVersionsIT
Tests run: 2, Failures: 0, Errors: 0, Skipped: 0, Time elapsed: 20.342 sec - in org.apache.phoenix.hbase.index.FailForUnsupportedHBaseVersionsIT
Running org.apache.phoenix.hbase.index.covered.example.EndToEndCoveredIndexingIT
Tests run: 5, Failures: 0, Errors: 0, Skipped: 0, Time elapsed: 184.374 sec - in org.apache.phoenix.mapreduce.CsvBulkLoadToolIT
Running org.apache.phoenix.hbase.index.covered.example.EndtoEndIndexingWithCompressionIT
Tests run: 9, Failures: 0, Errors: 0, Skipped: 0, Time elapsed: 401.743 sec - in org.apache.phoenix.mapreduce.IndexToolIT
Tests run: 55, Failures: 0, Errors: 0, Skipped: 0, Time elapsed: 519.003 sec - in org.apache.phoenix.end2end.AlterTableIT
Tests run: 11, Failures: 0, Errors: 0, Skipped: 0, Time elapsed: 221.697 sec - in org.apache.phoenix.hbase.index.covered.example.EndToEndCoveredIndexingIT
Running org.apache.phoenix.hbase.index.covered.example.FailWithoutRetriesIT
Running org.apache.phoenix.hbase.index.balancer.IndexLoadBalancerIT
Running org.apache.phoenix.hbase.index.covered.EndToEndCoveredColumnsIndexBuilderIT
Tests run: 1, Failures: 0, Errors: 0, Skipped: 0, Time elapsed: 7.89 sec - in org.apache.phoenix.hbase.index.covered.example.FailWithoutRetriesIT
Tests run: 2, Failures: 0, Errors: 0, Skipped: 0, Time elapsed: 28.683 sec - in org.apache.phoenix.hbase.index.covered.EndToEndCoveredColumnsIndexBuilderIT
Tests run: 11, Failures: 0, Errors: 0, Skipped: 0, Time elapsed: 218.768 sec - in org.apache.phoenix.hbase.index.covered.example.EndtoEndIndexingWithCompressionIT
Running org.apache.hadoop.hbase.regionserver.wal.WALReplayWithIndexWritesAndCompressedWALIT
Running org.apache.phoenix.rpc.PhoenixClientRpcIT
Tests run: 2, Failures: 0, Errors: 0, Skipped: 0, Time elapsed: 18.941 sec - in org.apache.phoenix.rpc.PhoenixClientRpcIT
Running org.apache.hadoop.hbase.regionserver.wal.WALReplayWithIndexWritesAndUncompressedWALInHBase_094_9_IT
Running org.apache.phoenix.rpc.PhoenixServerRpcIT
Tests run: 1, Failures: 0, Errors: 0, Skipped: 0, Time elapsed: 28.862 sec - in org.apache.hadoop.hbase.regionserver.wal.WALReplayWithIndexWritesAndCompressedWALIT
Tests run: 2, Failures: 0, Errors: 0, Skipped: 0, Time elapsed: 21.229 sec - in org.apache.phoenix.rpc.PhoenixServerRpcIT
Tests run: 1, Failures: 0, Errors: 0, Skipped: 0, Time elapsed: 28.947 sec - in org.apache.hadoop.hbase.regionserver.wal.WALReplayWithIndexWritesAndUncompressedWALInHBase_094_9_IT
Tests run: 9, Failures: 0, Errors: 0, Skipped: 0, Time elapsed: 302.689 sec - in org.apache.phoenix.hbase.index.balancer.IndexLoadBalancerIT
Running org.apache.phoenix.end2end.index.MutableIndexReplicationIT
Tests run: 1, Failures: 0, Errors: 0, Skipped: 0, Time elapsed: 38.653 sec - in org.apache.phoenix.end2end.index.MutableIndexReplicationIT
Results :
Failed tests:
PhoenixMetricsIT.testMetricsForUpsertSelectSameTable:615->assertMetricsAreSame:643->assertMetricsHaveSameValues:654 Unequal values for metric MUTATION_BYTES expected:<5600> but was:<16240>
PhoenixMetricsIT.testMetricsForUpsertSelectWithAutoCommit:462->assertMetricsAreSame:643->assertMetricsHaveSameValues:654 Unequal values for metric MUTATION_BYTES expected:<5600> but was:<16240>
Tests run: 250, Failures: 2, Errors: 0, Skipped: 2
[INFO]
[INFO] --- maven-failsafe-plugin:2.19:verify (ClientManagedTimeTests) @ phoenix-core ---
[INFO] ------------------------------------------------------------------------
[INFO] Reactor Summary:
[INFO]
[INFO] Apache Phoenix .................................... SUCCESS [3.761s]
[INFO] Phoenix Core ...................................... FAILURE [59:13.860s]
[INFO] Phoenix - Flume ................................... SKIPPED
[INFO] Phoenix - Pig ..................................... SKIPPED
[INFO] Phoenix Query Server Client ....................... SKIPPED
[INFO] Phoenix Query Server .............................. SKIPPED
[INFO] Phoenix - Pherf ................................... SKIPPED
[INFO] Phoenix - Spark ................................... SKIPPED
[INFO] Phoenix Assembly .................................. SKIPPED
[INFO] Phoenix - Tracing Web Application ................. SKIPPED
[INFO] ------------------------------------------------------------------------
[INFO] BUILD FAILURE
[INFO] ------------------------------------------------------------------------
[INFO] Total time: 59:18.242s
[INFO] Finished at: Fri Nov 13 06:52:58 UTC 2015
[INFO] Final Memory: 51M/1245M
[INFO] ------------------------------------------------------------------------
[ERROR] Failed to execute goal org.apache.maven.plugins:maven-failsafe-plugin:2.19:verify (ClientManagedTimeTests) on project phoenix-core: There are test failures.
[ERROR]
[ERROR] Please refer to <https://builds.apache.org/job/Phoenix-master/ws/phoenix-core/target/failsafe-reports> for the individual test results.
[ERROR] -> [Help 1]
[ERROR]
[ERROR] To see the full stack trace of the errors, re-run Maven with the -e switch.
[ERROR] Re-run Maven using the -X switch to enable full debug logging.
[ERROR]
[ERROR] For more information about the errors and possible solutions, please read the following articles:
[ERROR] [Help 1] http://cwiki.apache.org/confluence/display/MAVEN/MojoFailureException
[ERROR]
[ERROR] After correcting the problems, you can resume the build with the command
[ERROR] mvn <goals> -rf :phoenix-core
Build step 'Invoke top-level Maven targets' marked build as failure
Archiving artifacts
Compressed 1.23 GB of artifacts by 52.7% relative to #951
Updating PHOENIX-2413
Recording test results
Build failed in Jenkins: Phoenix | Master #954
Posted by Apache Jenkins Server <je...@builds.apache.org>.
See <https://builds.apache.org/job/Phoenix-master/954/changes>
Changes:
[jtaylor] PHOENIX-2409 Create getTable() convenience method on PhoenixConnection
[jtaylor] PHOENIX-2410 Move NUM_MILLIS_IN_DAY constant to TestUtil
------------------------------------------
[...truncated 7238 lines...]
Running org.apache.phoenix.end2end.InstrFunctionIT
Tests run: 8, Failures: 0, Errors: 0, Skipped: 0, Time elapsed: 9.928 sec - in org.apache.phoenix.end2end.InstrFunctionIT
Running org.apache.phoenix.end2end.MD5FunctionIT
Tests run: 22, Failures: 0, Errors: 0, Skipped: 0, Time elapsed: 52.463 sec - in org.apache.phoenix.end2end.DeleteIT
Running org.apache.phoenix.end2end.SqrtFunctionEnd2EndIT
Tests run: 3, Failures: 0, Errors: 0, Skipped: 0, Time elapsed: 12.095 sec - in org.apache.phoenix.end2end.MD5FunctionIT
Running org.apache.phoenix.end2end.UpsertSelectAutoCommitIT
Tests run: 2, Failures: 0, Errors: 0, Skipped: 0, Time elapsed: 11.022 sec - in org.apache.phoenix.end2end.SqrtFunctionEnd2EndIT
Running org.apache.phoenix.end2end.ExecuteStatementsIT
Tests run: 62, Failures: 0, Errors: 0, Skipped: 0, Time elapsed: 268.494 sec - in org.apache.phoenix.end2end.index.IndexExpressionIT
Running org.apache.phoenix.end2end.StringToArrayFunctionIT
Tests run: 3, Failures: 0, Errors: 0, Skipped: 0, Time elapsed: 27.102 sec - in org.apache.phoenix.end2end.UpsertSelectAutoCommitIT
Running org.apache.phoenix.end2end.GetSetByteBitFunctionEnd2EndIT
Tests run: 1, Failures: 0, Errors: 0, Skipped: 0, Time elapsed: 5.407 sec - in org.apache.phoenix.end2end.GetSetByteBitFunctionEnd2EndIT
Running org.apache.phoenix.end2end.HashJoinIT
Tests run: 2, Failures: 0, Errors: 0, Skipped: 0, Time elapsed: 28.507 sec - in org.apache.phoenix.end2end.ExecuteStatementsIT
Running org.apache.phoenix.end2end.TenantSpecificViewIndexIT
Tests run: 15, Failures: 0, Errors: 0, Skipped: 0, Time elapsed: 158.204 sec - in org.apache.phoenix.end2end.TenantIdTypeIT
Running org.apache.phoenix.end2end.CoalesceFunctionIT
Tests run: 22, Failures: 0, Errors: 0, Skipped: 0, Time elapsed: 26.557 sec - in org.apache.phoenix.end2end.StringToArrayFunctionIT
Running org.apache.phoenix.end2end.ArraysWithNullsIT
Tests run: 10, Failures: 0, Errors: 0, Skipped: 0, Time elapsed: 20.361 sec - in org.apache.phoenix.end2end.CoalesceFunctionIT
Running org.apache.phoenix.end2end.TimezoneOffsetFunctionIT
Tests run: 8, Failures: 0, Errors: 0, Skipped: 0, Time elapsed: 32.915 sec - in org.apache.phoenix.end2end.TenantSpecificViewIndexIT
Running org.apache.phoenix.end2end.SubqueryIT
Tests run: 7, Failures: 0, Errors: 0, Skipped: 0, Time elapsed: 13.202 sec - in org.apache.phoenix.end2end.TimezoneOffsetFunctionIT
Running org.apache.phoenix.end2end.ArithmeticQueryIT
Tests run: 28, Failures: 0, Errors: 0, Skipped: 0, Time elapsed: 172.3 sec - in org.apache.phoenix.end2end.InListIT
Running org.apache.phoenix.end2end.ArrayToStringFunctionIT
Tests run: 36, Failures: 0, Errors: 0, Skipped: 0, Time elapsed: 35.258 sec - in org.apache.phoenix.end2end.ArrayToStringFunctionIT
Running org.apache.phoenix.end2end.ReverseFunctionIT
Tests run: 5, Failures: 0, Errors: 0, Skipped: 0, Time elapsed: 7.617 sec - in org.apache.phoenix.end2end.ReverseFunctionIT
Running org.apache.phoenix.end2end.DateTimeIT
Tests run: 16, Failures: 0, Errors: 0, Skipped: 0, Time elapsed: 84.979 sec - in org.apache.phoenix.end2end.ArraysWithNullsIT
Running org.apache.phoenix.end2end.SortOrderIT
Tests run: 26, Failures: 0, Errors: 0, Skipped: 0, Time elapsed: 56.546 sec - in org.apache.phoenix.end2end.ArithmeticQueryIT
Running org.apache.phoenix.end2end.RegexpSplitFunctionIT
Tests run: 11, Failures: 0, Errors: 0, Skipped: 0, Time elapsed: 10.465 sec - in org.apache.phoenix.end2end.RegexpSplitFunctionIT
Running org.apache.phoenix.end2end.LnLogFunctionEnd2EndIT
Tests run: 21, Failures: 0, Errors: 0, Skipped: 0, Time elapsed: 79.79 sec - in org.apache.phoenix.end2end.SubqueryIT
Running org.apache.phoenix.end2end.PowerFunctionEnd2EndIT
Tests run: 19, Failures: 0, Errors: 0, Skipped: 0, Time elapsed: 23.143 sec - in org.apache.phoenix.end2end.DateTimeIT
Running org.apache.phoenix.end2end.FirstValueFunctionIT
Tests run: 1, Failures: 0, Errors: 0, Skipped: 0, Time elapsed: 9.934 sec - in org.apache.phoenix.end2end.PowerFunctionEnd2EndIT
Running org.apache.phoenix.end2end.QueryExecWithoutSCNIT
Tests run: 1, Failures: 0, Errors: 0, Skipped: 0, Time elapsed: 11.751 sec - in org.apache.phoenix.end2end.LnLogFunctionEnd2EndIT
Running org.apache.phoenix.end2end.ConvertTimezoneFunctionIT
Tests run: 7, Failures: 0, Errors: 0, Skipped: 0, Time elapsed: 8.682 sec - in org.apache.phoenix.end2end.FirstValueFunctionIT
Running org.apache.phoenix.end2end.StatementHintsIT
Tests run: 1, Failures: 0, Errors: 0, Skipped: 0, Time elapsed: 6.02 sec - in org.apache.phoenix.end2end.QueryExecWithoutSCNIT
Running org.apache.phoenix.end2end.UpsertBigValuesIT
Tests run: 7, Failures: 0, Errors: 0, Skipped: 0, Time elapsed: 8.572 sec - in org.apache.phoenix.end2end.ConvertTimezoneFunctionIT
Running org.apache.phoenix.end2end.AlterTableWithViewsIT
Tests run: 2, Failures: 0, Errors: 0, Skipped: 0, Time elapsed: 6.995 sec - in org.apache.phoenix.end2end.StatementHintsIT
Running org.apache.phoenix.end2end.salted.SaltedTableUpsertSelectIT
Tests run: 4, Failures: 0, Errors: 0, Skipped: 0, Time elapsed: 19.737 sec - in org.apache.phoenix.end2end.UpsertBigValuesIT
Running org.apache.phoenix.end2end.salted.SaltedTableVarLengthRowKeyIT
Tests run: 1, Failures: 0, Errors: 0, Skipped: 0, Time elapsed: 6.011 sec - in org.apache.phoenix.end2end.salted.SaltedTableVarLengthRowKeyIT
Running org.apache.phoenix.end2end.QueryMoreIT
Tests run: 5, Failures: 0, Errors: 0, Skipped: 0, Time elapsed: 21.365 sec - in org.apache.phoenix.end2end.salted.SaltedTableUpsertSelectIT
Running org.apache.phoenix.end2end.ReverseScanIT
Tests run: 3, Failures: 0, Errors: 0, Skipped: 0, Time elapsed: 12.52 sec - in org.apache.phoenix.end2end.ReverseScanIT
Running org.apache.phoenix.end2end.AlterSessionIT
Tests run: 2, Failures: 0, Errors: 0, Skipped: 0, Time elapsed: 6.046 sec - in org.apache.phoenix.end2end.AlterSessionIT
Running org.apache.phoenix.end2end.RTrimFunctionIT
Tests run: 2, Failures: 0, Errors: 0, Skipped: 0, Time elapsed: 6.993 sec - in org.apache.phoenix.end2end.RTrimFunctionIT
Running org.apache.phoenix.end2end.StoreNullsIT
Tests run: 5, Failures: 0, Errors: 0, Skipped: 0, Time elapsed: 33.915 sec - in org.apache.phoenix.end2end.QueryMoreIT
Running org.apache.phoenix.end2end.PhoenixRuntimeIT
Tests run: 45, Failures: 0, Errors: 0, Skipped: 0, Time elapsed: 101.779 sec - in org.apache.phoenix.end2end.SortOrderIT
Running org.apache.phoenix.end2end.RegexpSubstrFunctionIT
Tests run: 2, Failures: 0, Errors: 0, Skipped: 0, Time elapsed: 6.045 sec - in org.apache.phoenix.end2end.RegexpSubstrFunctionIT
Running org.apache.phoenix.end2end.ServerExceptionIT
Tests run: 1, Failures: 0, Errors: 0, Skipped: 0, Time elapsed: 5.455 sec - in org.apache.phoenix.end2end.ServerExceptionIT
Running org.apache.phoenix.end2end.ExpFunctionEnd2EndIT
Tests run: 3, Failures: 0, Errors: 0, Skipped: 0, Time elapsed: 29.869 sec - in org.apache.phoenix.end2end.StoreNullsIT
Running org.apache.phoenix.end2end.ArrayAppendFunctionIT
Tests run: 2, Failures: 0, Errors: 0, Skipped: 0, Time elapsed: 31.596 sec - in org.apache.phoenix.end2end.PhoenixRuntimeIT
Running org.apache.phoenix.end2end.AutoCommitIT
Tests run: 1, Failures: 0, Errors: 0, Skipped: 0, Time elapsed: 5.003 sec - in org.apache.phoenix.end2end.AutoCommitIT
Running org.apache.phoenix.end2end.SortMergeJoinIT
Tests run: 3, Failures: 0, Errors: 0, Skipped: 0, Time elapsed: 17.522 sec - in org.apache.phoenix.end2end.ExpFunctionEnd2EndIT
Running org.apache.phoenix.end2end.StddevIT
Tests run: 4, Failures: 0, Errors: 0, Skipped: 0, Time elapsed: 8.227 sec - in org.apache.phoenix.end2end.StddevIT
Running org.apache.phoenix.end2end.IsNullIT
Tests run: 34, Failures: 0, Errors: 0, Skipped: 0, Time elapsed: 34.543 sec - in org.apache.phoenix.end2end.ArrayAppendFunctionIT
Running org.apache.phoenix.end2end.SignFunctionEnd2EndIT
Tests run: 3, Failures: 0, Errors: 0, Skipped: 0, Time elapsed: 11.193 sec - in org.apache.phoenix.end2end.IsNullIT
Running org.apache.phoenix.end2end.LastValueFunctionIT
Tests run: 2, Failures: 0, Errors: 0, Skipped: 0, Time elapsed: 11.612 sec - in org.apache.phoenix.end2end.SignFunctionEnd2EndIT
Running org.apache.phoenix.end2end.HashJoinLocalIndexIT
Tests run: 11, Failures: 0, Errors: 0, Skipped: 0, Time elapsed: 15.492 sec - in org.apache.phoenix.end2end.LastValueFunctionIT
Running org.apache.phoenix.end2end.RoundFloorCeilFunctionsEnd2EndIT
Tests run: 31, Failures: 0, Errors: 0, Skipped: 0, Time elapsed: 27.98 sec - in org.apache.phoenix.end2end.RoundFloorCeilFunctionsEnd2EndIT
Running org.apache.phoenix.end2end.LpadFunctionIT
Tests run: 1, Failures: 0, Errors: 0, Skipped: 0, Time elapsed: 36.739 sec - in org.apache.phoenix.end2end.HashJoinLocalIndexIT
Running org.apache.phoenix.iterate.RoundRobinResultIteratorIT
Tests run: 12, Failures: 0, Errors: 0, Skipped: 0, Time elapsed: 31.208 sec - in org.apache.phoenix.end2end.LpadFunctionIT
Running org.apache.phoenix.iterate.PhoenixQueryTimeoutIT
Tests run: 2, Failures: 0, Errors: 0, Skipped: 0, Time elapsed: 6.378 sec - in org.apache.phoenix.iterate.PhoenixQueryTimeoutIT
Tests run: 15, Failures: 0, Errors: 0, Skipped: 0, Time elapsed: 234.082 sec - in org.apache.phoenix.end2end.AlterTableWithViewsIT
Tests run: 111, Failures: 0, Errors: 0, Skipped: 0, Time elapsed: 381.116 sec - in org.apache.phoenix.end2end.HashJoinIT
Tests run: 9, Failures: 0, Errors: 0, Skipped: 0, Time elapsed: 96.609 sec - in org.apache.phoenix.iterate.RoundRobinResultIteratorIT
Tests run: 108, Failures: 0, Errors: 0, Skipped: 0, Time elapsed: 178.905 sec - in org.apache.phoenix.end2end.SortMergeJoinIT
Results :
Tests run: 1179, Failures: 0, Errors: 0, Skipped: 0
[INFO]
[INFO] --- maven-failsafe-plugin:2.19:integration-test (NeedTheirOwnClusterTests) @ phoenix-core ---
-------------------------------------------------------
T E S T S
-------------------------------------------------------
Running org.apache.phoenix.hbase.index.balancer.IndexLoadBalancerIT
Running org.apache.phoenix.rpc.PhoenixServerRpcIT
Running org.apache.phoenix.rpc.PhoenixClientRpcIT
Running org.apache.phoenix.monitoring.PhoenixMetricsIT
Running org.apache.phoenix.hbase.index.covered.example.EndToEndCoveredIndexingIT
Tests run: 2, Failures: 0, Errors: 0, Skipped: 0, Time elapsed: 14.196 sec - in org.apache.phoenix.rpc.PhoenixServerRpcIT
Tests run: 2, Failures: 0, Errors: 0, Skipped: 0, Time elapsed: 14.318 sec - in org.apache.phoenix.rpc.PhoenixClientRpcIT
Running org.apache.phoenix.hbase.index.covered.example.FailWithoutRetriesIT
Tests run: 1, Failures: 0, Errors: 0, Skipped: 0, Time elapsed: 9.077 sec - in org.apache.phoenix.hbase.index.covered.example.FailWithoutRetriesIT
Running org.apache.phoenix.hbase.index.covered.example.EndtoEndIndexingWithCompressionIT
Running org.apache.phoenix.hbase.index.covered.EndToEndCoveredColumnsIndexBuilderIT
Tests run: 2, Failures: 0, Errors: 0, Skipped: 0, Time elapsed: 19.393 sec - in org.apache.phoenix.hbase.index.covered.EndToEndCoveredColumnsIndexBuilderIT
Running org.apache.phoenix.hbase.index.FailForUnsupportedHBaseVersionsIT
Tests run: 17, Failures: 2, Errors: 0, Skipped: 0, Time elapsed: 64.934 sec <<< FAILURE! - in org.apache.phoenix.monitoring.PhoenixMetricsIT
testMetricsForUpsertSelectWithAutoCommit(org.apache.phoenix.monitoring.PhoenixMetricsIT) Time elapsed: 5.478 sec <<< FAILURE!
java.lang.AssertionError: Unequal values for metric MUTATION_BYTES expected:<5600> but was:<16240>
at org.apache.phoenix.monitoring.PhoenixMetricsIT.assertMetricsHaveSameValues(PhoenixMetricsIT.java:654)
at org.apache.phoenix.monitoring.PhoenixMetricsIT.assertMetricsAreSame(PhoenixMetricsIT.java:643)
at org.apache.phoenix.monitoring.PhoenixMetricsIT.testMetricsForUpsertSelectWithAutoCommit(PhoenixMetricsIT.java:462)
testMetricsForUpsertSelectSameTable(org.apache.phoenix.monitoring.PhoenixMetricsIT) Time elapsed: 3.426 sec <<< FAILURE!
java.lang.AssertionError: Unequal values for metric MUTATION_BYTES expected:<5600> but was:<16240>
at org.apache.phoenix.monitoring.PhoenixMetricsIT.assertMetricsHaveSameValues(PhoenixMetricsIT.java:654)
at org.apache.phoenix.monitoring.PhoenixMetricsIT.assertMetricsAreSame(PhoenixMetricsIT.java:643)
at org.apache.phoenix.monitoring.PhoenixMetricsIT.testMetricsForUpsertSelectSameTable(PhoenixMetricsIT.java:615)
Tests run: 2, Failures: 0, Errors: 0, Skipped: 0, Time elapsed: 16.329 sec - in org.apache.phoenix.hbase.index.FailForUnsupportedHBaseVersionsIT
Running org.apache.phoenix.end2end.ConnectionUtilIT
Running org.apache.phoenix.end2end.SpillableGroupByIT
Tests run: 1, Failures: 0, Errors: 0, Skipped: 0, Time elapsed: 19.478 sec - in org.apache.phoenix.end2end.ConnectionUtilIT
Tests run: 1, Failures: 0, Errors: 0, Skipped: 0, Time elapsed: 7.829 sec - in org.apache.phoenix.end2end.SpillableGroupByIT
Running org.apache.phoenix.end2end.KeyOnlyIT
Running org.apache.phoenix.end2end.ParallelIteratorsIT
Tests run: 11, Failures: 0, Errors: 0, Skipped: 0, Time elapsed: 123.542 sec - in org.apache.phoenix.hbase.index.covered.example.EndToEndCoveredIndexingIT
Tests run: 3, Failures: 0, Errors: 0, Skipped: 0, Time elapsed: 17.281 sec - in org.apache.phoenix.end2end.KeyOnlyIT
Running org.apache.phoenix.end2end.index.MutableIndexReplicationIT
Tests run: 9, Failures: 0, Errors: 0, Skipped: 0, Time elapsed: 161.915 sec - in org.apache.phoenix.hbase.index.balancer.IndexLoadBalancerIT
Running org.apache.phoenix.end2end.index.MutableIndexFailureIT
Tests run: 3, Failures: 0, Errors: 0, Skipped: 0, Time elapsed: 37.209 sec - in org.apache.phoenix.end2end.ParallelIteratorsIT
Tests run: 11, Failures: 0, Errors: 0, Skipped: 0, Time elapsed: 117.461 sec - in org.apache.phoenix.hbase.index.covered.example.EndtoEndIndexingWithCompressionIT
Running org.apache.phoenix.end2end.index.ImmutableIndexWithStatsIT
Tests run: 1, Failures: 0, Errors: 0, Skipped: 0, Time elapsed: 27.765 sec - in org.apache.phoenix.end2end.index.MutableIndexReplicationIT
Tests run: 1, Failures: 0, Errors: 0, Skipped: 0, Time elapsed: 8.134 sec - in org.apache.phoenix.end2end.index.ImmutableIndexWithStatsIT
Running org.apache.phoenix.end2end.ViewIT
Tests run: 3, Failures: 0, Errors: 0, Skipped: 2, Time elapsed: 43.672 sec - in org.apache.phoenix.end2end.index.MutableIndexFailureIT
Running org.apache.phoenix.end2end.AlterTableIT
Running org.apache.phoenix.end2end.QueryWithLimitIT
Tests run: 2, Failures: 0, Errors: 0, Skipped: 0, Time elapsed: 18.8 sec - in org.apache.phoenix.end2end.QueryWithLimitIT
Running org.apache.phoenix.end2end.StatsCollectorIT
Tests run: 22, Failures: 0, Errors: 0, Skipped: 0, Time elapsed: 68.06 sec - in org.apache.phoenix.end2end.ViewIT
Running org.apache.phoenix.end2end.StatsCollectorWithSplitsAndMultiCFIT
Tests run: 2, Failures: 0, Errors: 0, Skipped: 0, Time elapsed: 28.199 sec - in org.apache.phoenix.end2end.StatsCollectorWithSplitsAndMultiCFIT
Tests run: 4, Failures: 0, Errors: 0, Skipped: 0, Time elapsed: 57.681 sec - in org.apache.phoenix.end2end.StatsCollectorIT
Running org.apache.phoenix.end2end.CountDistinctCompressionIT
Tests run: 1, Failures: 0, Errors: 0, Skipped: 0, Time elapsed: 8.179 sec - in org.apache.phoenix.end2end.CountDistinctCompressionIT
Running org.apache.phoenix.end2end.UserDefinedFunctionsIT
Running org.apache.phoenix.end2end.TenantSpecificTablesDMLIT
Tests run: 13, Failures: 0, Errors: 0, Skipped: 0, Time elapsed: 31.297 sec - in org.apache.phoenix.end2end.UserDefinedFunctionsIT
Tests run: 16, Failures: 0, Errors: 0, Skipped: 0, Time elapsed: 38.19 sec - in org.apache.phoenix.end2end.TenantSpecificTablesDMLIT
Running org.apache.phoenix.end2end.SaltedViewIT
Running org.apache.phoenix.end2end.QueryTimeoutIT
Tests run: 2, Failures: 0, Errors: 0, Skipped: 0, Time elapsed: 15.691 sec - in org.apache.phoenix.end2end.SaltedViewIT
Tests run: 1, Failures: 0, Errors: 0, Skipped: 0, Time elapsed: 18.221 sec - in org.apache.phoenix.end2end.QueryTimeoutIT
Running org.apache.phoenix.end2end.UnionAllIT
Running org.apache.phoenix.end2end.MultiCfQueryExecIT
Tests run: 12, Failures: 0, Errors: 0, Skipped: 0, Time elapsed: 28.239 sec - in org.apache.phoenix.end2end.UnionAllIT
Tests run: 7, Failures: 0, Errors: 0, Skipped: 0, Time elapsed: 18.356 sec - in org.apache.phoenix.end2end.MultiCfQueryExecIT
Running org.apache.phoenix.iterate.RoundRobinResultIteratorWithStatsIT
Running org.apache.phoenix.execute.PartialCommitIT
Tests run: 6, Failures: 0, Errors: 0, Skipped: 0, Time elapsed: 3.508 sec - in org.apache.phoenix.execute.PartialCommitIT
Tests run: 1, Failures: 0, Errors: 0, Skipped: 0, Time elapsed: 8.254 sec - in org.apache.phoenix.iterate.RoundRobinResultIteratorWithStatsIT
Running org.apache.phoenix.mapreduce.IndexToolIT
Running org.apache.phoenix.mapreduce.CsvBulkLoadToolIT
Tests run: 55, Failures: 0, Errors: 0, Skipped: 0, Time elapsed: 398.157 sec - in org.apache.phoenix.end2end.AlterTableIT
Running org.apache.hadoop.hbase.regionserver.wal.WALReplayWithIndexWritesAndCompressedWALIT
Tests run: 1, Failures: 0, Errors: 0, Skipped: 0, Time elapsed: 22.51 sec - in org.apache.hadoop.hbase.regionserver.wal.WALReplayWithIndexWritesAndCompressedWALIT
Running org.apache.hadoop.hbase.regionserver.wal.WALReplayWithIndexWritesAndUncompressedWALInHBase_094_9_IT
Tests run: 1, Failures: 0, Errors: 0, Skipped: 0, Time elapsed: 22.426 sec - in org.apache.hadoop.hbase.regionserver.wal.WALReplayWithIndexWritesAndUncompressedWALInHBase_094_9_IT
Tests run: 5, Failures: 0, Errors: 0, Skipped: 0, Time elapsed: 172.128 sec - in org.apache.phoenix.mapreduce.CsvBulkLoadToolIT
Tests run: 9, Failures: 0, Errors: 0, Skipped: 0, Time elapsed: 352.381 sec - in org.apache.phoenix.mapreduce.IndexToolIT
Running org.apache.phoenix.end2end.TenantSpecificTablesDDLIT
Running org.apache.phoenix.end2end.ContextClassloaderIT
Tests run: 3, Failures: 0, Errors: 0, Skipped: 0, Time elapsed: 6.192 sec - in org.apache.phoenix.end2end.ContextClassloaderIT
Tests run: 17, Failures: 0, Errors: 0, Skipped: 0, Time elapsed: 42.064 sec - in org.apache.phoenix.end2end.TenantSpecificTablesDDLIT
Results :
Failed tests:
PhoenixMetricsIT.testMetricsForUpsertSelectSameTable:615->assertMetricsAreSame:643->assertMetricsHaveSameValues:654 Unequal values for metric MUTATION_BYTES expected:<5600> but was:<16240>
PhoenixMetricsIT.testMetricsForUpsertSelectWithAutoCommit:462->assertMetricsAreSame:643->assertMetricsHaveSameValues:654 Unequal values for metric MUTATION_BYTES expected:<5600> but was:<16240>
Tests run: 250, Failures: 2, Errors: 0, Skipped: 2
[INFO]
[INFO] --- maven-failsafe-plugin:2.19:verify (ClientManagedTimeTests) @ phoenix-core ---
[INFO] ------------------------------------------------------------------------
[INFO] Reactor Summary:
[INFO]
[INFO] Apache Phoenix .................................... SUCCESS [3.064s]
[INFO] Phoenix Core ...................................... FAILURE [48:16.103s]
[INFO] Phoenix - Flume ................................... SKIPPED
[INFO] Phoenix - Pig ..................................... SKIPPED
[INFO] Phoenix Query Server Client ....................... SKIPPED
[INFO] Phoenix Query Server .............................. SKIPPED
[INFO] Phoenix - Pherf ................................... SKIPPED
[INFO] Phoenix - Spark ................................... SKIPPED
[INFO] Phoenix Assembly .................................. SKIPPED
[INFO] Phoenix - Tracing Web Application ................. SKIPPED
[INFO] ------------------------------------------------------------------------
[INFO] BUILD FAILURE
[INFO] ------------------------------------------------------------------------
[INFO] Total time: 48:19.697s
[INFO] Finished at: Fri Nov 13 02:11:44 UTC 2015
[INFO] Final Memory: 63M/1025M
[INFO] ------------------------------------------------------------------------
[ERROR] Failed to execute goal org.apache.maven.plugins:maven-failsafe-plugin:2.19:verify (ClientManagedTimeTests) on project phoenix-core: There are test failures.
[ERROR]
[ERROR] Please refer to <https://builds.apache.org/job/Phoenix-master/ws/phoenix-core/target/failsafe-reports> for the individual test results.
[ERROR] -> [Help 1]
[ERROR]
[ERROR] To see the full stack trace of the errors, re-run Maven with the -e switch.
[ERROR] Re-run Maven using the -X switch to enable full debug logging.
[ERROR]
[ERROR] For more information about the errors and possible solutions, please read the following articles:
[ERROR] [Help 1] http://cwiki.apache.org/confluence/display/MAVEN/MojoFailureException
[ERROR]
[ERROR] After correcting the problems, you can resume the build with the command
[ERROR] mvn <goals> -rf :phoenix-core
Build step 'Invoke top-level Maven targets' marked build as failure
Archiving artifacts
Compressed 1.24 GB of artifacts by 56.0% relative to #951
Updating PHOENIX-2409
Updating PHOENIX-2410
Recording test results
Build failed in Jenkins: Phoenix | Master #953
Posted by Apache Jenkins Server <je...@builds.apache.org>.
See <https://builds.apache.org/job/Phoenix-master/953/changes>
Changes:
[samarth] Use a priority queue in MergeSortResultIterator (Ankit Singhal)
------------------------------------------
[...truncated 6810 lines...]
Tests run: 4, Failures: 0, Errors: 0, Skipped: 0, Time elapsed: 0.298 sec - in org.apache.phoenix.util.csv.StringToArrayConverterTest
Running org.apache.phoenix.util.DateUtilTest
Tests run: 18, Failures: 0, Errors: 0, Skipped: 0, Time elapsed: 0.052 sec - in org.apache.phoenix.util.DateUtilTest
Running org.apache.phoenix.util.PhoenixRuntimeTest
Tests run: 3, Failures: 0, Errors: 0, Skipped: 0, Time elapsed: 0.208 sec - in org.apache.phoenix.util.LogUtilTest
Running org.apache.phoenix.util.PhoenixEncodeDecodeTest
Tests run: 5, Failures: 0, Errors: 0, Skipped: 0, Time elapsed: 0.667 sec - in org.apache.phoenix.util.csv.CsvUpsertExecutorTest
Running org.apache.phoenix.util.QueryUtilTest
Tests run: 9, Failures: 0, Errors: 0, Skipped: 0, Time elapsed: 0.019 sec - in org.apache.phoenix.util.QueryUtilTest
Running org.apache.phoenix.util.TenantIdByteConversionTest
Tests run: 18, Failures: 0, Errors: 0, Skipped: 0, Time elapsed: 0.036 sec - in org.apache.phoenix.util.TenantIdByteConversionTest
Running org.apache.phoenix.util.Base62EncoderTest
Tests run: 1, Failures: 0, Errors: 0, Skipped: 0, Time elapsed: 0.012 sec - in org.apache.phoenix.util.Base62EncoderTest
Running org.apache.phoenix.util.SequenceUtilTest
Tests run: 18, Failures: 0, Errors: 0, Skipped: 0, Time elapsed: 0.009 sec - in org.apache.phoenix.util.SequenceUtilTest
Running org.apache.phoenix.util.ByteUtilTest
Tests run: 3, Failures: 0, Errors: 0, Skipped: 0, Time elapsed: 0.021 sec - in org.apache.phoenix.util.ByteUtilTest
Running org.apache.phoenix.util.IndexUtilTest
Tests run: 2, Failures: 0, Errors: 0, Skipped: 0, Time elapsed: 0.002 sec - in org.apache.phoenix.util.IndexUtilTest
Running org.apache.phoenix.util.StringUtilTest
Tests run: 5, Failures: 0, Errors: 0, Skipped: 0, Time elapsed: 0.003 sec - in org.apache.phoenix.util.StringUtilTest
Running org.apache.phoenix.util.LikeExpressionTest
Tests run: 1, Failures: 0, Errors: 0, Skipped: 0, Time elapsed: 0.003 sec - in org.apache.phoenix.util.LikeExpressionTest
Running org.apache.phoenix.util.JDBCUtilTest
Tests run: 11, Failures: 0, Errors: 0, Skipped: 0, Time elapsed: 0.005 sec - in org.apache.phoenix.util.JDBCUtilTest
Running org.apache.phoenix.util.MetaDataUtilTest
Tests run: 3, Failures: 0, Errors: 0, Skipped: 0, Time elapsed: 0.01 sec - in org.apache.phoenix.util.MetaDataUtilTest
Running org.apache.phoenix.util.ScanUtilTest
Tests run: 20, Failures: 0, Errors: 0, Skipped: 0, Time elapsed: 0.026 sec - in org.apache.phoenix.util.ScanUtilTest
Running org.apache.phoenix.util.PropertiesUtilTest
Tests run: 3, Failures: 0, Errors: 0, Skipped: 0, Time elapsed: 0.023 sec - in org.apache.phoenix.util.PropertiesUtilTest
Running org.apache.phoenix.util.ColumnInfoTest
Tests run: 4, Failures: 0, Errors: 0, Skipped: 0, Time elapsed: 0.002 sec - in org.apache.phoenix.util.ColumnInfoTest
Running org.apache.phoenix.expression.ArithmeticOperationTest
Tests run: 6, Failures: 0, Errors: 0, Skipped: 0, Time elapsed: 0.021 sec - in org.apache.phoenix.expression.ArithmeticOperationTest
Running org.apache.phoenix.expression.RegexpReplaceFunctionTest
Tests run: 4, Failures: 0, Errors: 0, Skipped: 0, Time elapsed: 0.351 sec - in org.apache.phoenix.util.PhoenixEncodeDecodeTest
Running org.apache.phoenix.expression.DeterminismTest
Tests run: 1, Failures: 0, Errors: 0, Skipped: 0, Time elapsed: 0.001 sec - in org.apache.phoenix.expression.DeterminismTest
Running org.apache.phoenix.expression.NullValueTest
Tests run: 1, Failures: 0, Errors: 0, Skipped: 0, Time elapsed: 0.116 sec - in org.apache.phoenix.expression.RegexpReplaceFunctionTest
Running org.apache.phoenix.expression.CoerceExpressionTest
Tests run: 5, Failures: 0, Errors: 0, Skipped: 0, Time elapsed: 0.006 sec - in org.apache.phoenix.expression.CoerceExpressionTest
Running org.apache.phoenix.expression.OctetLengthFunctionTest
Tests run: 1, Failures: 0, Errors: 0, Skipped: 0, Time elapsed: 0.022 sec - in org.apache.phoenix.expression.OctetLengthFunctionTest
Running org.apache.phoenix.expression.ArrayToStringFunctionTest
Tests run: 24, Failures: 0, Errors: 0, Skipped: 0, Time elapsed: 0.114 sec - in org.apache.phoenix.expression.ArrayToStringFunctionTest
Running org.apache.phoenix.expression.util.regex.PatternPerformanceTest
Tests run: 1, Failures: 0, Errors: 0, Skipped: 0, Time elapsed: 0.002 sec - in org.apache.phoenix.expression.util.regex.PatternPerformanceTest
Running org.apache.phoenix.expression.function.InstrFunctionTest
Tests run: 1, Failures: 0, Errors: 0, Skipped: 0, Time elapsed: 0.003 sec - in org.apache.phoenix.expression.function.InstrFunctionTest
Running org.apache.phoenix.expression.function.ExternalSqlTypeIdFunctionTest
Tests run: 3, Failures: 0, Errors: 0, Skipped: 0, Time elapsed: 0.002 sec - in org.apache.phoenix.expression.function.ExternalSqlTypeIdFunctionTest
Running org.apache.phoenix.expression.RegexpSubstrFunctionTest
Tests run: 1, Failures: 0, Errors: 0, Skipped: 0, Time elapsed: 0.009 sec - in org.apache.phoenix.expression.RegexpSubstrFunctionTest
Running org.apache.phoenix.expression.SignFunctionTest
Tests run: 1, Failures: 0, Errors: 0, Skipped: 0, Time elapsed: 0.012 sec - in org.apache.phoenix.expression.SignFunctionTest
Running org.apache.phoenix.expression.SqrtFunctionTest
Tests run: 1, Failures: 0, Errors: 0, Skipped: 0, Time elapsed: 0.009 sec - in org.apache.phoenix.expression.SqrtFunctionTest
Running org.apache.phoenix.expression.SortOrderExpressionTest
Tests run: 24, Failures: 0, Errors: 0, Skipped: 0, Time elapsed: 0.034 sec - in org.apache.phoenix.expression.SortOrderExpressionTest
Running org.apache.phoenix.expression.ArrayFillFunctionTest
Tests run: 14, Failures: 0, Errors: 0, Skipped: 0, Time elapsed: 0.014 sec - in org.apache.phoenix.expression.ArrayFillFunctionTest
Running org.apache.phoenix.expression.ArrayPrependFunctionTest
Tests run: 3, Failures: 0, Errors: 0, Skipped: 0, Time elapsed: 0.312 sec - in org.apache.phoenix.expression.NullValueTest
Running org.apache.phoenix.expression.RoundFloorCeilExpressionsTest
Tests run: 37, Failures: 0, Errors: 0, Skipped: 0, Time elapsed: 0.235 sec - in org.apache.phoenix.expression.ArrayPrependFunctionTest
Running org.apache.phoenix.expression.PowerFunctionTest
Tests run: 1, Failures: 0, Errors: 0, Skipped: 0, Time elapsed: 0.026 sec - in org.apache.phoenix.expression.PowerFunctionTest
Tests run: 10, Failures: 0, Errors: 0, Skipped: 0, Time elapsed: 0.997 sec - in org.apache.phoenix.util.PhoenixRuntimeTest
Running org.apache.phoenix.expression.ColumnExpressionTest
Tests run: 4, Failures: 0, Errors: 0, Skipped: 0, Time elapsed: 0.005 sec - in org.apache.phoenix.expression.ColumnExpressionTest
Running org.apache.phoenix.expression.RegexpSplitFunctionTest
Tests run: 1, Failures: 0, Errors: 0, Skipped: 0, Time elapsed: 0.14 sec - in org.apache.phoenix.expression.RegexpSplitFunctionTest
Running org.apache.phoenix.expression.LnLogFunctionTest
Tests run: 1, Failures: 0, Errors: 0, Skipped: 0, Time elapsed: 0.021 sec - in org.apache.phoenix.expression.LnLogFunctionTest
Running org.apache.phoenix.expression.AbsFunctionTest
Tests run: 1, Failures: 0, Errors: 0, Skipped: 0, Time elapsed: 0.013 sec - in org.apache.phoenix.expression.AbsFunctionTest
Running org.apache.phoenix.expression.LikeExpressionTest
Tests run: 4, Failures: 0, Errors: 0, Skipped: 0, Time elapsed: 0.012 sec - in org.apache.phoenix.expression.LikeExpressionTest
Running org.apache.phoenix.expression.ExpFunctionTest
Tests run: 1, Failures: 0, Errors: 0, Skipped: 0, Time elapsed: 0.009 sec - in org.apache.phoenix.expression.ExpFunctionTest
Running org.apache.phoenix.expression.ILikeExpressionTest
Tests run: 3, Failures: 0, Errors: 0, Skipped: 0, Time elapsed: 0.013 sec - in org.apache.phoenix.expression.ILikeExpressionTest
Running org.apache.phoenix.expression.ArrayAppendFunctionTest
Tests run: 21, Failures: 0, Errors: 0, Skipped: 0, Time elapsed: 0.736 sec - in org.apache.phoenix.expression.RoundFloorCeilExpressionsTest
Running org.apache.phoenix.expression.CbrtFunctionTest
Tests run: 1, Failures: 0, Errors: 0, Skipped: 0, Time elapsed: 0.008 sec - in org.apache.phoenix.expression.CbrtFunctionTest
Running org.apache.phoenix.expression.ArrayConcatFunctionTest
Tests run: 35, Failures: 0, Errors: 0, Skipped: 0, Time elapsed: 0.426 sec - in org.apache.phoenix.expression.ArrayConcatFunctionTest
Running org.apache.phoenix.expression.StringToArrayFunctionTest
Tests run: 20, Failures: 0, Errors: 0, Skipped: 0, Time elapsed: 0.014 sec - in org.apache.phoenix.expression.StringToArrayFunctionTest
Running org.apache.phoenix.filter.SkipScanFilterTest
Tests run: 25, Failures: 0, Errors: 0, Skipped: 0, Time elapsed: 0.679 sec - in org.apache.phoenix.expression.ArrayAppendFunctionTest
Running org.apache.phoenix.filter.SkipScanBigFilterTest
Tests run: 13, Failures: 0, Errors: 0, Skipped: 0, Time elapsed: 0.064 sec - in org.apache.phoenix.filter.SkipScanFilterTest
Running org.apache.phoenix.filter.SkipScanFilterIntersectTest
Tests run: 19, Failures: 0, Errors: 0, Skipped: 0, Time elapsed: 0.027 sec - in org.apache.phoenix.filter.SkipScanFilterIntersectTest
Running org.apache.phoenix.cache.JodaTimezoneCacheTest
Tests run: 4, Failures: 0, Errors: 0, Skipped: 0, Time elapsed: 0.039 sec - in org.apache.phoenix.cache.JodaTimezoneCacheTest
Running org.apache.phoenix.jdbc.PhoenixPreparedStatementTest
Tests run: 8, Failures: 0, Errors: 0, Skipped: 0, Time elapsed: 0.144 sec - in org.apache.phoenix.jdbc.PhoenixPreparedStatementTest
Running org.apache.phoenix.jdbc.PhoenixResultSetMetadataTest
Tests run: 1, Failures: 0, Errors: 0, Skipped: 0, Time elapsed: 0.399 sec - in org.apache.phoenix.jdbc.PhoenixResultSetMetadataTest
Running org.apache.phoenix.jdbc.PhoenixEmbeddedDriverTest
Tests run: 3, Failures: 0, Errors: 0, Skipped: 0, Time elapsed: 0.002 sec - in org.apache.phoenix.jdbc.PhoenixEmbeddedDriverTest
Running org.apache.phoenix.jdbc.PhoenixDriverTest
Tests run: 2, Failures: 0, Errors: 0, Skipped: 0, Time elapsed: 0.771 sec - in org.apache.phoenix.filter.SkipScanBigFilterTest
Running org.apache.phoenix.index.IndexMaintainerTest
Tests run: 4, Failures: 0, Errors: 0, Skipped: 0, Time elapsed: 0.256 sec - in org.apache.phoenix.jdbc.PhoenixDriverTest
Running org.apache.phoenix.trace.TraceMetricsSourceTest
Tests run: 3, Failures: 0, Errors: 0, Skipped: 0, Time elapsed: 0.189 sec - in org.apache.phoenix.trace.TraceMetricsSourceTest
Running org.apache.phoenix.execute.CorrelatePlanTest
Tests run: 23, Failures: 0, Errors: 0, Skipped: 0, Time elapsed: 0.478 sec - in org.apache.phoenix.index.IndexMaintainerTest
Running org.apache.phoenix.execute.MutationStateTest
Tests run: 1, Failures: 0, Errors: 0, Skipped: 0, Time elapsed: 0.001 sec - in org.apache.phoenix.execute.MutationStateTest
Running org.apache.phoenix.execute.DescVarLengthFastByteComparisonsTest
Tests run: 2, Failures: 0, Errors: 0, Skipped: 0, Time elapsed: 0.003 sec - in org.apache.phoenix.execute.DescVarLengthFastByteComparisonsTest
Running org.apache.phoenix.execute.UnnestArrayPlanTest
Tests run: 5, Failures: 0, Errors: 0, Skipped: 0, Time elapsed: 0.135 sec - in org.apache.phoenix.execute.CorrelatePlanTest
Running org.apache.phoenix.compile.HavingCompilerTest
Tests run: 6, Failures: 0, Errors: 0, Skipped: 0, Time elapsed: 0.066 sec - in org.apache.phoenix.execute.UnnestArrayPlanTest
Running org.apache.phoenix.compile.StatementHintsCompilationTest
Tests run: 3, Failures: 0, Errors: 0, Skipped: 0, Time elapsed: 0.209 sec - in org.apache.phoenix.compile.StatementHintsCompilationTest
Running org.apache.phoenix.compile.ScanRangesIntersectTest
Tests run: 11, Failures: 0, Errors: 0, Skipped: 0, Time elapsed: 0.275 sec - in org.apache.phoenix.compile.HavingCompilerTest
Tests run: 1, Failures: 0, Errors: 0, Skipped: 0, Time elapsed: 0.002 sec - in org.apache.phoenix.compile.ScanRangesIntersectTest
Running org.apache.phoenix.compile.TenantSpecificViewIndexCompileTest
Running org.apache.phoenix.compile.QueryOptimizerTest
Tests run: 6, Failures: 0, Errors: 0, Skipped: 0, Time elapsed: 0.387 sec - in org.apache.phoenix.compile.TenantSpecificViewIndexCompileTest
Running org.apache.phoenix.compile.QueryMetaDataTest
Tests run: 33, Failures: 0, Errors: 0, Skipped: 0, Time elapsed: 0.185 sec - in org.apache.phoenix.compile.QueryMetaDataTest
Running org.apache.phoenix.compile.JoinQueryCompilerTest
Tests run: 2, Failures: 0, Errors: 0, Skipped: 0, Time elapsed: 0.133 sec - in org.apache.phoenix.compile.JoinQueryCompilerTest
Running org.apache.phoenix.compile.WhereOptimizerTest
Tests run: 38, Failures: 0, Errors: 0, Skipped: 0, Time elapsed: 1.048 sec - in org.apache.phoenix.compile.QueryOptimizerTest
Running org.apache.phoenix.compile.ViewCompilerTest
Tests run: 103, Failures: 0, Errors: 0, Skipped: 0, Time elapsed: 0.43 sec - in org.apache.phoenix.compile.WhereOptimizerTest
Running org.apache.phoenix.compile.QueryCompilerTest
Tests run: 3, Failures: 0, Errors: 0, Skipped: 0, Time elapsed: 0.251 sec - in org.apache.phoenix.compile.ViewCompilerTest
Running org.apache.phoenix.compile.SelectStatementRewriterTest
Tests run: 5, Failures: 0, Errors: 0, Skipped: 0, Time elapsed: 0.142 sec - in org.apache.phoenix.compile.SelectStatementRewriterTest
Running org.apache.phoenix.compile.WhereCompilerTest
Tests run: 43, Failures: 0, Errors: 0, Skipped: 1, Time elapsed: 0.305 sec - in org.apache.phoenix.compile.WhereCompilerTest
Running org.apache.phoenix.compile.LimitCompilerTest
Tests run: 114, Failures: 0, Errors: 0, Skipped: 0, Time elapsed: 0.635 sec - in org.apache.phoenix.compile.QueryCompilerTest
Running org.apache.phoenix.compile.ScanRangesTest
Tests run: 34, Failures: 0, Errors: 0, Skipped: 0, Time elapsed: 0.043 sec - in org.apache.phoenix.compile.ScanRangesTest
Running org.apache.phoenix.parse.BuiltInFunctionInfoTest
Tests run: 3, Failures: 0, Errors: 0, Skipped: 0, Time elapsed: 0.004 sec - in org.apache.phoenix.parse.BuiltInFunctionInfoTest
Running org.apache.phoenix.parse.QueryParserTest
Tests run: 58, Failures: 0, Errors: 0, Skipped: 0, Time elapsed: 0.045 sec - in org.apache.phoenix.parse.QueryParserTest
Running org.apache.phoenix.parse.CastParseNodeTest
Tests run: 6, Failures: 0, Errors: 0, Skipped: 0, Time elapsed: 0.139 sec - in org.apache.phoenix.compile.LimitCompilerTest
Running org.apache.phoenix.iterate.AggregateResultScannerTest
Tests run: 3, Failures: 0, Errors: 0, Skipped: 0, Time elapsed: 0.002 sec - in org.apache.phoenix.parse.CastParseNodeTest
Running org.apache.phoenix.iterate.MergeSortResultIteratorTest
Tests run: 2, Failures: 0, Errors: 0, Skipped: 0, Time elapsed: 0.005 sec - in org.apache.phoenix.iterate.MergeSortResultIteratorTest
Running org.apache.phoenix.iterate.ConcatResultIteratorTest
Tests run: 2, Failures: 0, Errors: 0, Skipped: 0, Time elapsed: 0.002 sec - in org.apache.phoenix.iterate.ConcatResultIteratorTest
Running org.apache.phoenix.iterate.SpoolingResultIteratorTest
Tests run: 1, Failures: 0, Errors: 0, Skipped: 0, Time elapsed: 0.127 sec - in org.apache.phoenix.iterate.AggregateResultScannerTest
Running org.apache.phoenix.hbase.index.parallel.TestThreadPoolManager
Tests run: 3, Failures: 0, Errors: 0, Skipped: 0, Time elapsed: 0.012 sec - in org.apache.phoenix.hbase.index.parallel.TestThreadPoolManager
Running org.apache.phoenix.hbase.index.parallel.TestThreadPoolBuilder
Tests run: 2, Failures: 0, Errors: 0, Skipped: 0, Time elapsed: 0.001 sec - in org.apache.phoenix.hbase.index.parallel.TestThreadPoolBuilder
Running org.apache.phoenix.hbase.index.util.TestIndexManagementUtil
Tests run: 3, Failures: 0, Errors: 0, Skipped: 0, Time elapsed: 0.015 sec - in org.apache.phoenix.hbase.index.util.TestIndexManagementUtil
Running org.apache.phoenix.hbase.index.covered.update.TestIndexUpdateManager
Tests run: 2, Failures: 0, Errors: 0, Skipped: 0, Time elapsed: 0.005 sec - in org.apache.phoenix.hbase.index.covered.update.TestIndexUpdateManager
Running org.apache.phoenix.hbase.index.covered.TestCoveredColumns
Tests run: 1, Failures: 0, Errors: 0, Skipped: 0, Time elapsed: 0.001 sec - in org.apache.phoenix.hbase.index.covered.TestCoveredColumns
Running org.apache.phoenix.hbase.index.covered.filter.TestApplyAndFilterDeletesFilter
Tests run: 6, Failures: 0, Errors: 0, Skipped: 0, Time elapsed: 0.005 sec - in org.apache.phoenix.hbase.index.covered.filter.TestApplyAndFilterDeletesFilter
Running org.apache.phoenix.hbase.index.covered.filter.TestNewerTimestampFilter
Tests run: 1, Failures: 0, Errors: 0, Skipped: 0, Time elapsed: 0.001 sec - in org.apache.phoenix.hbase.index.covered.filter.TestNewerTimestampFilter
Running org.apache.phoenix.hbase.index.covered.TestLocalTableState
Tests run: 3, Failures: 0, Errors: 0, Skipped: 0, Time elapsed: 0.252 sec - in org.apache.phoenix.iterate.SpoolingResultIteratorTest
Running org.apache.phoenix.hbase.index.covered.example.TestColumnTracker
Tests run: 3, Failures: 0, Errors: 0, Skipped: 0, Time elapsed: 0.003 sec - in org.apache.phoenix.hbase.index.covered.example.TestColumnTracker
Running org.apache.phoenix.hbase.index.covered.example.TestCoveredIndexSpecifierBuilder
Tests run: 1, Failures: 0, Errors: 0, Skipped: 0, Time elapsed: 0.003 sec - in org.apache.phoenix.hbase.index.covered.example.TestCoveredIndexSpecifierBuilder
Running org.apache.phoenix.hbase.index.covered.example.TestCoveredColumnIndexCodec
Tests run: 3, Failures: 0, Errors: 0, Skipped: 0, Time elapsed: 0.094 sec - in org.apache.phoenix.hbase.index.covered.TestLocalTableState
Running org.apache.phoenix.hbase.index.covered.data.TestIndexMemStore
Tests run: 2, Failures: 0, Errors: 0, Skipped: 0, Time elapsed: 0.004 sec - in org.apache.phoenix.hbase.index.covered.data.TestIndexMemStore
Running org.apache.phoenix.hbase.index.write.TestIndexWriter
Tests run: 5, Failures: 0, Errors: 0, Skipped: 0, Time elapsed: 0.081 sec - in org.apache.phoenix.hbase.index.write.TestIndexWriter
Running org.apache.phoenix.hbase.index.write.recovery.TestPerRegionIndexWriteCache
Tests run: 3, Failures: 0, Errors: 0, Skipped: 0, Time elapsed: 0.157 sec - in org.apache.phoenix.hbase.index.covered.example.TestCoveredColumnIndexCodec
Running org.apache.phoenix.hbase.index.write.TestParalleWriterIndexCommitter
Tests run: 2, Failures: 0, Errors: 0, Skipped: 0, Time elapsed: 0.079 sec - in org.apache.phoenix.hbase.index.write.TestParalleWriterIndexCommitter
Running org.apache.phoenix.hbase.index.write.TestCachingHTableFactory
Tests run: 1, Failures: 0, Errors: 0, Skipped: 0, Time elapsed: 0.015 sec - in org.apache.phoenix.hbase.index.write.TestCachingHTableFactory
Running org.apache.phoenix.hbase.index.write.TestWALRecoveryCaching
Tests run: 1, Failures: 0, Errors: 0, Skipped: 1, Time elapsed: 0.006 sec - in org.apache.phoenix.hbase.index.write.TestWALRecoveryCaching
Running org.apache.phoenix.hbase.index.write.TestParalleIndexWriter
Tests run: 2, Failures: 0, Errors: 0, Skipped: 0, Time elapsed: 0.007 sec - in org.apache.phoenix.hbase.index.write.TestParalleIndexWriter
Running org.apache.phoenix.memory.MemoryManagerTest
Tests run: 3, Failures: 0, Errors: 0, Skipped: 0, Time elapsed: 0.769 sec - in org.apache.phoenix.hbase.index.write.recovery.TestPerRegionIndexWriteCache
Running org.apache.phoenix.query.OrderByTest
Tests run: 3, Failures: 0, Errors: 0, Skipped: 0, Time elapsed: 0.108 sec - in org.apache.phoenix.query.OrderByTest
Running org.apache.phoenix.query.KeyRangeCoalesceTest
Tests run: 13, Failures: 0, Errors: 0, Skipped: 0, Time elapsed: 0.019 sec - in org.apache.phoenix.query.KeyRangeCoalesceTest
Running org.apache.phoenix.query.KeyRangeUnionTest
Tests run: 8, Failures: 0, Errors: 0, Skipped: 0, Time elapsed: 0.013 sec - in org.apache.phoenix.query.KeyRangeUnionTest
Running org.apache.phoenix.query.ConnectionlessTest
Tests run: 3, Failures: 0, Errors: 0, Skipped: 0, Time elapsed: 0.058 sec - in org.apache.phoenix.query.ConnectionlessTest
Running org.apache.phoenix.query.HBaseFactoryProviderTest
Tests run: 3, Failures: 0, Errors: 0, Skipped: 0, Time elapsed: 0.003 sec - in org.apache.phoenix.query.HBaseFactoryProviderTest
Running org.apache.phoenix.query.ParallelIteratorsSplitTest
Tests run: 8, Failures: 0, Errors: 0, Skipped: 0, Time elapsed: 0.134 sec - in org.apache.phoenix.query.ParallelIteratorsSplitTest
Running org.apache.phoenix.query.KeyRangeIntersectTest
Tests run: 8, Failures: 0, Errors: 0, Skipped: 0, Time elapsed: 0.014 sec - in org.apache.phoenix.query.KeyRangeIntersectTest
Running org.apache.phoenix.query.QueryPlanTest
Tests run: 3, Failures: 0, Errors: 0, Skipped: 0, Time elapsed: 0.243 sec - in org.apache.phoenix.query.QueryPlanTest
Running org.apache.hadoop.hbase.regionserver.PhoenixRpcSchedulerFactoryTest
Tests run: 2, Failures: 0, Errors: 0, Skipped: 0, Time elapsed: 0.013 sec - in org.apache.hadoop.hbase.regionserver.PhoenixRpcSchedulerFactoryTest
Running org.apache.hadoop.hbase.ipc.PhoenixIndexRpcSchedulerTest
Tests run: 2, Failures: 0, Errors: 0, Skipped: 0, Time elapsed: 0.141 sec - in org.apache.hadoop.hbase.ipc.PhoenixIndexRpcSchedulerTest
Tests run: 5, Failures: 0, Errors: 0, Skipped: 1, Time elapsed: 6.011 sec - in org.apache.phoenix.memory.MemoryManagerTest
Build timed out (after 120 minutes). Marking the build as failed.
Build was aborted
Archiving artifacts
ERROR: Failed to archive artifacts: **/surefire-reports/*,**/failsafe-reports/*.xml,**/*.txt,**/*.jar,**/bin/*.py,**/bin/*.xml,**/bin/*.properties
hudson.util.IOException2: null
stream=
at com.cloudbees.jenkins.plugins.jsync.archiver.JSyncArtifactManager.inflate(JSyncArtifactManager.java:276)
at com.cloudbees.jenkins.plugins.jsync.archiver.JSyncArtifactManager.remoteSync(JSyncArtifactManager.java:145)
at com.cloudbees.jenkins.plugins.jsync.archiver.JSyncArtifactManager.archive(JSyncArtifactManager.java:72)
at hudson.tasks.ArtifactArchiver.perform(ArtifactArchiver.java:219)
at hudson.tasks.BuildStepCompatibilityLayer.perform(BuildStepCompatibilityLayer.java:74)
at hudson.tasks.BuildStepMonitor$1.perform(BuildStepMonitor.java:20)
at hudson.model.AbstractBuild$AbstractBuildExecution.perform(AbstractBuild.java:776)
at hudson.model.AbstractBuild$AbstractBuildExecution.performAllBuildSteps(AbstractBuild.java:723)
at hudson.model.Build$BuildExecution.post2(Build.java:183)
at hudson.model.AbstractBuild$AbstractBuildExecution.post(AbstractBuild.java:670)
at hudson.model.Run.execute(Run.java:1763)
at hudson.model.FreeStyleBuild.run(FreeStyleBuild.java:43)
at hudson.model.ResourceController.execute(ResourceController.java:98)
at hudson.model.Executor.run(Executor.java:381)
Caused by: java.io.EOFException
at java.util.zip.GZIPInputStream.readUByte(GZIPInputStream.java:264)
at java.util.zip.GZIPInputStream.readUShort(GZIPInputStream.java:254)
at java.util.zip.GZIPInputStream.readHeader(GZIPInputStream.java:163)
at java.util.zip.GZIPInputStream.<init>(GZIPInputStream.java:78)
at com.cloudbees.jenkins.plugins.jsync.archiver.JSyncArtifactManager.inflate(JSyncArtifactManager.java:272)
... 13 more
Recording test results