You are viewing a plain text version of this content. The canonical link for it is here.
Posted to commits@tuscany.apache.org by Apache Hudson Server <hu...@hudson.apache.org> on 2010/11/10 03:02:12 UTC
Build failed in Hudson: Tuscany-2x » Apache Tuscany SCA Specification Compliance Tests Java CAA #931
See <https://hudson.apache.org/hudson/job/Tuscany-2x/org.apache.tuscany.sca$tuscany-compliance-test-java-caa/931/>
------------------------------------------
[INFO] ------------------------------------------------------------------------
[INFO] Building Apache Tuscany SCA Specification Compliance Tests Java CAA
[INFO] task-segment: [clean, install]
[INFO] ------------------------------------------------------------------------
[INFO] [clean:clean {execution: default-clean}]
[INFO] snapshot org.apache.tuscany.sca:tuscany-otests-sca-j-caa-tests:2.0-SNAPSHOT: checking for updates from oasis.contributions
[INFO] snapshot org.apache.tuscany.sca:tuscany-otests-sca-j-caa-tests:2.0-SNAPSHOT: checking for updates from apache.snapshots
[INFO] [enforcer:enforce {execution: enforce-plugin-versions}]
[INFO] [remote-resources:process {execution: default}]
[INFO] [resources:resources {execution: default-resources}]
[INFO] Using 'UTF-8' encoding to copy filtered resources.
[INFO] skip non existing resourceDirectory <https://hudson.apache.org/hudson/job/Tuscany-2x/org.apache.tuscany.sca$tuscany-compliance-test-java-caa/ws/src/main/resources>
[INFO] Copying 0 resource
[INFO] Copying 3 resources
[INFO] [compiler:compile {execution: default-compile}]
[INFO] No sources to compile
[INFO] [dependency:unpack {execution: unpack}]
[INFO] Configured Artifact: org.apache.tuscany.sca:oasis-javacaa-contributions:2.0-SNAPSHOT:zip
[INFO] snapshot org.apache.tuscany.sca:oasis-javacaa-contributions:2.0-SNAPSHOT: checking for updates from oasis.contributions
[INFO] snapshot org.apache.tuscany.sca:oasis-javacaa-contributions:2.0-SNAPSHOT: checking for updates from apache.snapshots
Downloading: http://svn.apache.org/repos/asf/tuscany/maven/org/apache/tuscany/sca/oasis-javacaa-contributions/2.0-SNAPSHOT/oasis-javacaa-contributions-2.0-SNAPSHOT.zip
[INFO] Configured Artifact: org.apache.tuscany.sca:tuscany-otests-sca-j-caa-tests:2.0-SNAPSHOT:jar
[INFO] Unpacking /home/hudson/.m2/repository/org/apache/tuscany/sca/oasis-javacaa-contributions/2.0-SNAPSHOT/oasis-javacaa-contributions-2.0-SNAPSHOT.zip to
<https://hudson.apache.org/hudson/job/Tuscany-2x/org.apache.tuscany.sca$tuscany-compliance-test-java-caa/ws/target/oasis-contributions>
with includes null and excludes:null
[INFO] Unpacking /home/hudson/.m2/repository/org/apache/tuscany/sca/tuscany-otests-sca-j-caa-tests/2.0-SNAPSHOT/tuscany-otests-sca-j-caa-tests-2.0-SNAPSHOT.jar to
<https://hudson.apache.org/hudson/job/Tuscany-2x/org.apache.tuscany.sca$tuscany-compliance-test-java-caa/ws/target/test-classes>
with includes null and excludes:commons-logging.properties,oasis-sca-tests.properties,tuscany-oasis-sca-tests-errors.properties
[INFO] [resources:testResources {execution: default-testResources}]
[INFO] Using 'UTF-8' encoding to copy filtered resources.
[INFO] Copying 2 resources
[INFO] Copying 3 resources
[INFO] [compiler:testCompile {execution: default-testCompile}]
[INFO] Compiling 1 source file to <https://hudson.apache.org/hudson/job/Tuscany-2x/org.apache.tuscany.sca$tuscany-compliance-test-java-caa/ws/target/test-classes>
[INFO] -------------------------------------------------------------
[ERROR] COMPILATION ERROR :
[INFO] -------------------------------------------------------------
[ERROR] <https://hudson.apache.org/hudson/job/Tuscany-2x/org.apache.tuscany.sca$tuscany-compliance-test-java-caa/ws/src/test/java/org/apache/tuscany/sca/otest/TuscanyRuntimeBridge.java>:[36,17] package testClient does not exist
[ERROR] <https://hudson.apache.org/hudson/job/Tuscany-2x/org.apache.tuscany.sca$tuscany-compliance-test-java-caa/ws/src/test/java/org/apache/tuscany/sca/otest/TuscanyRuntimeBridge.java>:[37,13] package client does not exist
[ERROR] <https://hudson.apache.org/hudson/job/Tuscany-2x/org.apache.tuscany.sca$tuscany-compliance-test-java-caa/ws/src/test/java/org/apache/tuscany/sca/otest/TuscanyRuntimeBridge.java>:[43,45] cannot find symbol
symbol: class RuntimeBridge
public class TuscanyRuntimeBridge implements RuntimeBridge {
[ERROR] <https://hudson.apache.org/hudson/job/Tuscany-2x/org.apache.tuscany.sca$tuscany-compliance-test-java-caa/ws/src/test/java/org/apache/tuscany/sca/otest/TuscanyRuntimeBridge.java>:[215,26] cannot find symbol
symbol : class TestException_Exception
location: class org.apache.tuscany.sca.otest.TuscanyRuntimeBridge
[ERROR] <https://hudson.apache.org/hudson/job/Tuscany-2x/org.apache.tuscany.sca$tuscany-compliance-test-java-caa/ws/src/test/java/org/apache/tuscany/sca/otest/TuscanyRuntimeBridge.java>:[216,12] cannot find symbol
symbol : class TestException_Exception
location: class org.apache.tuscany.sca.otest.TuscanyRuntimeBridge
[ERROR] <https://hudson.apache.org/hudson/job/Tuscany-2x/org.apache.tuscany.sca$tuscany-compliance-test-java-caa/ws/src/test/java/org/apache/tuscany/sca/otest/TuscanyRuntimeBridge.java>:[216,42] cannot find symbol
symbol : class TestException_Exception
location: class org.apache.tuscany.sca.otest.TuscanyRuntimeBridge
[INFO] 6 errors
[INFO] -------------------------------------------------------------
[HUDSON] Archiving <https://hudson.apache.org/hudson/job/Tuscany-2x/org.apache.tuscany.sca$tuscany-compliance-test-java-caa/ws/pom.xml> to /home/hudson/hudson/jobs/Tuscany-2x/modules/org.apache.tuscany.sca$tuscany-compliance-test-java-caa/builds/2010-11-10_01-11-36/archive/org.apache.tuscany.sca/tuscany-compliance-test-java-caa/2.0-SNAPSHOT/pom.xml
[INFO] ------------------------------------------------------------------------
[ERROR] BUILD FAILURE
[INFO] ------------------------------------------------------------------------
[INFO] Compilation failure
<https://hudson.apache.org/hudson/job/Tuscany-2x/org.apache.tuscany.sca$tuscany-compliance-test-java-caa/ws/src/test/java/org/apache/tuscany/sca/otest/TuscanyRuntimeBridge.java>:[36,17] package testClient does not exist
<https://hudson.apache.org/hudson/job/Tuscany-2x/org.apache.tuscany.sca$tuscany-compliance-test-java-caa/ws/src/test/java/org/apache/tuscany/sca/otest/TuscanyRuntimeBridge.java>:[37,13] package client does not exist
<https://hudson.apache.org/hudson/job/Tuscany-2x/org.apache.tuscany.sca$tuscany-compliance-test-java-caa/ws/src/test/java/org/apache/tuscany/sca/otest/TuscanyRuntimeBridge.java>:[43,45] cannot find symbol
symbol: class RuntimeBridge
public class TuscanyRuntimeBridge implements RuntimeBridge {
<https://hudson.apache.org/hudson/job/Tuscany-2x/org.apache.tuscany.sca$tuscany-compliance-test-java-caa/ws/src/test/java/org/apache/tuscany/sca/otest/TuscanyRuntimeBridge.java>:[215,26] cannot find symbol
symbol : class TestException_Exception
location: class org.apache.tuscany.sca.otest.TuscanyRuntimeBridge
<https://hudson.apache.org/hudson/job/Tuscany-2x/org.apache.tuscany.sca$tuscany-compliance-test-java-caa/ws/src/test/java/org/apache/tuscany/sca/otest/TuscanyRuntimeBridge.java>:[216,12] cannot find symbol
symbol : class TestException_Exception
location: class org.apache.tuscany.sca.otest.TuscanyRuntimeBridge
<https://hudson.apache.org/hudson/job/Tuscany-2x/org.apache.tuscany.sca$tuscany-compliance-test-java-caa/ws/src/test/java/org/apache/tuscany/sca/otest/TuscanyRuntimeBridge.java>:[216,42] cannot find symbol
symbol : class TestException_Exception
location: class org.apache.tuscany.sca.otest.TuscanyRuntimeBridge
[INFO] ------------------------------------------------------------------------
[INFO] For more information, run Maven with the -e switch
[INFO] ------------------------------------------------------------------------
[INFO] Total time: 50 minutes 24 seconds
[INFO] Finished at: Wed Nov 10 02:02:10 UTC 2010
[INFO] Final Memory: 216M/738M
[INFO] ------------------------------------------------------------------------
Waiting for Hudson to finish collecting data
Re: Build failed in Hudson: Tuscany-2x » Apache Tuscany SCA Specification Compliance Tests Java CAA #933
Posted by ant elder <an...@gmail.com>.
On Thu, Nov 11, 2010 at 3:46 AM, Apache Hudson Server
<hu...@hudson.apache.org> wrote:
> See <https://hudson.apache.org/hudson/job/Tuscany-2x/org.apache.tuscany.sca$tuscany-compliance-test-java-caa/933/>
>
> ------------------------------------------
> [INFO] ------------------------------------------------------------------------
> [INFO] Building Apache Tuscany SCA Specification Compliance Tests Java CAA
> [INFO] task-segment: [clean, install]
> [INFO] ------------------------------------------------------------------------
> [INFO] [clean:clean {execution: default-clean}]
> [INFO] snapshot org.apache.tuscany.sca:tuscany-otests-sca-j-caa-tests:2.0-SNAPSHOT: checking for updates from oasis.contributions
> [INFO] snapshot org.apache.tuscany.sca:tuscany-otests-sca-j-caa-tests:2.0-SNAPSHOT: checking for updates from apache.snapshots
> [INFO] [enforcer:enforce {execution: enforce-plugin-versions}]
> [INFO] [remote-resources:process {execution: default}]
> [INFO] [resources:resources {execution: default-resources}]
> [INFO] Using 'UTF-8' encoding to copy filtered resources.
> [INFO] skip non existing resourceDirectory <https://hudson.apache.org/hudson/job/Tuscany-2x/org.apache.tuscany.sca$tuscany-compliance-test-java-caa/ws/src/main/resources>
> [INFO] Copying 0 resource
> [INFO] Copying 3 resources
> [INFO] [compiler:compile {execution: default-compile}]
> [INFO] No sources to compile
> [INFO] [dependency:unpack {execution: unpack}]
> [INFO] Configured Artifact: org.apache.tuscany.sca:oasis-javacaa-contributions:2.0-SNAPSHOT:zip
> [INFO] snapshot org.apache.tuscany.sca:oasis-javacaa-contributions:2.0-SNAPSHOT: checking for updates from oasis.contributions
> [INFO] snapshot org.apache.tuscany.sca:oasis-javacaa-contributions:2.0-SNAPSHOT: checking for updates from apache.snapshots
> Downloading: http://svn.apache.org/repos/asf/tuscany/maven/org/apache/tuscany/sca/oasis-javacaa-contributions/2.0-SNAPSHOT/oasis-javacaa-contributions-2.0-SNAPSHOT.zip
> [INFO] Configured Artifact: org.apache.tuscany.sca:tuscany-otests-sca-j-caa-tests:2.0-SNAPSHOT:jar
> [INFO] Unpacking /home/hudson/.m2/repository/org/apache/tuscany/sca/oasis-javacaa-contributions/2.0-SNAPSHOT/oasis-javacaa-contributions-2.0-SNAPSHOT.zip to
> <https://hudson.apache.org/hudson/job/Tuscany-2x/org.apache.tuscany.sca$tuscany-compliance-test-java-caa/ws/target/oasis-contributions>
> with includes null and excludes:null
> [INFO] Unpacking /home/hudson/.m2/repository/org/apache/tuscany/sca/tuscany-otests-sca-j-caa-tests/2.0-SNAPSHOT/tuscany-otests-sca-j-caa-tests-2.0-SNAPSHOT.jar to
> <https://hudson.apache.org/hudson/job/Tuscany-2x/org.apache.tuscany.sca$tuscany-compliance-test-java-caa/ws/target/test-classes>
> with includes null and excludes:commons-logging.properties,oasis-sca-tests.properties,tuscany-oasis-sca-tests-errors.properties
> [INFO] [resources:testResources {execution: default-testResources}]
> [INFO] Using 'UTF-8' encoding to copy filtered resources.
> [INFO] Copying 2 resources
> [INFO] Copying 3 resources
> [INFO] [compiler:testCompile {execution: default-testCompile}]
> [INFO] Compiling 1 source file to <https://hudson.apache.org/hudson/job/Tuscany-2x/org.apache.tuscany.sca$tuscany-compliance-test-java-caa/ws/target/test-classes>
> [INFO] -------------------------------------------------------------
> [ERROR] COMPILATION ERROR :
> [INFO] -------------------------------------------------------------
> [ERROR] <https://hudson.apache.org/hudson/job/Tuscany-2x/org.apache.tuscany.sca$tuscany-compliance-test-java-caa/ws/src/test/java/org/apache/tuscany/sca/otest/TuscanyRuntimeBridge.java>:[36,17] package testClient does not exist
>
> [ERROR] <https://hudson.apache.org/hudson/job/Tuscany-2x/org.apache.tuscany.sca$tuscany-compliance-test-java-caa/ws/src/test/java/org/apache/tuscany/sca/otest/TuscanyRuntimeBridge.java>:[37,13] package client does not exist
>
> [ERROR] <https://hudson.apache.org/hudson/job/Tuscany-2x/org.apache.tuscany.sca$tuscany-compliance-test-java-caa/ws/src/test/java/org/apache/tuscany/sca/otest/TuscanyRuntimeBridge.java>:[43,45] cannot find symbol
> symbol: class RuntimeBridge
> public class TuscanyRuntimeBridge implements RuntimeBridge {
>
> [ERROR] <https://hudson.apache.org/hudson/job/Tuscany-2x/org.apache.tuscany.sca$tuscany-compliance-test-java-caa/ws/src/test/java/org/apache/tuscany/sca/otest/TuscanyRuntimeBridge.java>:[215,26] cannot find symbol
> symbol : class TestException_Exception
> location: class org.apache.tuscany.sca.otest.TuscanyRuntimeBridge
>
> [ERROR] <https://hudson.apache.org/hudson/job/Tuscany-2x/org.apache.tuscany.sca$tuscany-compliance-test-java-caa/ws/src/test/java/org/apache/tuscany/sca/otest/TuscanyRuntimeBridge.java>:[216,12] cannot find symbol
> symbol : class TestException_Exception
> location: class org.apache.tuscany.sca.otest.TuscanyRuntimeBridge
>
> [ERROR] <https://hudson.apache.org/hudson/job/Tuscany-2x/org.apache.tuscany.sca$tuscany-compliance-test-java-caa/ws/src/test/java/org/apache/tuscany/sca/otest/TuscanyRuntimeBridge.java>:[216,42] cannot find symbol
> symbol : class TestException_Exception
> location: class org.apache.tuscany.sca.otest.TuscanyRuntimeBridge
>
> [INFO] 6 errors
> [INFO] -------------------------------------------------------------
> [HUDSON] Archiving <https://hudson.apache.org/hudson/job/Tuscany-2x/org.apache.tuscany.sca$tuscany-compliance-test-java-caa/ws/pom.xml> to /home/hudson/hudson/jobs/Tuscany-2x/modules/org.apache.tuscany.sca$tuscany-compliance-test-java-caa/builds/2010-11-11_02-52-51/archive/org.apache.tuscany.sca/tuscany-compliance-test-java-caa/2.0-SNAPSHOT/pom.xml
> [INFO] ------------------------------------------------------------------------
> [ERROR] BUILD FAILURE
> [INFO] ------------------------------------------------------------------------
> [INFO] Compilation failure
>
> <https://hudson.apache.org/hudson/job/Tuscany-2x/org.apache.tuscany.sca$tuscany-compliance-test-java-caa/ws/src/test/java/org/apache/tuscany/sca/otest/TuscanyRuntimeBridge.java>:[36,17] package testClient does not exist
>
> <https://hudson.apache.org/hudson/job/Tuscany-2x/org.apache.tuscany.sca$tuscany-compliance-test-java-caa/ws/src/test/java/org/apache/tuscany/sca/otest/TuscanyRuntimeBridge.java>:[37,13] package client does not exist
>
> <https://hudson.apache.org/hudson/job/Tuscany-2x/org.apache.tuscany.sca$tuscany-compliance-test-java-caa/ws/src/test/java/org/apache/tuscany/sca/otest/TuscanyRuntimeBridge.java>:[43,45] cannot find symbol
> symbol: class RuntimeBridge
> public class TuscanyRuntimeBridge implements RuntimeBridge {
>
> <https://hudson.apache.org/hudson/job/Tuscany-2x/org.apache.tuscany.sca$tuscany-compliance-test-java-caa/ws/src/test/java/org/apache/tuscany/sca/otest/TuscanyRuntimeBridge.java>:[215,26] cannot find symbol
> symbol : class TestException_Exception
> location: class org.apache.tuscany.sca.otest.TuscanyRuntimeBridge
>
> <https://hudson.apache.org/hudson/job/Tuscany-2x/org.apache.tuscany.sca$tuscany-compliance-test-java-caa/ws/src/test/java/org/apache/tuscany/sca/otest/TuscanyRuntimeBridge.java>:[216,12] cannot find symbol
> symbol : class TestException_Exception
> location: class org.apache.tuscany.sca.otest.TuscanyRuntimeBridge
>
> <https://hudson.apache.org/hudson/job/Tuscany-2x/org.apache.tuscany.sca$tuscany-compliance-test-java-caa/ws/src/test/java/org/apache/tuscany/sca/otest/TuscanyRuntimeBridge.java>:[216,42] cannot find symbol
> symbol : class TestException_Exception
> location: class org.apache.tuscany.sca.otest.TuscanyRuntimeBridge
>
>
> [INFO] ------------------------------------------------------------------------
> [INFO] For more information, run Maven with the -e switch
> [INFO] ------------------------------------------------------------------------
> [INFO] Total time: 53 minutes 17 seconds
> [INFO] Finished at: Thu Nov 11 03:46:18 UTC 2010
> [INFO] Final Memory: 217M/740M
> [INFO] ------------------------------------------------------------------------
>
>
This fail is continually annoying. I'm going to raise a jira and take
the CAA tests out of the build for now so we can at least start to get
nightly builds working more reliably while we try to work out what the
problem is with these errors.
...ant
Build failed in Hudson: Tuscany-2x » Apache Tuscany SCA Specification Compliance Tests Java CAA #933
Posted by Apache Hudson Server <hu...@hudson.apache.org>.
See <https://hudson.apache.org/hudson/job/Tuscany-2x/org.apache.tuscany.sca$tuscany-compliance-test-java-caa/933/>
------------------------------------------
[INFO] ------------------------------------------------------------------------
[INFO] Building Apache Tuscany SCA Specification Compliance Tests Java CAA
[INFO] task-segment: [clean, install]
[INFO] ------------------------------------------------------------------------
[INFO] [clean:clean {execution: default-clean}]
[INFO] snapshot org.apache.tuscany.sca:tuscany-otests-sca-j-caa-tests:2.0-SNAPSHOT: checking for updates from oasis.contributions
[INFO] snapshot org.apache.tuscany.sca:tuscany-otests-sca-j-caa-tests:2.0-SNAPSHOT: checking for updates from apache.snapshots
[INFO] [enforcer:enforce {execution: enforce-plugin-versions}]
[INFO] [remote-resources:process {execution: default}]
[INFO] [resources:resources {execution: default-resources}]
[INFO] Using 'UTF-8' encoding to copy filtered resources.
[INFO] skip non existing resourceDirectory <https://hudson.apache.org/hudson/job/Tuscany-2x/org.apache.tuscany.sca$tuscany-compliance-test-java-caa/ws/src/main/resources>
[INFO] Copying 0 resource
[INFO] Copying 3 resources
[INFO] [compiler:compile {execution: default-compile}]
[INFO] No sources to compile
[INFO] [dependency:unpack {execution: unpack}]
[INFO] Configured Artifact: org.apache.tuscany.sca:oasis-javacaa-contributions:2.0-SNAPSHOT:zip
[INFO] snapshot org.apache.tuscany.sca:oasis-javacaa-contributions:2.0-SNAPSHOT: checking for updates from oasis.contributions
[INFO] snapshot org.apache.tuscany.sca:oasis-javacaa-contributions:2.0-SNAPSHOT: checking for updates from apache.snapshots
Downloading: http://svn.apache.org/repos/asf/tuscany/maven/org/apache/tuscany/sca/oasis-javacaa-contributions/2.0-SNAPSHOT/oasis-javacaa-contributions-2.0-SNAPSHOT.zip
[INFO] Configured Artifact: org.apache.tuscany.sca:tuscany-otests-sca-j-caa-tests:2.0-SNAPSHOT:jar
[INFO] Unpacking /home/hudson/.m2/repository/org/apache/tuscany/sca/oasis-javacaa-contributions/2.0-SNAPSHOT/oasis-javacaa-contributions-2.0-SNAPSHOT.zip to
<https://hudson.apache.org/hudson/job/Tuscany-2x/org.apache.tuscany.sca$tuscany-compliance-test-java-caa/ws/target/oasis-contributions>
with includes null and excludes:null
[INFO] Unpacking /home/hudson/.m2/repository/org/apache/tuscany/sca/tuscany-otests-sca-j-caa-tests/2.0-SNAPSHOT/tuscany-otests-sca-j-caa-tests-2.0-SNAPSHOT.jar to
<https://hudson.apache.org/hudson/job/Tuscany-2x/org.apache.tuscany.sca$tuscany-compliance-test-java-caa/ws/target/test-classes>
with includes null and excludes:commons-logging.properties,oasis-sca-tests.properties,tuscany-oasis-sca-tests-errors.properties
[INFO] [resources:testResources {execution: default-testResources}]
[INFO] Using 'UTF-8' encoding to copy filtered resources.
[INFO] Copying 2 resources
[INFO] Copying 3 resources
[INFO] [compiler:testCompile {execution: default-testCompile}]
[INFO] Compiling 1 source file to <https://hudson.apache.org/hudson/job/Tuscany-2x/org.apache.tuscany.sca$tuscany-compliance-test-java-caa/ws/target/test-classes>
[INFO] -------------------------------------------------------------
[ERROR] COMPILATION ERROR :
[INFO] -------------------------------------------------------------
[ERROR] <https://hudson.apache.org/hudson/job/Tuscany-2x/org.apache.tuscany.sca$tuscany-compliance-test-java-caa/ws/src/test/java/org/apache/tuscany/sca/otest/TuscanyRuntimeBridge.java>:[36,17] package testClient does not exist
[ERROR] <https://hudson.apache.org/hudson/job/Tuscany-2x/org.apache.tuscany.sca$tuscany-compliance-test-java-caa/ws/src/test/java/org/apache/tuscany/sca/otest/TuscanyRuntimeBridge.java>:[37,13] package client does not exist
[ERROR] <https://hudson.apache.org/hudson/job/Tuscany-2x/org.apache.tuscany.sca$tuscany-compliance-test-java-caa/ws/src/test/java/org/apache/tuscany/sca/otest/TuscanyRuntimeBridge.java>:[43,45] cannot find symbol
symbol: class RuntimeBridge
public class TuscanyRuntimeBridge implements RuntimeBridge {
[ERROR] <https://hudson.apache.org/hudson/job/Tuscany-2x/org.apache.tuscany.sca$tuscany-compliance-test-java-caa/ws/src/test/java/org/apache/tuscany/sca/otest/TuscanyRuntimeBridge.java>:[215,26] cannot find symbol
symbol : class TestException_Exception
location: class org.apache.tuscany.sca.otest.TuscanyRuntimeBridge
[ERROR] <https://hudson.apache.org/hudson/job/Tuscany-2x/org.apache.tuscany.sca$tuscany-compliance-test-java-caa/ws/src/test/java/org/apache/tuscany/sca/otest/TuscanyRuntimeBridge.java>:[216,12] cannot find symbol
symbol : class TestException_Exception
location: class org.apache.tuscany.sca.otest.TuscanyRuntimeBridge
[ERROR] <https://hudson.apache.org/hudson/job/Tuscany-2x/org.apache.tuscany.sca$tuscany-compliance-test-java-caa/ws/src/test/java/org/apache/tuscany/sca/otest/TuscanyRuntimeBridge.java>:[216,42] cannot find symbol
symbol : class TestException_Exception
location: class org.apache.tuscany.sca.otest.TuscanyRuntimeBridge
[INFO] 6 errors
[INFO] -------------------------------------------------------------
[HUDSON] Archiving <https://hudson.apache.org/hudson/job/Tuscany-2x/org.apache.tuscany.sca$tuscany-compliance-test-java-caa/ws/pom.xml> to /home/hudson/hudson/jobs/Tuscany-2x/modules/org.apache.tuscany.sca$tuscany-compliance-test-java-caa/builds/2010-11-11_02-52-51/archive/org.apache.tuscany.sca/tuscany-compliance-test-java-caa/2.0-SNAPSHOT/pom.xml
[INFO] ------------------------------------------------------------------------
[ERROR] BUILD FAILURE
[INFO] ------------------------------------------------------------------------
[INFO] Compilation failure
<https://hudson.apache.org/hudson/job/Tuscany-2x/org.apache.tuscany.sca$tuscany-compliance-test-java-caa/ws/src/test/java/org/apache/tuscany/sca/otest/TuscanyRuntimeBridge.java>:[36,17] package testClient does not exist
<https://hudson.apache.org/hudson/job/Tuscany-2x/org.apache.tuscany.sca$tuscany-compliance-test-java-caa/ws/src/test/java/org/apache/tuscany/sca/otest/TuscanyRuntimeBridge.java>:[37,13] package client does not exist
<https://hudson.apache.org/hudson/job/Tuscany-2x/org.apache.tuscany.sca$tuscany-compliance-test-java-caa/ws/src/test/java/org/apache/tuscany/sca/otest/TuscanyRuntimeBridge.java>:[43,45] cannot find symbol
symbol: class RuntimeBridge
public class TuscanyRuntimeBridge implements RuntimeBridge {
<https://hudson.apache.org/hudson/job/Tuscany-2x/org.apache.tuscany.sca$tuscany-compliance-test-java-caa/ws/src/test/java/org/apache/tuscany/sca/otest/TuscanyRuntimeBridge.java>:[215,26] cannot find symbol
symbol : class TestException_Exception
location: class org.apache.tuscany.sca.otest.TuscanyRuntimeBridge
<https://hudson.apache.org/hudson/job/Tuscany-2x/org.apache.tuscany.sca$tuscany-compliance-test-java-caa/ws/src/test/java/org/apache/tuscany/sca/otest/TuscanyRuntimeBridge.java>:[216,12] cannot find symbol
symbol : class TestException_Exception
location: class org.apache.tuscany.sca.otest.TuscanyRuntimeBridge
<https://hudson.apache.org/hudson/job/Tuscany-2x/org.apache.tuscany.sca$tuscany-compliance-test-java-caa/ws/src/test/java/org/apache/tuscany/sca/otest/TuscanyRuntimeBridge.java>:[216,42] cannot find symbol
symbol : class TestException_Exception
location: class org.apache.tuscany.sca.otest.TuscanyRuntimeBridge
[INFO] ------------------------------------------------------------------------
[INFO] For more information, run Maven with the -e switch
[INFO] ------------------------------------------------------------------------
[INFO] Total time: 53 minutes 17 seconds
[INFO] Finished at: Thu Nov 11 03:46:18 UTC 2010
[INFO] Final Memory: 217M/740M
[INFO] ------------------------------------------------------------------------
Build failed in Hudson: Tuscany-2x » Apache Tuscany SCA Specification Compliance Tests Java CAA #932
Posted by Apache Hudson Server <hu...@hudson.apache.org>.
See <https://hudson.apache.org/hudson/job/Tuscany-2x/org.apache.tuscany.sca$tuscany-compliance-test-java-caa/932/>
------------------------------------------
[INFO] ------------------------------------------------------------------------
[INFO] Building Apache Tuscany SCA Specification Compliance Tests Java CAA
[INFO] task-segment: [clean, install]
[INFO] ------------------------------------------------------------------------
[INFO] [clean:clean {execution: default-clean}]
[INFO] snapshot org.apache.tuscany.sca:tuscany-otests-sca-j-caa-tests:2.0-SNAPSHOT: checking for updates from oasis.contributions
[INFO] snapshot org.apache.tuscany.sca:tuscany-otests-sca-j-caa-tests:2.0-SNAPSHOT: checking for updates from apache.snapshots
[INFO] [enforcer:enforce {execution: enforce-plugin-versions}]
[INFO] [remote-resources:process {execution: default}]
[INFO] [resources:resources {execution: default-resources}]
[INFO] Using 'UTF-8' encoding to copy filtered resources.
[INFO] skip non existing resourceDirectory <https://hudson.apache.org/hudson/job/Tuscany-2x/org.apache.tuscany.sca$tuscany-compliance-test-java-caa/ws/src/main/resources>
[INFO] Copying 0 resource
[INFO] Copying 3 resources
[INFO] [compiler:compile {execution: default-compile}]
[INFO] No sources to compile
[INFO] [dependency:unpack {execution: unpack}]
[INFO] Configured Artifact: org.apache.tuscany.sca:oasis-javacaa-contributions:2.0-SNAPSHOT:zip
[INFO] snapshot org.apache.tuscany.sca:oasis-javacaa-contributions:2.0-SNAPSHOT: checking for updates from oasis.contributions
[INFO] snapshot org.apache.tuscany.sca:oasis-javacaa-contributions:2.0-SNAPSHOT: checking for updates from apache.snapshots
Downloading: http://svn.apache.org/repos/asf/tuscany/maven/org/apache/tuscany/sca/oasis-javacaa-contributions/2.0-SNAPSHOT/oasis-javacaa-contributions-2.0-SNAPSHOT.zip
[INFO] Configured Artifact: org.apache.tuscany.sca:tuscany-otests-sca-j-caa-tests:2.0-SNAPSHOT:jar
[INFO] Unpacking /home/hudson/.m2/repository/org/apache/tuscany/sca/oasis-javacaa-contributions/2.0-SNAPSHOT/oasis-javacaa-contributions-2.0-SNAPSHOT.zip to
<https://hudson.apache.org/hudson/job/Tuscany-2x/org.apache.tuscany.sca$tuscany-compliance-test-java-caa/ws/target/oasis-contributions>
with includes null and excludes:null
[INFO] Unpacking /home/hudson/.m2/repository/org/apache/tuscany/sca/tuscany-otests-sca-j-caa-tests/2.0-SNAPSHOT/tuscany-otests-sca-j-caa-tests-2.0-SNAPSHOT.jar to
<https://hudson.apache.org/hudson/job/Tuscany-2x/org.apache.tuscany.sca$tuscany-compliance-test-java-caa/ws/target/test-classes>
with includes null and excludes:commons-logging.properties,oasis-sca-tests.properties,tuscany-oasis-sca-tests-errors.properties
[INFO] [resources:testResources {execution: default-testResources}]
[INFO] Using 'UTF-8' encoding to copy filtered resources.
[INFO] Copying 2 resources
[INFO] Copying 3 resources
[INFO] [compiler:testCompile {execution: default-testCompile}]
[INFO] Compiling 1 source file to <https://hudson.apache.org/hudson/job/Tuscany-2x/org.apache.tuscany.sca$tuscany-compliance-test-java-caa/ws/target/test-classes>
[INFO] -------------------------------------------------------------
[ERROR] COMPILATION ERROR :
[INFO] -------------------------------------------------------------
[ERROR] <https://hudson.apache.org/hudson/job/Tuscany-2x/org.apache.tuscany.sca$tuscany-compliance-test-java-caa/ws/src/test/java/org/apache/tuscany/sca/otest/TuscanyRuntimeBridge.java>:[36,17] package testClient does not exist
[ERROR] <https://hudson.apache.org/hudson/job/Tuscany-2x/org.apache.tuscany.sca$tuscany-compliance-test-java-caa/ws/src/test/java/org/apache/tuscany/sca/otest/TuscanyRuntimeBridge.java>:[37,13] package client does not exist
[ERROR] <https://hudson.apache.org/hudson/job/Tuscany-2x/org.apache.tuscany.sca$tuscany-compliance-test-java-caa/ws/src/test/java/org/apache/tuscany/sca/otest/TuscanyRuntimeBridge.java>:[43,45] cannot find symbol
symbol: class RuntimeBridge
public class TuscanyRuntimeBridge implements RuntimeBridge {
[ERROR] <https://hudson.apache.org/hudson/job/Tuscany-2x/org.apache.tuscany.sca$tuscany-compliance-test-java-caa/ws/src/test/java/org/apache/tuscany/sca/otest/TuscanyRuntimeBridge.java>:[215,26] cannot find symbol
symbol : class TestException_Exception
location: class org.apache.tuscany.sca.otest.TuscanyRuntimeBridge
[ERROR] <https://hudson.apache.org/hudson/job/Tuscany-2x/org.apache.tuscany.sca$tuscany-compliance-test-java-caa/ws/src/test/java/org/apache/tuscany/sca/otest/TuscanyRuntimeBridge.java>:[216,12] cannot find symbol
symbol : class TestException_Exception
location: class org.apache.tuscany.sca.otest.TuscanyRuntimeBridge
[ERROR] <https://hudson.apache.org/hudson/job/Tuscany-2x/org.apache.tuscany.sca$tuscany-compliance-test-java-caa/ws/src/test/java/org/apache/tuscany/sca/otest/TuscanyRuntimeBridge.java>:[216,42] cannot find symbol
symbol : class TestException_Exception
location: class org.apache.tuscany.sca.otest.TuscanyRuntimeBridge
[INFO] 6 errors
[INFO] -------------------------------------------------------------
[HUDSON] Archiving <https://hudson.apache.org/hudson/job/Tuscany-2x/org.apache.tuscany.sca$tuscany-compliance-test-java-caa/ws/pom.xml> to /home/hudson/hudson/jobs/Tuscany-2x/modules/org.apache.tuscany.sca$tuscany-compliance-test-java-caa/builds/2010-11-10_16-06-35/archive/org.apache.tuscany.sca/tuscany-compliance-test-java-caa/2.0-SNAPSHOT/pom.xml
[INFO] ------------------------------------------------------------------------
[ERROR] BUILD FAILURE
[INFO] ------------------------------------------------------------------------
[INFO] Compilation failure
<https://hudson.apache.org/hudson/job/Tuscany-2x/org.apache.tuscany.sca$tuscany-compliance-test-java-caa/ws/src/test/java/org/apache/tuscany/sca/otest/TuscanyRuntimeBridge.java>:[36,17] package testClient does not exist
<https://hudson.apache.org/hudson/job/Tuscany-2x/org.apache.tuscany.sca$tuscany-compliance-test-java-caa/ws/src/test/java/org/apache/tuscany/sca/otest/TuscanyRuntimeBridge.java>:[37,13] package client does not exist
<https://hudson.apache.org/hudson/job/Tuscany-2x/org.apache.tuscany.sca$tuscany-compliance-test-java-caa/ws/src/test/java/org/apache/tuscany/sca/otest/TuscanyRuntimeBridge.java>:[43,45] cannot find symbol
symbol: class RuntimeBridge
public class TuscanyRuntimeBridge implements RuntimeBridge {
<https://hudson.apache.org/hudson/job/Tuscany-2x/org.apache.tuscany.sca$tuscany-compliance-test-java-caa/ws/src/test/java/org/apache/tuscany/sca/otest/TuscanyRuntimeBridge.java>:[215,26] cannot find symbol
symbol : class TestException_Exception
location: class org.apache.tuscany.sca.otest.TuscanyRuntimeBridge
<https://hudson.apache.org/hudson/job/Tuscany-2x/org.apache.tuscany.sca$tuscany-compliance-test-java-caa/ws/src/test/java/org/apache/tuscany/sca/otest/TuscanyRuntimeBridge.java>:[216,12] cannot find symbol
symbol : class TestException_Exception
location: class org.apache.tuscany.sca.otest.TuscanyRuntimeBridge
<https://hudson.apache.org/hudson/job/Tuscany-2x/org.apache.tuscany.sca$tuscany-compliance-test-java-caa/ws/src/test/java/org/apache/tuscany/sca/otest/TuscanyRuntimeBridge.java>:[216,42] cannot find symbol
symbol : class TestException_Exception
location: class org.apache.tuscany.sca.otest.TuscanyRuntimeBridge
[INFO] ------------------------------------------------------------------------
[INFO] For more information, run Maven with the -e switch
[INFO] ------------------------------------------------------------------------
[INFO] Total time: 52 minutes 6 seconds
[INFO] Finished at: Wed Nov 10 16:58:51 UTC 2010
[INFO] Final Memory: 216M/738M
[INFO] ------------------------------------------------------------------------
Waiting for Hudson to finish collecting data