You are viewing a plain text version of this content. The canonical link for it is here.
Posted to notifications@ant.apache.org by Apache Jenkins Server <je...@builds.apache.org> on 2014/03/10 04:13:06 UTC

Build failed in Jenkins: Ivy-tests » JDK 1.5 (latest),Ubuntu #90

See <https://builds.apache.org/job/Ivy-tests/jdk=JDK%201.5%20(latest),label=Ubuntu/90/>

------------------------------------------
Started by upstream project "Ivy-tests" build number 90
originally caused by:
 Started by upstream project "Ivy" build number 467
 originally caused by:
  Started by an SCM change
Building remotely on ubuntu2 in workspace <https://builds.apache.org/job/Ivy-tests/jdk=JDK%201.5%20(latest),label=Ubuntu/ws/>
java.io.IOException: Failed to mkdirs: <https://builds.apache.org/job/Ivy-tests/jdk=JDK%201.5%20(latest),label=Ubuntu/ws/>
	at hudson.FilePath.mkdirs(FilePath.java:1069)
	at hudson.model.AbstractProject.checkout(AbstractProject.java:1404)
	at hudson.model.AbstractBuild$AbstractBuildExecution.defaultCheckout(AbstractBuild.java:651)
	at jenkins.scm.SCMCheckoutStrategy.checkout(SCMCheckoutStrategy.java:88)
	at hudson.model.AbstractBuild$AbstractBuildExecution.run(AbstractBuild.java:560)
	at hudson.model.Run.execute(Run.java:1670)
	at hudson.matrix.MatrixRun.run(MatrixRun.java:146)
	at hudson.model.ResourceController.execute(ResourceController.java:88)
	at hudson.model.Executor.run(Executor.java:231)
Retrying after 10 seconds
java.io.IOException: Failed to mkdirs: <https://builds.apache.org/job/Ivy-tests/jdk=JDK%201.5%20(latest),label=Ubuntu/ws/>
	at hudson.FilePath.mkdirs(FilePath.java:1069)
	at hudson.model.AbstractProject.checkout(AbstractProject.java:1404)
	at hudson.model.AbstractBuild$AbstractBuildExecution.defaultCheckout(AbstractBuild.java:651)
	at jenkins.scm.SCMCheckoutStrategy.checkout(SCMCheckoutStrategy.java:88)
	at hudson.model.AbstractBuild$AbstractBuildExecution.run(AbstractBuild.java:560)
	at hudson.model.Run.execute(Run.java:1670)
	at hudson.matrix.MatrixRun.run(MatrixRun.java:146)
	at hudson.model.ResourceController.execute(ResourceController.java:88)
	at hudson.model.Executor.run(Executor.java:231)
Retrying after 10 seconds
java.io.IOException: Failed to mkdirs: <https://builds.apache.org/job/Ivy-tests/jdk=JDK%201.5%20(latest),label=Ubuntu/ws/>
	at hudson.FilePath.mkdirs(FilePath.java:1069)
	at hudson.model.AbstractProject.checkout(AbstractProject.java:1404)
	at hudson.model.AbstractBuild$AbstractBuildExecution.defaultCheckout(AbstractBuild.java:651)
	at jenkins.scm.SCMCheckoutStrategy.checkout(SCMCheckoutStrategy.java:88)
	at hudson.model.AbstractBuild$AbstractBuildExecution.run(AbstractBuild.java:560)
	at hudson.model.Run.execute(Run.java:1670)
	at hudson.matrix.MatrixRun.run(MatrixRun.java:146)
	at hudson.model.ResourceController.execute(ResourceController.java:88)
	at hudson.model.Executor.run(Executor.java:231)
Recording test results
ERROR: Publisher hudson.tasks.junit.JUnitResultArchiver aborted due to exception
<https://builds.apache.org/job/Ivy-tests/jdk=JDK%201.5%20(latest),label=Ubuntu/ws/> does not exist.
	at org.apache.tools.ant.types.AbstractFileSet.getDirectoryScanner(AbstractFileSet.java:483)
	at org.apache.tools.ant.types.AbstractFileSet.getDirectoryScanner(AbstractFileSet.java:460)
	at hudson.tasks.junit.JUnitParser$ParseResultCallable.invoke(JUnitParser.java:108)
	at hudson.tasks.junit.JUnitParser$ParseResultCallable.invoke(JUnitParser.java:90)
	at hudson.FilePath$FileCallableWrapper.call(FilePath.java:2461)
	at hudson.remoting.UserRequest.perform(UserRequest.java:118)
	at hudson.remoting.UserRequest.perform(UserRequest.java:48)
	at hudson.remoting.Request$2.run(Request.java:328)
	at hudson.remoting.InterceptingExecutorService$1.call(InterceptingExecutorService.java:72)
	at java.util.concurrent.FutureTask.run(FutureTask.java:262)
	at java.util.concurrent.ThreadPoolExecutor.runWorker(ThreadPoolExecutor.java:1145)
	at java.util.concurrent.ThreadPoolExecutor$Worker.run(ThreadPoolExecutor.java:615)
	at java.lang.Thread.run(Thread.java:744)

Jenkins build is back to normal : Ivy-tests » JDK 1.5 (latest),Ubuntu #91

Posted by Apache Jenkins Server <je...@builds.apache.org>.
See <https://builds.apache.org/job/Ivy-tests/jdk=JDK%201.5%20(latest),label=Ubuntu/91/changes>