You are viewing a plain text version of this content. The canonical link for it is here.
Posted to builds@solr.apache.org by Apache Jenkins Server <je...@builds.apache.org> on 2025/12/05 18:16:27 UTC

[JENKINS] Solr » Solr-Test-9.x - Build # 9767 - Still Failing!

Build: https://ci-builds.apache.org/job/Solr/job/Solr-Test-9.x/9767/

No tests ran.

Build Log:
[...truncated 184 lines...]
BUILD FAILED in 1m 27s
60 actionable tasks: 60 executed

Publishing build scan...
https://develocity.apache.org/s/l6lvtj656case

Build step 'Invoke Gradle script' changed build result to FAILURE
Build step 'Invoke Gradle script' marked build as failure
Archiving artifacts
Recording test results
ERROR: Step ‘Publish JUnit test result report’ failed: No test report files were found. Configuration error?
Email was triggered for: Failure - Any
Sending email for trigger: Failure - Any

[JENKINS] Solr » Solr-Test-9.x - Build # 9769 - Still Failing!

Posted by Apache Jenkins Server <je...@builds.apache.org>.
Build: https://ci-builds.apache.org/job/Solr/job/Solr-Test-9.x/9769/

No tests ran.

Build Log:
[...truncated 184 lines...]
BUILD FAILED in 1m 29s
60 actionable tasks: 60 executed

Publishing build scan...
https://develocity.apache.org/s/ktegvydfykviy

Build step 'Invoke Gradle script' changed build result to FAILURE
Build step 'Invoke Gradle script' marked build as failure
Archiving artifacts
Recording test results
ERROR: Step ‘Publish JUnit test result report’ failed: No test report files were found. Configuration error?
Email was triggered for: Failure - Any
Sending email for trigger: Failure - Any

[JENKINS] Solr » Solr-Test-9.x - Build # 9768 - Still Failing!

Posted by Apache Jenkins Server <je...@builds.apache.org>.
Build: https://ci-builds.apache.org/job/Solr/job/Solr-Test-9.x/9768/

No tests ran.

Build Log:
[...truncated 184 lines...]
BUILD FAILED in 1m 29s
60 actionable tasks: 60 executed

Publishing build scan...
https://develocity.apache.org/s/iyrmr2si7e4ai

Build step 'Invoke Gradle script' changed build result to FAILURE
Build step 'Invoke Gradle script' marked build as failure
Archiving artifacts
Recording test results
ERROR: Step ‘Publish JUnit test result report’ failed: No test report files were found. Configuration error?
Email was triggered for: Failure - Any
Sending email for trigger: Failure - Any