You are viewing a plain text version of this content. The canonical link for it is here.
Posted to dev@lucene.apache.org by Policeman Jenkins Server <je...@thetaphi.de> on 2017/04/24 14:34:01 UTC
[JENKINS-EA] Lucene-Solr-master-Linux (64bit/jdk-9-ea+164) - Build
# 19473 - Still Unstable!
Build: https://jenkins.thetaphi.de/job/Lucene-Solr-master-Linux/19473/
Java: 64bit/jdk-9-ea+164 -XX:-UseCompressedOops -XX:+UseParallelGC
1 tests failed.
FAILED: org.apache.solr.handler.admin.StatsReloadRaceTest.testParallelReloadAndStats
Error Message:
Key SEARCHER.searcher.indexVersion not found in registry solr.core.collection1
Stack Trace:
java.lang.AssertionError: Key SEARCHER.searcher.indexVersion not found in registry solr.core.collection1
at __randomizedtesting.SeedInfo.seed([5E9B7AB8DA0C6961:91051F8155FD013E]:0)
at org.junit.Assert.fail(Assert.java:93)
at org.junit.Assert.assertTrue(Assert.java:43)
at org.apache.solr.handler.admin.StatsReloadRaceTest.requestMetrics(StatsReloadRaceTest.java:132)
at org.apache.solr.handler.admin.StatsReloadRaceTest.testParallelReloadAndStats(StatsReloadRaceTest.java:70)
at java.base/jdk.internal.reflect.NativeMethodAccessorImpl.invoke0(Native Method)
at java.base/jdk.internal.reflect.NativeMethodAccessorImpl.invoke(NativeMethodAccessorImpl.java:62)
at java.base/jdk.internal.reflect.DelegatingMethodAccessorImpl.invoke(DelegatingMethodAccessorImpl.java:43)
at java.base/java.lang.reflect.Method.invoke(Method.java:563)
at com.carrotsearch.randomizedtesting.RandomizedRunner.invoke(RandomizedRunner.java:1713)
at com.carrotsearch.randomizedtesting.RandomizedRunner$8.evaluate(RandomizedRunner.java:907)
at com.carrotsearch.randomizedtesting.RandomizedRunner$9.evaluate(RandomizedRunner.java:943)
at com.carrotsearch.randomizedtesting.RandomizedRunner$10.evaluate(RandomizedRunner.java:957)
at com.carrotsearch.randomizedtesting.rules.SystemPropertiesRestoreRule$1.evaluate(SystemPropertiesRestoreRule.java:57)
at org.apache.lucene.util.TestRuleSetupTeardownChained$1.evaluate(TestRuleSetupTeardownChained.java:49)
at org.apache.lucene.util.AbstractBeforeAfterRule$1.evaluate(AbstractBeforeAfterRule.java:45)
at org.apache.lucene.util.TestRuleThreadAndTestName$1.evaluate(TestRuleThreadAndTestName.java:48)
at org.apache.lucene.util.TestRuleIgnoreAfterMaxFailures$1.evaluate(TestRuleIgnoreAfterMaxFailures.java:64)
at org.apache.lucene.util.TestRuleMarkFailure$1.evaluate(TestRuleMarkFailure.java:47)
at com.carrotsearch.randomizedtesting.rules.StatementAdapter.evaluate(StatementAdapter.java:36)
at com.carrotsearch.randomizedtesting.ThreadLeakControl$StatementRunner.run(ThreadLeakControl.java:368)
at com.carrotsearch.randomizedtesting.ThreadLeakControl.forkTimeoutingTask(ThreadLeakControl.java:817)
at com.carrotsearch.randomizedtesting.ThreadLeakControl$3.evaluate(ThreadLeakControl.java:468)
at com.carrotsearch.randomizedtesting.RandomizedRunner.runSingleTest(RandomizedRunner.java:916)
at com.carrotsearch.randomizedtesting.RandomizedRunner$5.evaluate(RandomizedRunner.java:802)
at com.carrotsearch.randomizedtesting.RandomizedRunner$6.evaluate(RandomizedRunner.java:852)
at com.carrotsearch.randomizedtesting.RandomizedRunner$7.evaluate(RandomizedRunner.java:863)
at com.carrotsearch.randomizedtesting.rules.StatementAdapter.evaluate(StatementAdapter.java:36)
at com.carrotsearch.randomizedtesting.rules.SystemPropertiesRestoreRule$1.evaluate(SystemPropertiesRestoreRule.java:57)
at org.apache.lucene.util.AbstractBeforeAfterRule$1.evaluate(AbstractBeforeAfterRule.java:45)
at com.carrotsearch.randomizedtesting.rules.StatementAdapter.evaluate(StatementAdapter.java:36)
at org.apache.lucene.util.TestRuleStoreClassName$1.evaluate(TestRuleStoreClassName.java:41)
at com.carrotsearch.randomizedtesting.rules.NoShadowingOrOverridesOnMethodsRule$1.evaluate(NoShadowingOrOverridesOnMethodsRule.java:40)
at com.carrotsearch.randomizedtesting.rules.NoShadowingOrOverridesOnMethodsRule$1.evaluate(NoShadowingOrOverridesOnMethodsRule.java:40)
at com.carrotsearch.randomizedtesting.rules.StatementAdapter.evaluate(StatementAdapter.java:36)
at com.carrotsearch.randomizedtesting.rules.StatementAdapter.evaluate(StatementAdapter.java:36)
at org.apache.lucene.util.TestRuleAssertionsRequired$1.evaluate(TestRuleAssertionsRequired.java:53)
at org.apache.lucene.util.TestRuleMarkFailure$1.evaluate(TestRuleMarkFailure.java:47)
at org.apache.lucene.util.TestRuleIgnoreAfterMaxFailures$1.evaluate(TestRuleIgnoreAfterMaxFailures.java:64)
at org.apache.lucene.util.TestRuleIgnoreTestSuites$1.evaluate(TestRuleIgnoreTestSuites.java:54)
at com.carrotsearch.randomizedtesting.rules.StatementAdapter.evaluate(StatementAdapter.java:36)
at com.carrotsearch.randomizedtesting.ThreadLeakControl$StatementRunner.run(ThreadLeakControl.java:368)
at java.base/java.lang.Thread.run(Thread.java:844)
Build Log:
[...truncated 12695 lines...]
[junit4] Suite: org.apache.solr.handler.admin.StatsReloadRaceTest
[junit4] 2> Creating dataDir: /home/jenkins/workspace/Lucene-Solr-master-Linux/solr/build/solr-core/test/J0/temp/solr.handler.admin.StatsReloadRaceTest_5E9B7AB8DA0C6961-001/init-core-data-001
[junit4] 2> 1681524 WARN (SUITE-StatsReloadRaceTest-seed#[5E9B7AB8DA0C6961]-worker) [ ] o.a.s.SolrTestCaseJ4 startTrackingSearchers: numOpens=1 numCloses=1
[junit4] 2> 1681524 INFO (SUITE-StatsReloadRaceTest-seed#[5E9B7AB8DA0C6961]-worker) [ ] o.a.s.SolrTestCaseJ4 Using TrieFields
[junit4] 2> 1681526 INFO (SUITE-StatsReloadRaceTest-seed#[5E9B7AB8DA0C6961]-worker) [ ] o.a.s.SolrTestCaseJ4 Randomized ssl (false) and clientAuth (false) via: @org.apache.solr.util.RandomizeSSL(reason="", ssl=0.0/0.0, value=0.0/0.0, clientAuth=0.0/0.0)
[junit4] 2> 1681526 INFO (SUITE-StatsReloadRaceTest-seed#[5E9B7AB8DA0C6961]-worker) [ ] o.a.s.SolrTestCaseJ4 ####initCore
[junit4] 2> 1681527 INFO (SUITE-StatsReloadRaceTest-seed#[5E9B7AB8DA0C6961]-worker) [ ] o.a.s.c.SolrResourceLoader [null] Added 2 libs to classloader, from paths: [/home/jenkins/workspace/Lucene-Solr-master-Linux/solr/core/src/test-files/solr/collection1/lib, /home/jenkins/workspace/Lucene-Solr-master-Linux/solr/core/src/test-files/solr/collection1/lib/classes]
[junit4] 2> 1681587 WARN (SUITE-StatsReloadRaceTest-seed#[5E9B7AB8DA0C6961]-worker) [ ] o.a.s.c.Config Beginning with Solr 5.5, <mergePolicy> is deprecated, use <mergePolicyFactory> instead.
[junit4] 2> 1681588 INFO (SUITE-StatsReloadRaceTest-seed#[5E9B7AB8DA0C6961]-worker) [ ] o.a.s.c.SolrConfig Using Lucene MatchVersion: 7.0.0
[junit4] 2> 1681609 INFO (SUITE-StatsReloadRaceTest-seed#[5E9B7AB8DA0C6961]-worker) [ ] o.a.s.s.IndexSchema [null] Schema name=test
[junit4] 2> 1681703 WARN (SUITE-StatsReloadRaceTest-seed#[5E9B7AB8DA0C6961]-worker) [ ] o.a.s.s.IndexSchema [null] default search field in schema is text. WARNING: Deprecated, please use 'df' on request instead.
[junit4] 2> 1681705 INFO (SUITE-StatsReloadRaceTest-seed#[5E9B7AB8DA0C6961]-worker) [ ] o.a.s.s.IndexSchema Loaded schema test/1.0 with uniqueid field id
[junit4] 2> 1681795 INFO (SUITE-StatsReloadRaceTest-seed#[5E9B7AB8DA0C6961]-worker) [ ] o.a.s.m.r.SolrJmxReporter JMX monitoring for 'solr.node' (registry 'solr.node') enabled at server: com.sun.jmx.mbeanserver.JmxMBeanServer@6e1f5d06
[junit4] 2> 1681799 INFO (SUITE-StatsReloadRaceTest-seed#[5E9B7AB8DA0C6961]-worker) [ ] o.a.s.m.r.SolrJmxReporter JMX monitoring for 'solr.jvm' (registry 'solr.jvm') enabled at server: com.sun.jmx.mbeanserver.JmxMBeanServer@6e1f5d06
[junit4] 2> 1681799 INFO (SUITE-StatsReloadRaceTest-seed#[5E9B7AB8DA0C6961]-worker) [ ] o.a.s.m.r.SolrJmxReporter JMX monitoring for 'solr.jetty' (registry 'solr.jetty') enabled at server: com.sun.jmx.mbeanserver.JmxMBeanServer@6e1f5d06
[junit4] 2> 1681801 INFO (coreLoadExecutor-8118-thread-1) [ ] o.a.s.c.SolrResourceLoader [null] Added 2 libs to classloader, from paths: [/home/jenkins/workspace/Lucene-Solr-master-Linux/solr/core/src/test-files/solr/collection1/lib, /home/jenkins/workspace/Lucene-Solr-master-Linux/solr/core/src/test-files/solr/collection1/lib/classes]
[junit4] 2> 1681867 WARN (coreLoadExecutor-8118-thread-1) [ ] o.a.s.c.Config Beginning with Solr 5.5, <mergePolicy> is deprecated, use <mergePolicyFactory> instead.
[junit4] 2> 1681868 INFO (coreLoadExecutor-8118-thread-1) [ ] o.a.s.c.SolrConfig Using Lucene MatchVersion: 7.0.0
[junit4] 2> 1681887 INFO (coreLoadExecutor-8118-thread-1) [ ] o.a.s.s.IndexSchema [collection1] Schema name=test
[junit4] 2> 1681973 WARN (coreLoadExecutor-8118-thread-1) [ ] o.a.s.s.IndexSchema [collection1] default search field in schema is text. WARNING: Deprecated, please use 'df' on request instead.
[junit4] 2> 1681975 INFO (coreLoadExecutor-8118-thread-1) [ ] o.a.s.s.IndexSchema Loaded schema test/1.0 with uniqueid field id
[junit4] 2> 1681992 INFO (coreLoadExecutor-8118-thread-1) [ ] o.a.s.c.CoreContainer Creating SolrCore 'collection1' using configuration from instancedir /home/jenkins/workspace/Lucene-Solr-master-Linux/solr/core/src/test-files/solr/collection1, trusted=true
[junit4] 2> 1681992 INFO (coreLoadExecutor-8118-thread-1) [ ] o.a.s.m.r.SolrJmxReporter JMX monitoring for 'solr.core.collection1' (registry 'solr.core.collection1') enabled at server: com.sun.jmx.mbeanserver.JmxMBeanServer@6e1f5d06
[junit4] 2> 1681992 INFO (coreLoadExecutor-8118-thread-1) [ ] o.a.s.c.SolrCore solr.RecoveryStrategy.Builder
[junit4] 2> 1681992 INFO (coreLoadExecutor-8118-thread-1) [ ] o.a.s.c.SolrCore [[collection1] ] Opening new SolrCore at [/home/jenkins/workspace/Lucene-Solr-master-Linux/solr/core/src/test-files/solr/collection1], dataDir=[/home/jenkins/workspace/Lucene-Solr-master-Linux/solr/build/solr-core/test/J0/temp/solr.handler.admin.StatsReloadRaceTest_5E9B7AB8DA0C6961-001/init-core-data-001/]
[junit4] 2> 1681993 INFO (coreLoadExecutor-8118-thread-1) [ ] o.a.s.u.RandomMergePolicy RandomMergePolicy wrapping class org.apache.lucene.index.LogDocMergePolicy: [LogDocMergePolicy: minMergeSize=1000, mergeFactor=40, maxMergeSize=9223372036854775807, maxMergeSizeForForcedMerge=9223372036854775807, calibrateSizeByDeletes=true, maxMergeDocs=2147483647, maxCFSSegmentSizeMB=8.796093022207999E12, noCFSRatio=0.22952008433556978]
[junit4] 2> 1682136 INFO (coreLoadExecutor-8118-thread-1) [ ] o.a.s.u.UpdateHandler Using UpdateLog implementation: org.apache.solr.update.UpdateLog
[junit4] 2> 1682136 INFO (coreLoadExecutor-8118-thread-1) [ ] o.a.s.u.UpdateLog Initializing UpdateLog: dataDir= defaultSyncLevel=FLUSH numRecordsToKeep=100 maxNumLogsToKeep=10 numVersionBuckets=65536
[junit4] 2> 1682137 INFO (coreLoadExecutor-8118-thread-1) [ ] o.a.s.u.CommitTracker Hard AutoCommit: disabled
[junit4] 2> 1682137 INFO (coreLoadExecutor-8118-thread-1) [ ] o.a.s.u.CommitTracker Soft AutoCommit: disabled
[junit4] 2> 1682137 INFO (coreLoadExecutor-8118-thread-1) [ ] o.a.s.u.RandomMergePolicy RandomMergePolicy wrapping class org.apache.lucene.index.TieredMergePolicy: [TieredMergePolicy: maxMergeAtOnce=27, maxMergeAtOnceExplicit=23, maxMergedSegmentMB=67.2294921875, floorSegmentMB=1.76953125, forceMergeDeletesPctAllowed=11.988100276175174, segmentsPerTier=12.0, maxCFSSegmentSizeMB=8.796093022207999E12, noCFSRatio=0.3084928379904538
[junit4] 2> 1682137 INFO (coreLoadExecutor-8118-thread-1) [ ] o.a.s.s.SolrIndexSearcher Opening [Searcher@3af155f1[collection1] main]
[junit4] 2> 1682138 INFO (coreLoadExecutor-8118-thread-1) [ ] o.a.s.h.c.SpellCheckComponent Initializing spell checkers
[junit4] 2> 1682175 INFO (coreLoadExecutor-8118-thread-1) [ ] o.a.s.s.DirectSolrSpellChecker init: {name=direct,classname=DirectSolrSpellChecker,field=lowerfilt,minQueryLength=3}
[junit4] 2> 1682388 INFO (coreLoadExecutor-8118-thread-1) [ ] o.a.s.h.ReplicationHandler Commits will be reserved for 10000
[junit4] 2> 1682388 INFO (searcherExecutor-8119-thread-1) [ ] o.a.s.h.c.SpellCheckComponent Loading spell index for spellchecker: default
[junit4] 2> 1682388 INFO (coreLoadExecutor-8118-thread-1) [ ] o.a.s.u.UpdateLog Could not find max version in index or recent updates, using new clock 1565569882319224832
[junit4] 2> 1682389 INFO (searcherExecutor-8119-thread-1) [ ] o.a.s.h.c.SpellCheckComponent Loading spell index for spellchecker: direct
[junit4] 2> 1682389 INFO (searcherExecutor-8119-thread-1) [ ] o.a.s.h.c.SpellCheckComponent Loading spell index for spellchecker: wordbreak
[junit4] 2> 1682389 INFO (searcherExecutor-8119-thread-1) [ ] o.a.s.h.c.SpellCheckComponent Loading spell index for spellchecker: multipleFields
[junit4] 2> 1682389 INFO (searcherExecutor-8119-thread-1) [ ] o.a.s.h.c.SpellCheckComponent Loading spell index for spellchecker: jarowinkler
[junit4] 2> 1682389 INFO (searcherExecutor-8119-thread-1) [ ] o.a.s.h.c.SpellCheckComponent Loading spell index for spellchecker: external
[junit4] 2> 1682389 INFO (searcherExecutor-8119-thread-1) [ ] o.a.s.h.c.SpellCheckComponent Loading spell index for spellchecker: freq
[junit4] 2> 1682389 INFO (searcherExecutor-8119-thread-1) [ ] o.a.s.h.c.SpellCheckComponent Loading spell index for spellchecker: fqcn
[junit4] 2> 1682390 INFO (searcherExecutor-8119-thread-1) [ ] o.a.s.h.c.SpellCheckComponent Loading spell index for spellchecker: perDict
[junit4] 2> 1682391 INFO (searcherExecutor-8119-thread-1) [ ] o.a.s.c.SolrCore [collection1] Registered new searcher Searcher@3af155f1[collection1] main{ExitableDirectoryReader(UninvertingDirectoryReader())}
[junit4] 2> 1682391 INFO (SUITE-StatsReloadRaceTest-seed#[5E9B7AB8DA0C6961]-worker) [ ] o.a.s.SolrTestCaseJ4 ####initCore end
[junit4] 2> 1682393 INFO (SUITE-StatsReloadRaceTest-seed#[5E9B7AB8DA0C6961]-worker) [ ] o.a.s.u.p.LogUpdateProcessorFactory [collection1] webapp=null path=null params={}{add=[0 (1565569882322370560), 1 (1565569882323419136), 2 (1565569882323419137), 3 (1565569882323419138), 4 (1565569882323419139), 5 (1565569882323419140), 6 (1565569882323419141), 7 (1565569882323419142), 8 (1565569882323419143), 9 (1565569882323419144), ... (31 adds)]} 0 1
[junit4] 2> 1682394 INFO (SUITE-StatsReloadRaceTest-seed#[5E9B7AB8DA0C6961]-worker) [ ] o.a.s.u.DirectUpdateHandler2 start commit{,optimize=false,openSearcher=true,waitSearcher=true,expungeDeletes=false,softCommit=false,prepareCommit=false}
[junit4] 2> 1682394 INFO (SUITE-StatsReloadRaceTest-seed#[5E9B7AB8DA0C6961]-worker) [ ] o.a.s.u.SolrIndexWriter Calling setCommitData with IW:org.apache.solr.update.SolrIndexWriter@7fcfa70b commitCommandVersion:0
[junit4] 2> 1682399 INFO (SUITE-StatsReloadRaceTest-seed#[5E9B7AB8DA0C6961]-worker) [ ] o.a.s.s.SolrIndexSearcher Opening [Searcher@2945a6d8[collection1] main]
[junit4] 2> 1682400 INFO (SUITE-StatsReloadRaceTest-seed#[5E9B7AB8DA0C6961]-worker) [ ] o.a.s.u.DirectUpdateHandler2 end_commit_flush
[junit4] 2> 1682401 INFO (searcherExecutor-8119-thread-1) [ ] o.a.s.c.SolrCore [collection1] Registered new searcher Searcher@2945a6d8[collection1] main{ExitableDirectoryReader(UninvertingDirectoryReader(Uninverting(_0(7.0.0):c31)))}
[junit4] 2> 1682401 INFO (SUITE-StatsReloadRaceTest-seed#[5E9B7AB8DA0C6961]-worker) [ ] o.a.s.u.p.LogUpdateProcessorFactory [collection1] webapp=null path=null params={}{commit=} 0 7
[junit4] 2> 1682402 INFO (TEST-StatsReloadRaceTest.testParallelReloadAndStats-seed#[5E9B7AB8DA0C6961]) [ ] o.a.s.SolrTestCaseJ4 ###Starting testParallelReloadAndStats
[junit4] 2> 1682402 INFO (TEST-StatsReloadRaceTest.testParallelReloadAndStats-seed#[5E9B7AB8DA0C6961]) [ ] o.a.s.h.a.CoreAdminOperation Checking request status for : 1
[junit4] 2> 1682403 INFO (TEST-StatsReloadRaceTest.testParallelReloadAndStats-seed#[5E9B7AB8DA0C6961]) [ ] o.a.s.h.a.CoreAdminOperation Checking request status for : 1
[junit4] 2> 1682403 ERROR (parallelCoreAdminExecutor-8117-thread-1) [ ] o.a.s.c.CorePropertiesLocator Couldn't load core descriptor from /home/jenkins/workspace/Lucene-Solr-master-Linux/solr/core/src/test-files/solr/collection1/conf/solrcore.properties:java.nio.file.NoSuchFileException: /home/jenkins/workspace/Lucene-Solr-master-Linux/solr/core/src/test-files/solr/collection1/conf/solrcore.properties
[junit4] 2> 1682403 INFO (TEST-StatsReloadRaceTest.testParallelReloadAndStats-seed#[5E9B7AB8DA0C6961]) [ ] o.a.s.h.a.CoreAdminOperation Checking request status for : 1
[junit4] 2> 1682403 INFO (TEST-StatsReloadRaceTest.testParallelReloadAndStats-seed#[5E9B7AB8DA0C6961]) [ ] o.a.s.h.a.CoreAdminOperation Checking request status for : 1
[junit4] 2> 1682403 INFO (parallelCoreAdminExecutor-8117-thread-1) [ ] o.a.s.c.SolrResourceLoader [null] Added 2 libs to classloader, from paths: [/home/jenkins/workspace/Lucene-Solr-master-Linux/solr/core/src/test-files/solr/collection1/lib, /home/jenkins/workspace/Lucene-Solr-master-Linux/solr/core/src/test-files/solr/collection1/lib/classes]
[junit4] 2> 1682404 INFO (TEST-StatsReloadRaceTest.testParallelReloadAndStats-seed#[5E9B7AB8DA0C6961]) [ ] o.a.s.h.a.CoreAdminOperation Checking request status for : 1
[junit4] 2> 1682404 INFO (TEST-StatsReloadRaceTest.testParallelReloadAndStats-seed#[5E9B7AB8DA0C6961]) [ ] o.a.s.h.a.CoreAdminOperation Checking request status for : 1
[junit4] 2> 1682405 INFO (TEST-StatsReloadRaceTest.testParallelReloadAndStats-seed#[5E9B7AB8DA0C6961]) [ ] o.a.s.h.a.CoreAdminOperation Checking request status for : 1
[junit4] 2> 1682405 INFO (TEST-StatsReloadRaceTest.testParallelReloadAndStats-seed#[5E9B7AB8DA0C6961]) [ ] o.a.s.h.a.CoreAdminOperation Checking request status for : 1
[junit4] 2> 1682405 INFO (TEST-StatsReloadRaceTest.testParallelReloadAndStats-seed#[5E9B7AB8DA0C6961]) [ ] o.a.s.h.a.CoreAdminOperation Checking request status for : 1
[junit4] 2> 1682406 INFO (TEST-StatsReloadRaceTest.testParallelReloadAndStats-seed#[5E9B7AB8DA0C6961]) [ ] o.a.s.h.a.CoreAdminOperation Checking request status for : 1
[junit4] 2> 1682407 INFO (TEST-StatsReloadRaceTest.testParallelReloadAndStats-seed#[5E9B7AB8DA0C6961]) [ ] o.a.s.h.a.CoreAdminOperation Checking request status for : 1
[junit4] 2> 1682407 INFO (TEST-StatsReloadRaceTest.testParallelReloadAndStats-seed#[5E9B7AB8DA0C6961]) [ ] o.a.s.h.a.CoreAdminOperation Checking request status for : 1
[junit4] 2> 1682407 INFO (TEST-StatsReloadRaceTest.testParallelReloadAndStats-seed#[5E9B7AB8DA0C6961]) [ ] o.a.s.h.a.CoreAdminOperation Checking request status for : 1
[junit4] 2> 1682408 INFO (TEST-StatsReloadRaceTest.testParallelReloadAndStats-seed#[5E9B7AB8DA0C6961]) [ ] o.a.s.h.a.CoreAdminOperation Checking request status for : 1
[junit4] 2> 1682408 INFO (TEST-StatsReloadRaceTest.testParallelReloadAndStats-seed#[5E9B7AB8DA0C6961]) [ ] o.a.s.h.a.CoreAdminOperation Checking request status for : 1
[junit4] 2> 1682408 INFO (TEST-StatsReloadRaceTest.testParallelReloadAndStats-seed#[5E9B7AB8DA0C6961]) [ ] o.a.s.h.a.CoreAdminOperation Checking request status for : 1
[junit4] 2> 1682408 INFO (TEST-StatsReloadRaceTest.testParallelReloadAndStats-seed#[5E9B7AB8DA0C6961]) [ ] o.a.s.h.a.CoreAdminOperation Checking request status for : 1
[junit4] 2> 1682409 INFO (TEST-StatsReloadRaceTest.testParallelReloadAndStats-seed#[5E9B7AB8DA0C6961]) [ ] o.a.s.h.a.CoreAdminOperation Checking request status for : 1
[junit4] 2> 1682409 INFO (TEST-StatsReloadRaceTest.testParallelReloadAndStats-seed#[5E9B7AB8DA0C6961]) [ ] o.a.s.h.a.CoreAdminOperation Checking request status for : 1
[junit4] 2> 1682409 INFO (TEST-StatsReloadRaceTest.testParallelReloadAndStats-seed#[5E9B7AB8DA0C6961]) [ ] o.a.s.h.a.CoreAdminOperation Checking request status for : 1
[junit4] 2> 1682410 INFO (TEST-StatsReloadRaceTest.testParallelReloadAndStats-seed#[5E9B7AB8DA0C6961]) [ ] o.a.s.h.a.CoreAdminOperation Checking request status for : 1
[junit4] 2> 1682410 INFO (TEST-StatsReloadRaceTest.testParallelReloadAndStats-seed#[5E9B7AB8DA0C6961]) [ ] o.a.s.h.a.CoreAdminOperation Checking request status for : 1
[junit4] 2> 1682411 INFO (TEST-StatsReloadRaceTest.testParallelReloadAndStats-seed#[5E9B7AB8DA0C6961]) [ ] o.a.s.h.a.CoreAdminOperation Checking request status for : 1
[junit4] 2> 1682411 INFO (TEST-StatsReloadRaceTest.testParallelReloadAndStats-seed#[5E9B7AB8DA0C6961]) [ ] o.a.s.h.a.CoreAdminOperation Checking request status for : 1
[junit4] 2> 1682411 INFO (TEST-StatsReloadRaceTest.testParallelReloadAndStats-seed#[5E9B7AB8DA0C6961]) [ ] o.a.s.h.a.CoreAdminOperation Checking request status for : 1
[junit4] 2> 1682412 INFO (TEST-StatsReloadRaceTest.testParallelReloadAndStats-seed#[5E9B7AB8DA0C6961]) [ ] o.a.s.h.a.CoreAdminOperation Checking request status for : 1
[junit4] 2> 1682412 INFO (TEST-StatsReloadRaceTest.testParallelReloadAndStats-seed#[5E9B7AB8DA0C6961]) [ ] o.a.s.h.a.CoreAdminOperation Checking request status for : 1
[junit4] 2> 1682412 INFO (TEST-StatsReloadRaceTest.testParallelReloadAndStats-seed#[5E9B7AB8DA0C6961]) [ ] o.a.s.h.a.CoreAdminOperation Checking request status for : 1
[junit4] 2> 1682412 INFO (TEST-StatsReloadRaceTest.testParallelReloadAndStats-seed#[5E9B7AB8DA0C6961]) [ ] o.a.s.h.a.CoreAdminOperation Checking request status for : 1
[junit4] 2> 1682413 INFO (TEST-StatsReloadRaceTest.testParallelReloadAndStats-seed#[5E9B7AB8DA0C6961]) [ ] o.a.s.h.a.CoreAdminOperation Checking request status for : 1
[junit4] 2> 1682413 INFO (TEST-StatsReloadRaceTest.testParallelReloadAndStats-seed#[5E9B7AB8DA0C6961]) [ ] o.a.s.h.a.CoreAdminOperation Checking request status for : 1
[junit4] 2> 1682414 INFO (TEST-StatsReloadRaceTest.testParallelReloadAndStats-seed#[5E9B7AB8DA0C6961]) [ ] o.a.s.h.a.CoreAdminOperation Checking request status for : 1
[junit4] 2> 1682414 INFO (TEST-StatsReloadRaceTest.testParallelReloadAndStats-seed#[5E9B7AB8DA0C6961]) [ ] o.a.s.h.a.CoreAdminOperation Checking request status for : 1
[junit4] 2> 1682414 INFO (TEST-StatsReloadRaceTest.testParallelReloadAndStats-seed#[5E9B7AB8DA0C6961]) [ ] o.a.s.h.a.CoreAdminOperation Checking request status for : 1
[junit4] 2> 1682415 INFO (TEST-StatsReloadRaceTest.testParallelReloadAndStats-seed#[5E9B7AB8DA0C6961]) [ ] o.a.s.h.a.CoreAdminOperation Checking request status for : 1
[junit4] 2> 1682415 INFO (TEST-StatsReloadRaceTest.testParallelReloadAndStats-seed#[5E9B7AB8DA0C6961]) [ ] o.a.s.h.a.CoreAdminOperation Checking request status for : 1
[junit4] 2> 1682416 INFO (TEST-StatsReloadRaceTest.testParallelReloadAndStats-seed#[5E9B7AB8DA0C6961]) [ ] o.a.s.h.a.CoreAdminOperation Checking request status for : 1
[junit4] 2> 1682416 INFO (TEST-StatsReloadRaceTest.testParallelReloadAndStats-seed#[5E9B7AB8DA0C6961]) [ ] o.a.s.h.a.CoreAdminOperation Checking request status for : 1
[junit4] 2> 1682416 INFO (TEST-StatsReloadRaceTest.testParallelReloadAndStats-seed#[5E9B7AB8DA0C6961]) [ ] o.a.s.h.a.CoreAdminOperation Checking request status for : 1
[junit4] 2> 1682416 INFO (TEST-StatsReloadRaceTest.testParallelReloadAndStats-seed#[5E9B7AB8DA0C6961]) [ ] o.a.s.h.a.CoreAdminOperation Checking request status for : 1
[junit4] 2> 1682417 INFO (TEST-StatsReloadRaceTest.testParallelReloadAndStats-seed#[5E9B7AB8DA0C6961]) [ ] o.a.s.h.a.CoreAdminOperation Checking request status for : 1
[junit4] 2> 1682417 INFO (TEST-StatsReloadRaceTest.testParallelReloadAndStats-seed#[5E9B7AB8DA0C6961]) [ ] o.a.s.h.a.CoreAdminOperation Checking request status for : 1
[junit4] 2> 1682417 INFO (TEST-StatsReloadRaceTest.testParallelReloadAndStats-seed#[5E9B7AB8DA0C6961]) [ ] o.a.s.h.a.CoreAdminOperation Checking request status for : 1
[junit4] 2> 1682417 INFO (TEST-StatsReloadRaceTest.testParallelReloadAndStats-seed#[5E9B7AB8DA0C6961]) [ ] o.a.s.h.a.CoreAdminOperation Checking request status for : 1
[junit4] 2> 1682417 INFO (TEST-StatsReloadRaceTest.testParallelReloadAndStats-seed#[5E9B7AB8DA0C6961]) [ ] o.a.s.h.a.CoreAdminOperation Checking request status for : 1
[junit4] 2> 1682417 INFO (TEST-StatsReloadRaceTest.testParallelReloadAndStats-seed#[5E9B7AB8DA0C6961]) [ ] o.a.s.h.a.CoreAdminOperation Checking request status for : 1
[junit4] 2> 1682419 INFO (TEST-StatsReloadRaceTest.testParallelReloadAndStats-seed#[5E9B7AB8DA0C6961]) [ ] o.a.s.h.a.CoreAdminOperation Checking request status for : 1
[junit4] 2> 1682419 INFO (TEST-StatsReloadRaceTest.testParallelReloadAndStats-seed#[5E9B7AB8DA0C6961]) [ ] o.a.s.h.a.CoreAdminOperation Checking request status for : 1
[junit4] 2> 1682419 INFO (TEST-StatsReloadRaceTest.testParallelReloadAndStats-seed#[5E9B7AB8DA0C6961]) [ ] o.a.s.h.a.CoreAdminOperation Checking request status for : 1
[junit4] 2> 1682419 INFO (TEST-StatsReloadRaceTest.testParallelReloadAndStats-seed#[5E9B7AB8DA0C6961]) [ ] o.a.s.h.a.CoreAdminOperation Checking request status for : 1
[junit4] 2> 1682419 INFO (TEST-StatsReloadRaceTest.testParallelReloadAndStats-seed#[5E9B7AB8DA0C6961]) [ ] o.a.s.h.a.CoreAdminOperation Checking request status for : 1
[junit4] 2> 1682419 INFO (TEST-StatsReloadRaceTest.testParallelReloadAndStats-seed#[5E9B7AB8DA0C6961]) [ ] o.a.s.h.a.CoreAdminOperation Checking request status for : 1
[junit4] 2> 1682420 INFO (TEST-StatsReloadRaceTest.testParallelReloadAndStats-seed#[5E9B7AB8DA0C6961]) [ ] o.a.s.h.a.CoreAdminOperation Checking request status for : 1
[junit4] 2> 1682420 INFO (TEST-StatsReloadRaceTest.testParallelReloadAndStats-seed#[5E9B7AB8DA0C6961]) [ ] o.a.s.h.a.CoreAdminOperation Checking request status for : 1
[junit4] 2> 1682420 INFO (TEST-StatsReloadRaceTest.testParallelReloadAndStats-seed#[5E9B7AB8DA0C6961]) [ ] o.a.s.h.a.CoreAdminOperation Checking request status for : 1
[junit4] 2> 1682421 INFO (TEST-StatsReloadRaceTest.testParallelReloadAndStats-seed#[5E9B7AB8DA0C6961]) [ ] o.a.s.h.a.CoreAdminOperation Checking request status for : 1
[junit4] 2> 1682421 INFO (TEST-StatsReloadRaceTest.testParallelReloadAndStats-seed#[5E9B7AB8DA0C6961]) [ ] o.a.s.h.a.CoreAdminOperation Checking request status for : 1
[junit4] 2> 1682421 INFO (TEST-StatsReloadRaceTest.testParallelReloadAndStats-seed#[5E9B7AB8DA0C6961]) [ ] o.a.s.h.a.CoreAdminOperation Checking request status for : 1
[junit4] 2> 1682422 INFO (TEST-StatsReloadRaceTest.testParallelReloadAndStats-seed#[5E9B7AB8DA0C6961]) [ ] o.a.s.h.a.CoreAdminOperation Checking request status for : 1
[junit4] 2> 1682422 INFO (TEST-StatsReloadRaceTest.testParallelReloadAndStats-seed#[5E9B7AB8DA0C6961]) [ ] o.a.s.h.a.CoreAdminOperation Checking request status for : 1
[junit4] 2> 1682423 INFO (TEST-StatsReloadRaceTest.testParallelReloadAndStats-seed#[5E9B7AB8DA0C6961]) [ ] o.a.s.h.a.CoreAdminOperation Checking request status for : 1
[junit4] 2> 1682423 INFO (TEST-StatsReloadRaceTest.testParallelReloadAndStats-seed#[5E9B7AB8DA0C6961]) [ ] o.a.s.h.a.CoreAdminOperation Checking request status for : 1
[junit4] 2> 1682423 INFO (TEST-StatsReloadRaceTest.testParallelReloadAndStats-seed#[5E9B7AB8DA0C6961]) [ ] o.a.s.h.a.CoreAdminOperation Checking request status for : 1
[junit4] 2> 1682423 INFO (TEST-StatsReloadRaceTest.testParallelReloadAndStats-seed#[5E9B7AB8DA0C6961]) [ ] o.a.s.h.a.CoreAdminOperation Checking request status for : 1
[junit4] 2> 1682423 INFO (TEST-StatsReloadRaceTest.testParallelReloadAndStats-seed#[5E9B7AB8DA0C6961]) [ ] o.a.s.h.a.CoreAdminOperation Checking request status for : 1
[junit4] 2> 1682424 INFO (TEST-StatsReloadRaceTest.testParallelReloadAndStats-seed#[5E9B7AB8DA0C6961]) [ ] o.a.s.h.a.CoreAdminOperation Checking request status for : 1
[junit4] 2> 1682424 INFO (TEST-StatsReloadRaceTest.testParallelReloadAndStats-seed#[5E9B7AB8DA0C6961]) [ ] o.a.s.h.a.CoreAdminOperation Checking request status for : 1
[junit4] 2> 1682424 INFO (TEST-StatsReloadRaceTest.testParallelReloadAndStats-seed#[5E9B7AB8DA0C6961]) [ ] o.a.s.h.a.CoreAdminOperation Checking request status for : 1
[junit4] 2> 1682424 INFO (TEST-StatsReloadRaceTest.testParallelReloadAndStats-seed#[5E9B7AB8DA0C6961]) [ ] o.a.s.h.a.CoreAdminOperation Checking request status for : 1
[junit4] 2> 1682425 INFO (TEST-StatsReloadRaceTest.testParallelReloadAndStats-seed#[5E9B7AB8DA0C6961]) [ ] o.a.s.h.a.CoreAdminOperation Checking request status for : 1
[junit4] 2> 1682433 INFO (TEST-StatsReloadRaceTest.testParallelReloadAndStats-seed#[5E9B7AB8DA0C6961]) [ ] o.a.s.h.a.CoreAdminOperation Checking request status for : 1
[junit4] 2> 1682434 INFO (TEST-StatsReloadRaceTest.testParallelReloadAndStats-seed#[5E9B7AB8DA0C6961]) [ ] o.a.s.h.a.CoreAdminOperation Checking request status for : 1
[junit4] 2> 1682434 INFO (TEST-StatsReloadRaceTest.testParallelReloadAndStats-seed#[5E9B7AB8DA0C6961]) [ ] o.a.s.h.a.CoreAdminOperation Checking request status for : 1
[junit4] 2> 1682434 INFO (TEST-StatsReloadRaceTest.testParallelReloadAndStats-seed#[5E9B7AB8DA0C6961]) [ ] o.a.s.h.a.CoreAdminOperation Checking request status for : 1
[junit4] 2> 1682434 INFO (TEST-StatsReloadRaceTest.testParallelReloadAndStats-seed#[5E9B7AB8DA0C6961]) [ ] o.a.s.h.a.CoreAdminOperation Checking request status for : 1
[junit4] 2> 1682435 INFO (TEST-StatsReloadRaceTest.testParallelReloadAndStats-seed#[5E9B7AB8DA0C6961]) [ ] o.a.s.h.a.CoreAdminOperation Checking request status for : 1
[junit4] 2> 1682435 INFO (TEST-StatsReloadRaceTest.testParallelReloadAndStats-seed#[5E9B7AB8DA0C6961]) [ ] o.a.s.h.a.CoreAdminOperation Checking request status for : 1
[junit4] 2> 1682435 INFO (TEST-StatsReloadRaceTest.testParallelReloadAndStats-seed#[5E9B7AB8DA0C6961]) [ ] o.a.s.h.a.CoreAdminOperation Checking request status for : 1
[junit4] 2> 1682435 INFO (TEST-StatsReloadRaceTest.testParallelReloadAndStats-seed#[5E9B7AB8DA0C6961]) [ ] o.a.s.h.a.CoreAdminOperation Checking request status for : 1
[junit4] 2> 1682435 INFO (TEST-StatsReloadRaceTest.testParallelReloadAndStats-seed#[5E9B7AB8DA0C6961]) [ ] o.a.s.h.a.CoreAdminOperation Checking request status for : 1
[junit4] 2> 1682436 INFO (TEST-StatsReloadRaceTest.testParallelReloadAndStats-seed#[5E9B7AB8DA0C6961]) [ ] o.a.s.h.a.CoreAdminOperation Checking request status for : 1
[junit4] 2> 1682436 INFO (TEST-StatsReloadRaceTest.testParallelReloadAndStats-seed#[5E9B7AB8DA0C6961]) [ ] o.a.s.h.a.CoreAdminOperation Checking request status for : 1
[junit4] 2> 1682436 INFO (TEST-StatsReloadRaceTest.testParallelReloadAndStats-seed#[5E9B7AB8DA0C6961]) [ ] o.a.s.h.a.CoreAdminOperation Checking request status for : 1
[junit4] 2> 1682436 INFO (TEST-StatsReloadRaceTest.testParallelReloadAndStats-seed#[5E9B7AB8DA0C6961]) [ ] o.a.s.h.a.CoreAdminOperation Checking request status for : 1
[junit4] 2> 1682436 INFO (TEST-StatsReloadRaceTest.testParallelReloadAndStats-seed#[5E9B7AB8DA0C6961]) [ ] o.a.s.h.a.CoreAdminOperation Checking request status for : 1
[junit4] 2> 1682437 INFO (TEST-StatsReloadRaceTest.testParallelReloadAndStats-seed#[5E9B7AB8DA0C6961]) [ ] o.a.s.h.a.CoreAdminOperation Checking request status for : 1
[junit4] 2> 1682437 INFO (TEST-StatsReloadRaceTest.testParallelReloadAndStats-seed#[5E9B7AB8DA0C6961]) [ ] o.a.s.h.a.CoreAdminOperation Checking request status for : 1
[junit4] 2> 1682437 INFO (TEST-StatsReloadRaceTest.testParallelReloadAndStats-seed#[5E9B7AB8DA0C6961]) [ ] o.a.s.h.a.CoreAdminOperation Checking request status for : 1
[junit4] 2> 1682437 INFO (TEST-StatsReloadRaceTest.testParallelReloadAndStats-seed#[5E9B7AB8DA0C6961]) [ ] o.a.s.h.a.CoreAdminOperation Checking request status for : 1
[junit4] 2> 1682438 INFO (TEST-StatsReloadRaceTest.testParallelReloadAndStats-seed#[5E9B7AB8DA0C6961]) [ ] o.a.s.h.a.CoreAdminOperation Checking request status for : 1
[junit4] 2> 1682438 INFO (TEST-StatsReloadRaceTest.testParallelReloadAndStats-seed#[5E9B7AB8DA0C6961]) [ ] o.a.s.h.a.CoreAdminOperation Checking request status for : 1
[junit4] 2> 1682438 INFO (TEST-StatsReloadRaceTest.testParallelReloadAndStats-seed#[5E9B7AB8DA0C6961]) [ ] o.a.s.h.a.CoreAdminOperation Checking request status for : 1
[junit4] 2> 1682439 INFO (TEST-StatsReloadRaceTest.testParallelReloadAndStats-seed#[5E9B7AB8DA0C6961]) [ ] o.a.s.h.a.CoreAdminOperation Checking request status for : 1
[junit4] 2> 1682439 INFO (TEST-StatsReloadRaceTest.testParallelReloadAndStats-seed#[5E9B7AB8DA0C6961]) [ ] o.a.s.h.a.CoreAdminOperation Checking request status for : 1
[junit4] 2> 1682439 INFO (TEST-StatsReloadRaceTest.testParallelReloadAndStats-seed#[5E9B7AB8DA0C6961]) [ ] o.a.s.h.a.CoreAdminOperation Checking request status for : 1
[junit4] 2> 1682440 INFO (TEST-StatsReloadRaceTest.testParallelReloadAndStats-seed#[5E9B7AB8DA0C6961]) [ ] o.a.s.h.a.CoreAdminOperation Checking request status for : 1
[junit4] 2> 1682440 INFO (TEST-StatsReloadRaceTest.testParallelReloadAndStats-seed#[5E9B7AB8DA0C6961]) [ ] o.a.s.h.a.CoreAdminOperation Checking request status for : 1
[junit4] 2> 1682440 INFO (TEST-StatsReloadRaceTest.testParallelReloadAndStats-seed#[5E9B7AB8DA0C6961]) [ ] o.a.s.h.a.CoreAdminOperation Checking request status for : 1
[junit4] 2> 1682440 INFO (TEST-StatsReloadRaceTest.testParallelReloadAndStats-seed#[5E9B7AB8DA0C6961]) [ ] o.a.s.h.a.CoreAdminOperation Checking request status for : 1
[junit4] 2> 1682440 INFO (TEST-StatsReloadRaceTest.testParallelReloadAndStats-seed#[5E9B7AB8DA0C6961]) [ ] o.a.s.h.a.CoreAdminOperation Checking request status for : 1
[junit4] 2> 1682441 INFO (TEST-StatsReloadRaceTest.testParallelReloadAndStats-seed#[5E9B7AB8DA0C6961]) [ ] o.a.s.h.a.CoreAdminOperation Checking request status for : 1
[junit4] 2> 1682441 INFO (TEST-StatsReloadRaceTest.testParallelReloadAndStats-seed#[5E9B7AB8DA0C6961]) [ ] o.a.s.h.a.CoreAdminOperation Checking request status for : 1
[junit4] 2> 1682442 INFO (TEST-StatsReloadRaceTest.testParallelReloadAndStats-seed#[5E9B7AB8DA0C6961]) [ ] o.a.s.h.a.CoreAdminOperation Checking request status for : 1
[junit4] 2> 1682442 INFO (TEST-StatsReloadRaceTest.testParallelReloadAndStats-seed#[5E9B7AB8DA0C6961]) [ ] o.a.s.h.a.CoreAdminOperation Checking request status for : 1
[junit4] 2> 1682442 INFO (TEST-StatsReloadRaceTest.testParallelReloadAndStats-seed#[5E9B7AB8DA0C6961]) [ ] o.a.s.h.a.CoreAdminOperation Checking request status for : 1
[junit4] 2> 1682443 INFO (TEST-StatsReloadRaceTest.testParallelReloadAndStats-seed#[5E9B7AB8DA0C6961]) [ ] o.a.s.h.a.CoreAdminOperation Checking request status for : 1
[junit4] 2> 1682443 INFO (TEST-StatsReloadRaceTest.testParallelReloadAndStats-seed#[5E9B7AB8DA0C6961]) [ ] o.a.s.h.a.CoreAdminOperation Checking request status for : 1
[junit4] 2> 1682443 INFO (TEST-StatsReloadRaceTest.testParallelReloadAndStats-seed#[5E9B7AB8DA0C6961]) [ ] o.a.s.h.a.CoreAdminOperation Checking request status for : 1
[junit4] 2> 1682443 INFO (TEST-StatsReloadRaceTest.testParallelReloadAndStats-seed#[5E9B7AB8DA0C6961]) [ ] o.a.s.h.a.CoreAdminOperation Checking request status for : 1
[junit4] 2> 1682444 INFO (TEST-StatsReloadRaceTest.testParallelReloadAndStats-seed#[5E9B7AB8DA0C6961]) [ ] o.a.s.h.a.CoreAdminOperation Checking request status for : 1
[junit4] 2> 1682444 INFO (TEST-StatsReloadRaceTest.testParallelReloadAndStats-seed#[5E9B7AB8DA0C6961]) [ ] o.a.s.h.a.CoreAdminOperation Checking request status for : 1
[junit4] 2> 1682444 INFO (TEST-StatsReloadRaceTest.testParallelReloadAndStats-seed#[5E9B7AB8DA0C6961]) [ ] o.a.s.h.a.CoreAdminOperation Checking request status for : 1
[junit4] 2> 1682444 INFO (TEST-StatsReloadRaceTest.testParallelReloadAndStats-seed#[5E9B7AB8DA0C6961]) [ ] o.a.s.h.a.CoreAdminOperation Checking request status for : 1
[junit4] 2> 1682444 INFO (TEST-StatsReloadRaceTest.testParallelReloadAndStats-seed#[5E9B7AB8DA0C6961]) [ ] o.a.s.h.a.CoreAdminOperation Checking request status for : 1
[junit4] 2> 1682445 INFO (TEST-StatsReloadRaceTest.testParallelReloadAndStats-seed#[5E9B7AB8DA0C6961]) [ ] o.a.s.h.a.CoreAdminOperation Checking request status for : 1
[junit4] 2> 1682445 INFO (TEST-StatsReloadRaceTest.testParallelReloadAndStats-seed#[5E9B7AB8DA0C6961]) [ ] o.a.s.h.a.CoreAdminOperation Checking request status for : 1
[junit4] 2> 1682446 INFO (TEST-StatsReloadRaceTest.testParallelReloadAndStats-seed#[5E9B7AB8DA0C6961]) [ ] o.a.s.h.a.CoreAdminOperation Checking request status for : 1
[junit4] 2> 1682446 INFO (TEST-StatsReloadRaceTest.testParallelReloadAndStats-seed#[5E9B7AB8DA0C6961]) [ ] o.a.s.h.a.CoreAdminOperation Checking request status for : 1
[junit4] 2> 1682446 INFO (TEST-StatsReloadRaceTest.testParallelReloadAndStats-seed#[5E9B7AB8DA0C6961]) [ ] o.a.s.h.a.CoreAdminOperation Checking request status for : 1
[junit4] 2> 1682447 INFO (TEST-StatsReloadRaceTest.testParallelReloadAndStats-seed#[5E9B7AB8DA0C6961]) [ ] o.a.s.h.a.CoreAdminOperation Checking request status for : 1
[junit4] 2> 1682447 INFO (TEST-StatsReloadRaceTest.testParallelReloadAndStats-seed#[5E9B7AB8DA0C6961]) [ ] o.a.s.h.a.CoreAdminOperation Checking request status for : 1
[junit4] 2> 1682447 INFO (TEST-StatsReloadRaceTest.testParallelReloadAndStats-seed#[5E9B7AB8DA0C6961]) [ ] o.a.s.h.a.CoreAdminOperation Checking request status for : 1
[junit4] 2> 1682447 INFO (TEST-StatsReloadRaceTest.testParallelReloadAndStats-seed#[5E9B7AB8DA0C6961]) [ ] o.a.s.h.a.CoreAdminOperation Checking request status for : 1
[junit4] 2> 1682447 INFO (TEST-StatsReloadRaceTest.testParallelReloadAndStats-seed#[5E9B7AB8DA0C6961]) [ ] o.a.s.h.a.CoreAdminOperation Checking request status for : 1
[junit4] 2> 1682447 INFO (TEST-StatsReloadRaceTest.testParallelReloadAndStats-seed#[5E9B7AB8DA0C6961]) [ ] o.a.s.h.a.CoreAdminOperation Checking request status for : 1
[junit4] 2> 1682448 INFO (TEST-StatsReloadRaceTest.testParallelReloadAndStats-seed#[5E9B7AB8DA0C6961]) [ ] o.a.s.h.a.CoreAdminOperation Checking request status for : 1
[junit4] 2> 1682448 INFO (TEST-StatsReloadRaceTest.testParallelReloadAndStats-seed#[5E9B7AB8DA0C6961]) [ ] o.a.s.h.a.CoreAdminOperation Checking request status for : 1
[junit4] 2> 1682448 INFO (TEST-StatsReloadRaceTest.testParallelReloadAndStats-seed#[5E9B7AB8DA0C6961]) [ ] o.a.s.h.a.CoreAdminOperation Checking request status for : 1
[junit4] 2> 1682448 INFO (TEST-StatsReloadRaceTest.testParallelReloadAndStats-seed#[5E9B7AB8DA0C6961]) [ ] o.a.s.h.a.CoreAdminOperation Checking request status for : 1
[junit4] 2> 1682449 INFO (TEST-StatsReloadRaceTest.testParallelReloadAndStats-seed#[5E9B7AB8DA0C6961]) [ ] o.a.s.h.a.CoreAdminOperation Checking request status for : 1
[junit4] 2> 1682449 INFO (TEST-StatsReloadRaceTest.testParallelReloadAndStats-seed#[5E9B7AB8DA0C6961]) [ ] o.a.s.h.a.CoreAdminOperation Checking request status for : 1
[junit4] 2> 1682449 INFO (TEST-StatsReloadRaceTest.testParallelReloadAndStats-seed#[5E9B7AB8DA0C6961]) [ ] o.a.s.h.a.CoreAdminOperation Checking request status for : 1
[junit4] 2> 1682449 INFO (TEST-StatsReloadRaceTest.testParallelReloadAndStats-seed#[5E9B7AB8DA0C6961]) [ ] o.a.s.h.a.CoreAdminOperation Checking request status for : 1
[junit4] 2> 1682449 INFO (TEST-StatsReloadRaceTest.testParallelReloadAndStats-seed#[5E9B7AB8DA0C6961]) [ ] o.a.s.h.a.CoreAdminOperation Checking request status for : 1
[junit4] 2> 1682450 INFO (TEST-StatsReloadRaceTest.testParallelReloadAndStats-seed#[5E9B7AB8DA0C6961]) [ ] o.a.s.h.a.CoreAdminOperation Checking request status for : 1
[junit4] 2> 1682450 INFO (TEST-StatsReloadRaceTest.testParallelReloadAndStats-seed#[5E9B7AB8DA0C6961]) [ ] o.a.s.h.a.CoreAdminOperation Checking request status for : 1
[junit4] 2> 1682450 INFO (TEST-StatsReloadRaceTest.testParallelReloadAndStats-seed#[5E9B7AB8DA0C6961]) [ ] o.a.s.h.a.CoreAdminOperation Checking request status for : 1
[junit4] 2> 1682451 INFO (TEST-StatsReloadRaceTest.testParallelReloadAndStats-seed#[5E9B7AB8DA0C6961]) [ ] o.a.s.h.a.CoreAdminOperation Checking request status for : 1
[junit4] 2> 1682451 INFO (TEST-StatsReloadRaceTest.testParallelReloadAndStats-seed#[5E9B7AB8DA0C6961]) [ ] o.a.s.h.a.CoreAdminOperation Checking request status for : 1
[junit4] 2> 1682451 INFO (TEST-StatsReloadRaceTest.testParallelReloadAndStats-seed#[5E9B7AB8DA0C6961]) [ ] o.a.s.h.a.CoreAdminOperation Checking request status for : 1
[junit4] 2> 1682452 INFO (TEST-StatsReloadRaceTest.testParallelReloadAndStats-seed#[5E9B7AB8DA0C6961]) [ ] o.a.s.h.a.CoreAdminOperation Checking request status for : 1
[junit4] 2> 1682452 INFO (TEST-StatsReloadRaceTest.testParallelReloadAndStats-seed#[5E9B7AB8DA0C6961]) [ ] o.a.s.h.a.CoreAdminOperation Checking request status for : 1
[junit4] 2> 1682452 INFO (TEST-StatsReloadRaceTest.testParallelReloadAndStats-seed#[5E9B7AB8DA0C6961]) [ ] o.a.s.h.a.CoreAdminOperation Checking request status for : 1
[junit4] 2> 1682452 INFO (TEST-StatsReloadRaceTest.testParallelReloadAndStats-seed#[5E9B7AB8DA0C6961]) [ ] o.a.s.h.a.CoreAdminOperation Checking request status for : 1
[junit4] 2> 1682453 INFO (TEST-StatsReloadRaceTest.testParallelReloadAndStats-seed#[5E9B7AB8DA0C6961]) [ ] o.a.s.h.a.CoreAdminOperation Checking request status for : 1
[junit4] 2> 1682453 INFO (TEST-StatsReloadRaceTest.testParallelReloadAndStats-seed#[5E9B7AB8DA0C6961]) [ ] o.a.s.h.a.CoreAdminOperation Checking request status for : 1
[junit4] 2> 1682453 INFO (TEST-StatsReloadRaceTest.testParallelReloadAndStats-seed#[5E9B7AB8DA0C6961]) [ ] o.a.s.h.a.CoreAdminOperation Checking request status for : 1
[junit4] 2> 1682455 INFO (TEST-StatsReloadRaceTest.testParallelReloadAndStats-seed#[5E9B7AB8DA0C6961]) [ ] o.a.s.h.a.CoreAdminOperation Checking request status for : 1
[junit4] 2> 1682455 INFO (TEST-StatsReloadRaceTest.testParallelReloadAndStats-seed#[5E9B7AB8DA0C6961]) [ ] o.a.s.h.a.CoreAdminOperation Checking request status for : 1
[junit4] 2> 1682455 INFO (TEST-StatsReloadRaceTest.testParallelReloadAndStats-seed#[5E9B7AB8DA0C6961]) [ ] o.a.s.h.a.CoreAdminOperation Checking request status for : 1
[junit4] 2> 1682455 INFO (TEST-StatsReloadRaceTest.testParallelReloadAndStats-seed#[5E9B7AB8DA0C6961]) [ ] o.a.s.h.a.CoreAdminOperation Checking request status for : 1
[junit4] 2> 1682455 INFO (TEST-StatsReloadRaceTest.testParallelReloadAndStats-seed#[5E9B7AB8DA0C6961]) [ ] o.a.s.h.a.CoreAdminOperation Checking request status for : 1
[junit4] 2> 1682455 INFO (TEST-StatsReloadRaceTest.testParallelReloadAndStats-seed#[5E9B7AB8DA0C6961]) [ ] o.a.s.h.a.CoreAdminOperation Checking request status for : 1
[junit4] 2> 1682455 INFO (TEST-StatsReloadRaceTest.testParallelReloadAndStats-seed#[5E9B7AB8DA0C6961]) [ ] o.a.s.h.a.CoreAdminOperation Checking request status for : 1
[junit4] 2> 1682455 INFO (TEST-StatsReloadRaceTest.testParallelReloadAndStats-seed#[5E9B7AB8DA0C6961]) [ ] o.a.s.h.a.CoreAdminOperation Checking request status for : 1
[junit4] 2> 1682455 INFO (TEST-StatsReloadRaceTest.testParallelReloadAndStats-seed#[5E9B7AB8DA0C6961]) [ ] o.a.s.h.a.CoreAdminOperation Checking request status for : 1
[junit4] 2> 1682456 INFO (TEST-StatsReloadRaceTest.testParallelReloadAndStats-seed#[5E9B7AB8DA0C6961]) [ ] o.a.s.h.a.CoreAdminOperation Checking request status for : 1
[junit4] 2> 1682456 INFO (TEST-StatsReloadRaceTest.testParallelReloadAndStats-seed#[5E9B7AB8DA0C6961]) [ ] o.a.s.h.a.CoreAdminOperation Checking request status for : 1
[junit4] 2> 1682456 INFO (TEST-StatsReloadRaceTest.testParallelReloadAndStats-seed#[5E9B7AB8DA0C6961]) [ ] o.a.s.h.a.CoreAdminOperation Checking request status for : 1
[junit4] 2> 1682457 INFO (TEST-StatsReloadRaceTest.testParallelReloadAndStats-seed#[5E9B7AB8DA0C6961]) [ ] o.a.s.h.a.CoreAdminOperation Checking request status for : 1
[junit4] 2> 1682457 INFO (TEST-StatsReloadRaceTest.testParallelReloadAndStats-seed#[5E9B7AB8DA0C6961]) [ ] o.a.s.h.a.CoreAdminOperation Checking request status for : 1
[junit4] 2> 1682457 INFO (TEST-StatsReloadRaceTest.testParallelReloadAndStats-seed#[5E9B7AB8DA0C6961]) [ ] o.a.s.h.a.CoreAdminOperation Checking request status for : 1
[junit4] 2> 1682457 INFO (TEST-StatsReloadRaceTest.testParallelReloadAndStats-seed#[5E9B7AB8DA0C6961]) [ ] o.a.s.h.a.CoreAdminOperation Checking request status for : 1
[junit4] 2> 1682457 INFO (TEST-StatsReloadRaceTest.testParallelReloadAndStats-seed#[5E9B7AB8DA0C6961]) [ ] o.a.s.h.a.CoreAdminOperation Checking request status for : 1
[junit4] 2> 1682458 INFO (TEST-StatsReloadRaceTest.testParallelReloadAndStats-seed#[5E9B7AB8DA0C6961]) [ ] o.a.s.h.a.CoreAdminOperation Checking request status for : 1
[junit4] 2> 1682458 INFO (TEST-StatsReloadRaceTest.testParallelReloadAndStats-seed#[5E9B7AB8DA0C6961]) [ ] o.a.s.h.a.CoreAdminOperation Checking request status for : 1
[junit4] 2> 1682458 INFO (TEST-StatsReloadRaceTest.testParallelReloadAndStats-seed#[5E9B7AB8DA0C6961]) [ ] o.a.s.h.a.CoreAdminOperation Checking request status for : 1
[junit4] 2> 1682458 INFO (TEST-StatsReloadRaceTest.testParallelReloadAndStats-seed#[5E9B7AB8DA0C6961]) [ ] o.a.s.h.a.CoreAdminOperation Checking request status for : 1
[junit4] 2> 1682459 INFO (TEST-StatsReloadRaceTest.testParallelReloadAndStats-seed#[5E9B7AB8DA0C6961]) [ ] o.a.s.h.a.CoreAdminOperation Checking request status for : 1
[junit4] 2> 1682459 INFO (TEST-StatsReloadRaceTest.testParallelReloadAndStats-seed#[5E9B7AB8DA0C6961]) [ ] o.a.s.h.a.CoreAdminOperation Checking request status for : 1
[junit4] 2> 1682459 INFO (TEST-StatsReloadRaceTest.testParallelReloadAndStats-seed#[5E9B7AB8DA0C6961]) [ ] o.a.s.h.a.CoreAdminOperation Checking request status for : 1
[junit4] 2> 1682459 INFO (TEST-StatsReloadRaceTest.testParallelReloadAndStats-seed#[5E9B7AB8DA0C6961]) [ ] o.a.s.h.a.CoreAdminOperation Checking request status for : 1
[junit4] 2> 1682459 INFO (TEST-StatsReloadRaceTest.testParallelReloadAndStats-seed#[5E9B7AB8DA0C6961]) [ ] o.a.s.h.a.CoreAdminOperation Checking request status for : 1
[junit4] 2> 1682460 INFO (TEST-StatsReloadRaceTest.testParallelReloadAndStats-seed#[5E9B7AB8DA0C6961]) [ ] o.a.s.h.a.CoreAdminOperation Checking request status for : 1
[junit4] 2> 1682460 INFO (TEST-StatsReloadRaceTest.testParallelReloadAndStats-seed#[5E9B7AB8DA0C6961]) [ ] o.a.s.h.a.CoreAdminOperation Checking request status for : 1
[junit4] 2> 1682460 INFO (TEST-StatsReloadRaceTest.testParallelReloadAndStats-seed#[5E9B7AB8DA0C6961]) [ ] o.a.s.h.a.CoreAdminOperation Checking request status for : 1
[junit4] 2> 1682460 INFO (TEST-StatsReloadRaceTest.testParallelReloadAndStats-seed#[5E9B7AB8DA0C6961]) [ ] o.a.s.h.a.CoreAdminOperation Checking request status for : 1
[junit4] 2> 1682461 INFO (TEST-StatsReloadRaceTest.testParallelReloadAndStats-seed#[5E9B7AB8DA0C6961]) [ ] o.a.s.h.a.CoreAdminOperation Checking request status for : 1
[junit4] 2> 1682461 INFO (TEST-StatsReloadRaceTest.testParallelReloadAndStats-seed#[5E9B7AB8DA0C6961]) [ ] o.a.s.h.a.CoreAdminOperation Checking request status for : 1
[junit4] 2> 1682461 INFO (TEST-StatsReloadRaceTest.testParallelReloadAndStats-seed#[5E9B7AB8DA0C6961]) [ ] o.a.s.h.a.CoreAdminOperation Checking request status for : 1
[junit4] 2> 1682461 INFO (TEST-StatsReloadRaceTest.testParallelReloadAndStats-seed#[5E9B7AB8DA0C6961]) [ ] o.a.s.h.a.CoreAdminOperation Checking request status for : 1
[junit4] 2> 1682461 INFO (TEST-StatsReloadRaceTest.testParallelReloadAndStats-seed#[5E9B7AB8DA0C6961]) [ ] o.a.s.h.a.CoreAdminOperation Checking request status for : 1
[junit4] 2> 1682462 INFO (TEST-StatsReloadRaceTest.testParallelReloadAndStats-seed#[5E9B7AB8DA0C6961]) [ ] o.a.s.h.a.CoreAdminOperation Checking request status for : 1
[junit4] 2> 1682462 INFO (TEST-StatsReloadRaceTest.testParallelReloadAndStats-seed#[5E9B7AB8DA0C6961]) [ ] o.a.s.h.a.CoreAdminOperation Checking request status for : 1
[junit4] 2> 1682462 INFO (TEST-StatsReloadRaceTest.testParallelReloadAndStats-seed#[5E9B7AB8DA0C6961]) [ ] o.a.s.h.a.CoreAdminOperation Checking request status for : 1
[junit4] 2> 1682462 INFO (TEST-StatsReloadRaceTest.testParallelReloadAndStats-seed#[5E9B7AB8DA0C6961]) [ ] o.a.s.h.a.CoreAdminOperation Checking request status for : 1
[junit4] 2> 1682463 INFO (TEST-StatsReloadRaceTest.testParallelReloadAndStats-seed#[5E9B7AB8DA0C6961]) [ ] o.a.s.h.a.CoreAdminOperation Checking request status for : 1
[junit4] 2> 1682463 INFO (TEST-StatsReloadRaceTest.testParallelReloadAndStats-seed#[5E9B7AB8DA0C6961]) [ ] o.a.s.h.a.CoreAdminOperation Checking request status for : 1
[junit4] 2> 1682463 INFO (TEST-StatsReloadRaceTest.testParallelReloadAndStats-seed#[5E9B7AB8DA0C6961]) [ ] o.a.s.h.a.CoreAdminOperation Checking request status for : 1
[junit4] 2> 1682463 INFO (TEST-StatsReloadRaceTest.testParallelReloadAndStats-seed#[5E9B7AB8DA0C6961]) [ ] o.a.s.h.a.CoreAdminOperation Checking request status for : 1
[junit4] 2> 1682463 INFO (TEST-StatsReloadRaceTest.testParallelReloadAndStats-seed#[5E9B7AB8DA0C6961]) [ ] o.a.s.h.a.CoreAdminOperation Checking request status for : 1
[junit4] 2> 1682463 INFO (TEST-StatsReloadRaceTest.testParallelReloadAndStats-seed#[5E9B7AB8DA0C6961]) [ ] o.a.s.h.a.CoreAdminOperation Checking request status for : 1
[junit4] 2> 1682463 INFO (TEST-StatsReloadRaceTest.testParallelReloadAndStats-seed#[5E9B7AB8DA0C6961]) [ ] o.a.s.h.a.CoreAdminOperation Checking request status for : 1
[junit4] 2> 1682464 INFO (TEST-StatsReloadRaceTest.testParallelReloadAndStats-seed#[5E9B7AB8DA0C6961]) [ ] o.a.s.h.a.CoreAdminOperation Checking request status for : 1
[junit4] 2> 1682464 INFO (TEST-StatsReloadRaceTest.testParallelReloadAndStats-seed#[5E9B7AB8DA0C6961]) [ ] o.a.s.h.a.CoreAdminOperation Checking request status for : 1
[junit4] 2> 1682464 INFO (TEST-StatsReloadRaceTest.testParallelReloadAndStats-seed#[5E9B7AB8DA0C6961]) [ ] o.a.s.h.a.CoreAdminOperation Checking request status for : 1
[junit4] 2> 1682464 INFO (TEST-StatsReloadRaceTest.testParallelReloadAndStats-seed#[5E9B7AB8DA0C6961]) [ ] o.a.s.h.a.CoreAdminOperation Checking request status for : 1
[junit4] 2> 1682464 INFO (TEST-StatsReloadRaceTest.testParallelReloadAndStats-seed#[5E9B7AB8DA0C6961]) [ ] o.a.s.h.a.CoreAdminOperation Checking request status for : 1
[junit4] 2> 1682464 INFO (TEST-StatsReloadRaceTest.testParallelReloadAndStats-seed#[5E9B7AB8DA0C6961]) [ ] o.a.s.h.a.CoreAdminOperation Checking request status for : 1
[junit4] 2> 1682465 INFO (TEST-StatsReloadRaceTest.testParallelReloadAndStats-seed#[5E9B7AB8DA0C6961]) [ ] o.a.s.h.a.CoreAdminOperation Checking request status for : 1
[junit4] 2> 1682465 INFO (TEST-StatsReloadRaceTest.testParallelReloadAndStats-seed#[5E9B7AB8DA0C6961]) [ ] o.a.s.h.a.CoreAdminOperation Checking request status for : 1
[junit4] 2> 1682465 INFO (TEST-StatsReloadRaceTest.testParallelReloadAndStats-seed#[5E9B7AB8DA0C6961]) [ ] o.a.s.h.a.CoreAdminOperation Checking request status for : 1
[junit4] 2> 1682465 INFO (TEST-StatsReloadRaceTest.testParallelReloadAndStats-seed#[5E9B7AB8DA0C6961]) [ ] o.a.s.h.a.CoreAdminOperation Checking request status for : 1
[junit4] 2> 1682466 INFO (TEST-StatsReloadRaceTest.testParallelReloadAndStats-seed#[5E9B7AB8DA0C6961]) [ ] o.a.s.h.a.CoreAdminOperation Checking request status for : 1
[junit4] 2> 1682466 INFO (TEST-StatsReloadRaceTest.testParallelReloadAndStats-seed#[5E9B7AB8DA0C6961]) [ ] o.a.s.h.a.CoreAdminOperation Checking request status for : 1
[junit4] 2> 1682467 INFO (TEST-StatsReloadRaceTest.testParallelReloadAndStats-seed#[5E9B7AB8DA0C6961]) [ ] o.a.s.h.a.CoreAdminOperation Checking request status for : 1
[junit4] 2> 1682467 INFO (TEST-StatsReloadRaceTest.testParallelReloadAndStats-seed#[5E9B7AB8DA0C6961]) [ ] o.a.s.h.a.CoreAdminOperation Checking request status for : 1
[junit4] 2> 1682467 INFO (TEST-StatsReloadRaceTest.testParallelReloadAndStats-seed#[5E9B7AB8DA0C6961]) [ ] o.a.s.h.a.CoreAdminOperation Checking request status for : 1
[junit4] 2> 1682468 INFO (TEST-StatsReloadRaceTest.testParallelReloadAndStats-seed#[5E9B7AB8DA0C6961]) [ ] o.a.s.h.a.CoreAdminOperation Checking request status for : 1
[junit4] 2> 1682468 INFO (TEST-StatsReloadRaceTest.testParallelReloadAndStats-seed#[5E9B7AB8DA0C6961]) [ ] o.a.s.h.a.CoreAdminOperation Checking request status for : 1
[junit4] 2> 1682468 INFO (TEST-StatsReloadRaceTest.testParallelReloadAndStats-seed#[5E9B7AB8DA0C6961]) [ ] o.a.s.h.a.CoreAdminOperation Checking request status for : 1
[junit4] 2> 1682468 INFO (TEST-StatsReloadRaceTest.testParallelReloadAndStats-seed#[5E9B7AB8DA0C6961]) [ ] o.a.s.h.a.CoreAdminOperation Checking request status for : 1
[junit4] 2> 1682468 INFO (TEST-StatsReloadRaceTest.testParallelReloadAndStats-seed#[5E9B7AB8DA0C6961]) [ ] o.a.s.h.a.CoreAdminOperation Checking request status for : 1
[junit4] 2> 1682469 INFO (TEST-StatsReloadRaceTest.testParallelReloadAndStats-seed#[5E9B7AB8DA0C6961]) [ ] o.a.s.h.a.CoreAdminOperation Checking request status for : 1
[junit4] 2> 1682469 INFO (TEST-StatsReloadRaceTest.testParallelReloadAndStats-seed#[5E9B7AB8DA0C6961]) [ ] o.a.s.h.a.CoreAdminOperation Checking request status for : 1
[junit4] 2> 1682469 INFO (TEST-StatsReloadRaceTest.testParallelReloadAndStats-seed#[5E9B7AB8DA0C6961]) [ ] o.a.s.h.a.CoreAdminOperation Checking request status for : 1
[junit4] 2> 1682470 INFO (TEST-StatsReloadRaceTest.testParallelReloadAndStats-seed#[5E9B7AB8DA0C6961]) [ ] o.a.s.h.a.CoreAdminOperation Checking request status for : 1
[junit4] 2> 1682470 INFO (TEST-StatsReloadRaceTest.testParallelReloadAndStats-seed#[5E9B7AB8DA0C6961]) [ ] o.a.s.h.a.CoreAdminOperation Checking request status for : 1
[junit4] 2> 1682470 INFO (TEST-StatsReloadRaceTest.testParallelReloadAndStats-seed#[5E9B7AB8DA0C6961]) [ ] o.a.s.h.a.CoreAdminOperation Checking request status for : 1
[junit4] 2> 1682470 WARN (parallelCoreAdminExecutor-8117-thread-1) [ ] o.a.s.c.Config Beginning with Solr 5.5, <mergePolicy> is deprecated, use <mergePolicyFactory> instead.
[junit4] 2> 1682470 INFO (TEST-StatsReloadRaceTest.testParallelReloadAndStats-seed#[5E9B7AB8DA0C6961]) [ ] o.a.s.h.a.CoreAdminOperation Checking request status for : 1
[junit4] 2> 1682471 INFO (TEST-StatsReloadRaceTest.testParallelReloadAndStats-seed#[5E9B7AB8DA0C6961]) [ ] o.a.s.h.a.CoreAdminOperation Checking request status for : 1
[junit4] 2> 1682471 INFO (TEST-StatsReloadRaceTest.testParallelReloadAndStats-seed#[5E9B7AB8DA0C6961]) [ ] o.a.s.h.a.CoreAdminOperation Checking request status for : 1
[junit4] 2> 1682471 INFO (TEST-StatsReloadRaceTest.testParallelReloadAndStats-seed#[5E9B7AB8DA0C6961]) [ ] o.a.s.h.a.CoreAdminOperation Checking request status for : 1
[junit4] 2> 1682472 INFO (TEST-StatsReloadRaceTest.testParallelReloadAndStats-seed#[5E9B7AB8DA0C6961]) [ ] o.a.s.h.a.CoreAdminOperation Checking request status for : 1
[junit4] 2> 1682472 INFO (TEST-StatsReloadRaceTest.testParallelReloadAndStats-seed#[5E9B7AB8DA0C6961]) [ ] o.a.s.h.a.CoreAdminOperation Checking request status for : 1
[junit4] 2> 1682472 INFO (TEST-StatsReloadRaceTest.testParallelReloadAndStats-seed#[5E9B7AB8DA0C6961]) [ ] o.a.s.h.a.CoreAdminOperation Checking request status for : 1
[junit4] 2> 1682472 INFO (TEST-StatsReloadRaceTest.testParallelReloadAndStats-seed#[5E9B7AB8DA0C6961]) [ ] o.a.s.h.a.CoreAdminOperation Checking request status for : 1
[junit4] 2> 1682472 INFO (parallelCoreAdminExecutor-8117-thread-1) [ ] o.a.s.c.SolrConfig Using Lucene MatchVersion: 7.0.0
[junit4] 2> 1682472 INFO (TEST-StatsReloadRaceTest.testParallelReloadAndStats-seed#[5E9B7AB8DA0C6961]) [ ] o.a.s.h.a.CoreAdminOperation Checking request status for : 1
[junit4] 2> 1682472 INFO (TEST-StatsReloadRaceTest.testParallelReloadAndStats-seed#[5E9B7AB8DA0C6961]) [ ] o.a.s.h.a.CoreAdminOperation Checking request status for : 1
[junit4] 2> 1682473 INFO (TEST-StatsReloadRaceTest.testParallelReloadAndStats-seed#[5E9B7AB8DA0C6961]) [ ] o.a.s.h.a.CoreAdminOperation Checking request status for : 1
[junit4] 2> 1682473 INFO (TEST-StatsReloadRaceTest.testParallelReloadAndStats-seed#[5E9B7AB8DA0C6961]) [ ] o.a.s.h.a.CoreAdminOperation Checking request status for : 1
[junit4] 2> 1682473 INFO (TEST-StatsReloadRaceTest.testParallelReloadAndStats-seed#[5E9B7AB8DA0C6961]) [ ] o.a.s.h.a.CoreAdminOperation Checking request status for : 1
[junit4] 2> 1682474 INFO (TEST-StatsReloadRaceTest.testParallelReloadAndStats-seed#[5E9B7AB8DA0C6961]) [ ] o.a.s.h.a.CoreAdminOperation Checking request status for : 1
[junit4] 2> 1682474 INFO (TEST-StatsReloadRaceTest.testParallelReloadAndStats-seed#[5E9B7AB8DA0C6961]) [ ] o.a.s.h.a.CoreAdminOperation Checking request status for : 1
[junit4] 2> 1682474 INFO (TEST-StatsReloadRaceTest.testParallelReloadAndStats-seed#[5E9B7AB8DA0C6961]) [ ] o.a.s.h.a.CoreAdminOperation Checking request status for : 1
[junit4] 2> 1682474 INFO (TEST-StatsReloadRaceTest.testParallelReloadAndStats-seed#[5E9B7AB8DA0C6961]) [ ] o.a.s.h.a.CoreAdminOperation Checking request status for : 1
[junit4] 2> 1682474 INFO (TEST-StatsReloadRaceTest.testParallelReloadAndStats-seed#[5E9B7AB8DA0C6961]) [ ] o.a.s.h.a.CoreAdminOperation Checking request status for : 1
[junit4] 2> 1682474 INFO (TEST-StatsReloadRaceTest.testParallelReloadAndStats-seed#[5E9B7AB8DA0C6961]) [ ] o.a.s.h.a.CoreAdminOperation Checking request status for : 1
[junit4] 2> 1682475 INFO (TEST-StatsReloadRaceTest.testParallelReloadAndStats-seed#[5E9B7AB8DA0C6961]) [ ] o.a.s.h.a.CoreAdminOperation Checking request status for : 1
[junit4] 2> 1682475 INFO (TEST-StatsReloadRaceTest.testParallelReloadAndStats-seed#[5E9B7AB8DA0C6961]) [ ] o.a.s.h.a.CoreAdminOperation Checking request status for : 1
[junit4] 2> 1682475 INFO (TEST-StatsReloadRaceTest.testParallelReloadAndStats-seed#[5E9B7AB8DA0C6961]) [ ] o.a.s.h.a.CoreAdminOperation Checking request status for : 1
[junit4] 2> 1682475 INFO (TEST-StatsReloadRaceTest.testParallelReloadAndStats-seed#[5E9B7AB8DA0C6961]) [ ] o.a.s.h.a.CoreAdminOperation Checking request status for : 1
[junit4] 2> 1682475 INFO (TEST-StatsReloadRaceTest.testParallelReloadAndStats-seed#[5E9B7AB8DA0C6961]) [ ] o.a.s.h.a.CoreAdminOperation Checking request status for : 1
[junit4] 2> 1682475 INFO (TEST-StatsReloadRaceTest.testParallelReloadAndStats-seed#[5E9B7AB8DA0C6961]) [ ] o.a.s.h.a.CoreAdminOperation Checking request status for : 1
[junit4] 2> 1682476 INFO (TEST-StatsReloadRaceTest.testParallelReloadAndStats-seed#[5E9B7AB8DA0C6961]) [ ] o.a.s.h.a.CoreAdminOperation Checking request status for : 1
[junit4] 2> 1682476 INFO (TEST-StatsReloadRaceTest.testParallelReloadAndStats-seed#[5E9B7AB8DA0C6961]) [ ] o.a.s.h.a.CoreAdminOperation Checking request status for : 1
[junit4] 2> 1682476 INFO (TEST-StatsReloadRaceTest.testParallelReloadAndStats-seed#[5E9B7AB8DA0C6961]) [ ] o.a.s.h.a.CoreAdminOperation Checking request status for : 1
[junit4] 2> 1682476 INFO (TEST-StatsReloadRaceTest.testParallelReloadAndStats-seed#[5E9B7AB8DA0C6961]) [ ] o.a.s.h.a.CoreAdminOperation Checking request status for : 1
[junit4] 2> 1682476 INFO (TEST-StatsReloadRaceTest.testParallelReloadAndStats-seed#[5E9B7AB8DA0C6961]) [ ] o.a.s.h.a.CoreAdminOperation Checking request status for : 1
[junit4] 2> 1682477 INFO (TEST-StatsReloadRaceTest.testParallelReloadAndStats-seed#[5E9B7AB8DA0C6961]) [ ] o.a.s.h.a.CoreAdminOperation Checking request status for : 1
[junit4] 2> 1682477 INFO (TEST-StatsReloadRaceTest.testParallelReloadAndStats-seed#[5E9B7AB8DA0C6961]) [ ] o.a.s.h.a.CoreAdminOperation Checking request status for : 1
[junit4] 2> 1682477 INFO (TEST-StatsReloadRaceTest.testParallelReloadAndStats-seed#[5E9B7AB8DA0C6961]) [ ] o.a.s.h.a.CoreAdminOperation Checking request status for : 1
[junit4] 2> 1682478 INFO (TEST-StatsReloadRaceTest.testParallelReloadAndStats-seed#[5E9B7AB8DA0C6961]) [ ] o.a.s.h.a.CoreAdminOperation Checking request status for : 1
[junit4] 2> 1682478 INFO (TEST-StatsReloadRaceTest.testParallelReloadAndStats-seed#[5E9B7AB8DA0C6961]) [ ] o.a.s.h.a.CoreAdminOperation Checking request status for : 1
[junit4] 2> 1682479 INFO (TEST-StatsReloadRaceTest.testParallelReloadAndStats-seed#[5E9B7AB8DA0C6961]) [ ] o.a.s.h.a.CoreAdminOperation Checking request status for : 1
[junit4] 2> 1682479 INFO (TEST-StatsReloadRaceTest.testParallelReloadAndStats-seed#[5E9B7AB8DA0C6961]) [ ] o.a.s.h.a.CoreAdminOperation Checking request status for : 1
[junit4] 2> 1682479 INFO (TEST-StatsReloadRaceTest.testParallelReloadAndStats-seed#[5E9B7AB8DA0C6961]) [ ] o.a.s.h.a.CoreAdminOperation Checking request status for : 1
[junit4] 2> 1682479 INFO (TEST-StatsReloadRaceTest.testParallelReloadAndStats-seed#[5E9B7AB8DA0C6961]) [ ] o.a.s.h.a.CoreAdminOperation Checking request status for : 1
[junit4] 2> 1682479 INFO (TEST-StatsReloadRaceTest.testParallelReloadAndStats-seed#[5E9B7AB8DA0C6961]) [ ] o.a.s.h.a.CoreAdminOperation Checking request status for : 1
[junit4] 2> 1682480 INFO (TEST-StatsReloadRaceTest.testParallelReloadAndStats-seed#[5E9B7AB8DA0C6961]) [ ] o.a.s.h.a.CoreAdminOperation Checking request status for : 1
[junit4] 2> 1682480 INFO (TEST-StatsReloadRaceTest.testParallelReloadAndStats-seed#[5E9B7AB8DA0C6961]) [ ] o.a.s.h.a.CoreAdminOperation Checking request status for : 1
[junit4] 2> 1682480 INFO (TEST-StatsReloadRaceTest.testParallelReloadAndStats-seed#[5E9B7AB8DA0C6961]) [ ] o.a.s.h.a.CoreAdminOperation Checking request status for : 1
[junit4] 2> 1682480 INFO (TEST-StatsReloadRaceTest.testParallelReloadAndStats-seed#[5E9B7AB8DA0C6961]) [ ] o.a.s.h.a.CoreAdminOperation Checking request status for : 1
[junit4] 2> 1682481 INFO (TEST-StatsReloadRaceTest.testParallelReloadAndStats-seed#[5E9B7AB8DA0C6961]) [ ] o.a.s.h.a.CoreAdminOperation Checking request status for : 1
[junit4] 2> 1682481 INFO (TEST-StatsReloadRaceTest.testParallelReloadAndStats-seed#[5E9B7AB8DA0C6961]) [ ] o.a.s.h.a.CoreAdminOperation Checking request status for : 1
[junit4] 2> 1682481 INFO (TEST-StatsReloadRaceTest.testParallelReloadAndStats-seed#[5E9B7AB8DA0C6961]) [ ] o.a.s.h.a.CoreAdminOperation Checking request status for : 1
[junit4] 2> 1682482 INFO (TEST-StatsReloadRaceTest.testParallelReloadAndStats-seed#[5E9B7AB8DA0C6961]) [ ] o.a.s.h.a.CoreAdminOperation Checking request status for : 1
[junit4] 2> 1682482 INFO (TEST-StatsReloadRaceTest.testParallelReloadAndStats-seed#[5E9B7AB8DA0C6961]) [ ] o.a.s.h.a.CoreAdminOperation Checking request status for : 1
[junit4] 2> 1682482 INFO (TEST-StatsReloadRaceTest.testParallelReloadAndStats-seed#[5E9B7AB8DA0C6961]) [ ] o.a.s.h.a.CoreAdminOperation Checking request status for : 1
[junit4] 2> 1682482 INFO (TEST-StatsReloadRaceTest.testParallelReloadAndStats-seed#[5E9B7AB8DA0C6961]) [ ] o.a.s.h.a.CoreAdminOperation Checking request status for : 1
[junit4] 2> 1682483 INFO (TEST-StatsReloadRaceTest.testParallelReloadAndStats-seed#[5E9B7AB8DA0C6961]) [ ] o.a.s.h.a.CoreAdminOperation Checking request status for : 1
[junit4] 2> 1682483 INFO (TEST-StatsReloadRaceTest.testParallelReloadAndStats-seed#[5E9B7AB8DA0C6961]) [ ] o.a.s.h.a.CoreAdminOperation Checking request status for : 1
[junit4] 2> 1682483 INFO (TEST-StatsReloadRaceTest.testParallelReloadAndStats-seed#[5E9B7AB8DA0C6961]) [ ] o.a.s.h.a.CoreAdminOperation Checking request status for : 1
[junit4] 2> 1682484 INFO (TEST-StatsReloadRaceTest.testParallelReloadAndStats-seed#[5E9B7AB8DA0C6961]) [ ] o.a.s.h.a.CoreAdminOperation Checking request status for : 1
[junit4] 2> 1682484 INFO (TEST-StatsReloadRaceTest.testParallelReloadAndStats-seed#[5E9B7AB8DA0C6961]) [ ] o.a.s.h.a.CoreAdminOperation Checking request status for : 1
[junit4] 2> 1682484 INFO (TEST-StatsReloadRaceTest.testParallelReloadAndStats-seed#[5E9B7AB8DA0C6961]) [ ] o.a.s.h.a.CoreAdminOperation Checking request status for : 1
[junit4] 2> 1682484 INFO (TEST-StatsReloadRaceTest.testParallelReloadAndStats-seed#[5E9B7AB8DA0C6961]) [ ] o.a.s.h.a.CoreAdminOperation Checking request status for : 1
[junit4] 2> 1682485 INFO (TEST-StatsReloadRaceTest.testParallelReloadAndStats-seed#[5E9B7AB8DA0C6961]) [ ] o.a.s.h.a.CoreAdminOperation Checking request status for : 1
[junit4] 2> 1682485 INFO (TEST-StatsReloadRaceTest.testParallelReloadAndStats-seed#[5E9B7AB8DA0C6961]) [ ] o.a.s.h.a.CoreAdminOperation Checking request status for : 1
[junit4] 2> 1682485 INFO (TEST-StatsReloadRaceTest.testParallelReloadAndStats-seed#[5E9B7AB8DA0C6961]) [ ] o.a.s.h.a.CoreAdminOperation Checking request status for : 1
[junit4] 2> 1682485 INFO (TEST-StatsReloadRaceTest.testParallelReloadAndStats-seed#[5E9B7AB8DA0C6961]) [ ] o.a.s.h.a.CoreAdminOperation Checking request status for : 1
[junit4] 2> 1682485 INFO (TEST-StatsReloadRaceTest.testParallelReloadAndStats-seed#[5E9B7AB8DA0C6961]) [ ] o.a.s.h.a.CoreAdminOperation Checking request status for : 1
[junit4] 2> 1682486 INFO (TEST-StatsReloadRaceTest.testParallelReloadAndStats-seed#[5E9B7AB8DA0C6961]) [ ] o.a.s.h.a.CoreAdminOperation Checking request status for : 1
[junit4] 2> 1682486 INFO (TEST-StatsReloadRaceTest.testParallelReloadAndStats-seed#[5E9B7AB8DA0C6961]) [ ] o.a.s.h.a.CoreAdminOperation Checking request status for : 1
[junit4] 2> 1682486 INFO (TEST-StatsReloadRaceTest.testParallelReloadAndStats-seed#[5E9B7AB8DA0C6961]) [ ] o.a.s.h.a.CoreAdminOperation Checking request status for : 1
[junit4] 2> 1682486 INFO (TEST-StatsReloadRaceTest.testParallelReloadAndStats-seed#[5E9B7AB8DA0C6961]) [ ] o.a.s.h.a.CoreAdminOperation Checking request status for : 1
[junit4] 2> 1682486 INFO (TEST-StatsReloadRaceTest.testParallelReloadAndStats-seed#[5E9B7AB8DA0C6961]) [ ] o.a.s.h.a.CoreAdminOperation Checking request status for : 1
[junit4] 2> 1682486 INFO (TEST-StatsReloadRaceTest.testParallelReloadAndStats-seed#[5E9B7AB8DA0C6961]) [ ] o.a.s.h.a.CoreAdminOperation Checking request status for : 1
[junit4] 2> 1682487 INFO (TEST-StatsReloadRaceTest.testParallelReloadAndStats-seed#[5E9B7AB8DA0C6961]) [ ] o.a.s.h.a.CoreAdminOperation Checking request status for : 1
[junit4] 2> 1682487 INFO (TEST-StatsReloadRaceTest.testParallelReloadAndStats-seed#[5E9B7AB8DA0C6961]) [ ] o.a.s.h.a.CoreAdminOperation Checking request status for : 1
[junit4] 2> 1682487 INFO (TEST-StatsReloadRaceTest.testParallelReloadAndStats-seed#[5E9B7AB8DA0C6961]) [ ] o.a.s.h.a.CoreAdminOperation Checking request status for : 1
[junit4] 2> 1682487 INFO (TEST-StatsReloadRaceTest.testParallelReloadAndStats-seed#[5E9B7AB8DA0C6961]) [ ] o.a.s.h.a.CoreAdminOperation Checking request status for : 1
[junit4] 2> 1682488 INFO (TEST-StatsReloadRaceTest.testParallelReloadAndStats-seed#[5E9B7AB8DA0C6961]) [ ] o.a.s.h.a.CoreAdminOperation Checking request status for : 1
[junit4] 2> 1682488 INFO (TEST-StatsReloadRaceTest.testParallelReloadAndStats-seed#[5E9B7AB8DA0C6961]) [ ] o.a.s.h.a.CoreAdminOperation Checking request status for : 1
[junit4] 2> 1682488 INFO (TEST-StatsReloadRaceTest.testParallelReloadAndStats-seed#[5E9B7AB8DA0C6961]) [ ] o.a.s.h.a.CoreAdminOperation Checking request status for : 1
[junit4] 2> 1682488 INFO (TEST-StatsReloadRaceTest.testParallelReloadAndStats-seed#[5E9B7AB8DA0C6961]) [ ] o.a.s.h.a.CoreAdminOperation Checking request status for : 1
[junit4] 2> 1682489 INFO (TEST-StatsReloadRaceTest.testParallelReloadAndStats-seed#[5E9B7AB8DA0C6961]) [ ] o.a.s.h.a.CoreAdminOperation Checking request status for : 1
[junit4] 2> 1682489 INFO (TEST-StatsReloadRaceTest.testParallelReloadAndStats-seed#[5E9B7AB8DA0C6961]) [ ] o.a.s.h.a.CoreAdminOperation Checking request status for : 1
[junit4] 2> 1682489 INFO (TEST-StatsReloadRaceTest.testParallelReloadAndStats-seed#[5E9B7AB8DA0C6961]) [ ] o.a.s.h.a.CoreAdminOperation Checking request status for : 1
[junit4] 2> 1682489 INFO (TEST-StatsReloadRaceTest.testParallelReloadAndStats-seed#[5E9B7AB8DA0C6961]) [ ] o.a.s.h.a.CoreAdminOperation Checking request status for : 1
[junit4] 2> 1682490 INFO (TEST-StatsReloadRaceTest.testParallelReloadAndStats-seed#[5E9B7AB8DA0C6961]) [ ] o.a.s.h.a.CoreAdminOperation Checking request status for : 1
[junit4] 2> 1682490 INFO (TEST-StatsReloadRaceTest.testParallelReloadAndStats-seed#[5E9B7AB8DA0C6961]) [ ] o.a.s.h.a.CoreAdminOperation Checking request status for : 1
[junit4] 2> 1682490 INFO (TEST-StatsReloadRaceTest.testParallelReloadAndStats-seed#[5E9B7AB8DA0C6961]) [ ] o.a.s.h.a.CoreAdminOperation Checking request status for : 1
[junit4] 2> 1682491 INFO (TEST-StatsReloadRaceTest.testParallelReloadAndStats-seed#[5E9B7AB8DA0C6961]) [ ] o.a.s.h.a.CoreAdminOperation Checking request status for : 1
[junit4] 2> 1682491 INFO (TEST-StatsReloadRaceTest.testParallelReloadAndStats-seed#[5E9B7AB8DA0C6961]) [ ] o.a.s.h.a.CoreAdminOperation Checking request status for : 1
[junit4] 2> 1682491 INFO (TEST-StatsReloadRaceTest.testParallelReloadAndStats-seed#[5E9B7AB8DA0C6961]) [ ] o.a.s.h.a.CoreAdminOperation Checking request status for : 1
[junit4] 2> 1682492 INFO (TEST-StatsReloadRaceTest.testParallelReloadAndStats-seed#[5E9B7AB8DA0C6961]) [ ] o.a.s.h.a.CoreAdminOperation Checking request status for : 1
[junit4] 2> 1682492 INFO (TEST-StatsReloadRaceTest.testParallelReloadAndStats-seed#[5E9B7AB8DA0C6961]) [ ] o.a.s.h.a.CoreAdminOperation Checking request status for : 1
[junit4] 2> 1682492 INFO (TEST-StatsReloadRaceTest.testParallelReloadAndStats-seed#[5E9B7AB8DA0C6961]) [ ] o.a.s.h.a.CoreAdminOperation Checking request status for : 1
[junit4] 2> 1682492 INFO (TEST-StatsReloadRaceTest.testParallelReloadAndStats-seed#[5E9B7AB8DA0C6961]) [ ] o.a.s.h.a.CoreAdminOperation Checking request status for : 1
[junit4] 2> 1682492 INFO (parallelCoreAdminExecutor-8117-thread-1) [ ] o.a.s.s.IndexSchema [collection1] Schema name=test
[junit4] 2> 1682492 INFO (TEST-StatsReloadRaceTest.testParallelReloadAndStats-seed#[5E9B7AB8DA0C6961]) [ ] o.a.s.h.a.CoreAdminOperation Checking request status for : 1
[junit4] 2> 1682493 INFO (TEST-StatsReloadRaceTest.testParallelReloadAndStats-seed#[5E9B7AB8DA0C6961]) [ ] o.a.s.h.a.CoreAdminOperation Checking request status for : 1
[junit4] 2> 1682493 INFO (TEST-StatsReloadRaceTest.testParallelReloadAndStats-seed#[5E9B7AB8DA0C6961]) [ ] o.a.s.h.a.CoreAdminOperation Checking request status for : 1
[junit4] 2> 1682493 INFO (TEST-StatsReloadRaceTest.testParallelReloadAndStats-seed#[5E9B7AB8DA0C6961]) [ ] o.a.s.h.a.CoreAdminOperation Checking request status for : 1
[junit4] 2> 1682493 INFO (TEST-StatsReloadRaceTest.testParallelReloadAndStats-seed#[5E9B7AB8DA0C6961]) [ ] o.a.s.h.a.CoreAdminOperation Checking request status for : 1
[junit4] 2> 1682493 INFO (TEST-StatsReloadRaceTest.testParallelReloadAndStats-seed#[5E9B7AB8DA0C6961]) [ ] o.a.s.h.a.CoreAdminOperation Checking request status for : 1
[junit4] 2> 1682493 INFO (TEST-StatsReloadRaceTest.testParallelReloadAndStats-seed#[5E9B7AB8DA0C6961]) [ ] o.a.s.h.a.CoreAdminOperation Checking request status for : 1
[junit4] 2> 1682494 INFO (TEST-StatsReloadRaceTest.testParallelReloadAndStats-seed#[5E9B7AB8DA0C6961]) [ ] o.a.s.h.a.CoreAdminOperation Checking request status for : 1
[junit4] 2> 1682494 INFO (TEST-StatsReloadRaceTest.testParallelReloadAndStats-seed#[5E9B7AB8DA0C6961]) [ ] o.a.s.h.a.CoreAdminOperation Checking request status for : 1
[junit4] 2> 1682495 INFO (TEST-StatsReloadRaceTest.testParallelReloadAndStats-seed#[5E9B7AB8DA0C6961]) [ ] o.a.s.h.a.CoreAdminOperation Checking request status for : 1
[junit4] 2> 1682495 INFO (TEST-StatsReloadRaceTest.testParallelReloadAndStats-seed#[5E9B7AB8DA0C6961]) [ ] o.a.s.h.a.CoreAdminOperation Checking request status for : 1
[junit4] 2> 1682495 INFO (TEST-StatsReloadRaceTest.testParallelReloadAndStats-seed#[5E9B7AB8DA0C6961]) [ ] o.a.s.h.a.CoreAdminOperation Checking request status for : 1
[junit4] 2> 1682495 INFO (TEST-StatsReloadRaceTest.testParallelReloadAndStats-seed#[5E9B7AB8DA0C6961]) [ ] o.a.s.h.a.CoreAdminOperation Checking request status for : 1
[junit4] 2> 1682495 INFO (TEST-StatsReloadRaceTest.testParallelReloadAndStats-seed#[5E9B7AB8DA0C6961]) [ ] o.a.s.h.a.CoreAdminOperation Checking request status for : 1
[junit4] 2> 1682496 INFO (TEST-StatsReloadRaceTest.testParallelReloadAndStats-seed#[5E9B7AB8DA0C6961]) [ ] o.a.s.h.a.CoreAdminOperation Checking request status for : 1
[junit4] 2> 1682496 INFO (TEST-StatsReloadRaceTest.testParallelReloadAndStats-seed#[5E9B7AB8DA0C6961]) [ ] o.a.s.h.a.CoreAdminOperation Checking request status for : 1
[junit4] 2> 1682496 INFO (TEST-StatsReloadRaceTest.testParallelReloadAndStats-seed#[5E9B7AB8DA0C6961]) [ ] o.a.s.h.a.CoreAdminOperation Checking request status for : 1
[junit4] 2> 1682496 INFO (TEST-StatsReloadRaceTest.testParallelReloadAndStats-seed#[5E9B7AB8DA0C6961]) [ ] o.a.s.h.a.CoreAdminOperation Checking request status for : 1
[junit4] 2> 1682497 INFO (TEST-StatsReloadRaceTest.testParallelReloadAndStats-seed#[5E9B7AB8DA0C6961]) [ ] o.a.s.h.a.CoreAdminOperation Checking request status for : 1
[junit4] 2> 1682497 INFO (TEST-StatsReloadRaceTest.testParallelReloadAndStats-seed#[5E9B7AB8DA0C6961]) [ ] o.a.s.h.a.CoreAdminOperation Checking request status for : 1
[junit4] 2> 1682497 INFO (TEST-StatsReloadRaceTest.testParallelReloadAndStats-seed#[5E9B7AB8DA0C6961]) [ ] o.a.s.h.a.CoreAdminOperation Checking request status for : 1
[junit4] 2> 1682497 INFO (TEST-StatsReloadRaceTest.testParallelReloadAndStats-seed#[5E9B7AB8DA0C6961]) [ ] o.a.s.h.a.CoreAdminOperation Checking request status for : 1
[junit4] 2> 1682497 INFO (TEST-StatsReloadRaceTest.testParallelReloadAndStats-seed#[5E9B7AB8DA0C6961]) [ ] o.a.s.h.a.CoreAdminOperation Checking request status for : 1
[junit4] 2> 1682498 INFO (TEST-StatsReloadRaceTest.testParallelReloadAndStats-seed#[5E9B7AB8DA0C6961]) [ ] o.a.s.h.a.CoreAdminOperation Checking request status for : 1
[junit4] 2> 1682498 INFO (TEST-StatsReloadRaceTest.testParallelReloadAndStats-seed#[5E9B7AB8DA0C6961]) [ ] o.a.s.h.a.CoreAdminOperation Checking request status for : 1
[junit4] 2> 1682499 INFO (TEST-StatsReloadRaceTest.testParallelReloadAndStats-seed#[5E9B7AB8DA0C6961]) [ ] o.a.s.h.a.CoreAdminOperation Checking request status for : 1
[junit4] 2> 1682499 INFO (TEST-StatsReloadRaceTest.testParallelReloadAndStats-seed#[5E9B7AB8DA0C6961]) [ ] o.a.s.h.a.CoreAdminOperation Checking request status for : 1
[junit4] 2> 1682499 INFO (TEST-StatsReloadRaceTest.testParallelReloadAndStats-seed#[5E9B7AB8DA0C6961]) [ ] o.a.s.h.a.CoreAdminOperation Checking request status for : 1
[junit4] 2> 1682499 INFO (TEST-StatsReloadRaceTest.testParallelReloadAndStats-seed#[5E9B7AB8DA0C6961]) [ ] o.a.s.h.a.CoreAdminOperation Checking request status for : 1
[junit4] 2> 1682499 INFO (TEST-StatsReloadRaceTest.testParallelReloadAndStats-seed#[5E9B7AB8DA0C6961]) [ ] o.a.s.h.a.CoreAdminOperation Checking request status for : 1
[junit4] 2> 1682500 INFO (TEST-StatsReloadRaceTest.testParallelReloadAndStats-seed#[5E9B7AB8DA0C6961]) [ ] o.a.s.h.a.CoreAdminOperation Checking request status for : 1
[junit4] 2> 1682500 INFO (TEST-StatsReloadRaceTest.testParallelReloadAndStats-seed#[5E9B7AB8DA0C6961]) [ ] o.a.s.h.a.CoreAdminOperation Checking request status for : 1
[junit4] 2> 1682500 INFO (TEST-StatsReloadRaceTest.testParallelReloadAndStats-seed#[5E9B7AB8DA0C6961]) [ ] o.a.s.h.a.CoreAdminOperation Checking request status for : 1
[junit4] 2> 1682501 INFO (TEST-StatsReloadRaceTest.testParallelReloadAndStats-seed#[5E9B7AB8DA0C6961]) [ ] o.a.s.h.a.CoreAdminOperation Checking request status for : 1
[junit4] 2> 1682501 INFO (TEST-StatsReloadRaceTest.testParallelReloadAndStats-seed#[5E9B7AB8DA0C6961]) [ ] o.a.s.h.a.CoreAdminOperation Checking request status for : 1
[junit4] 2> 1682501 INFO (TEST-StatsReloadRaceTest.testParallelReloadAndStats-seed#[5E9B7AB8DA0C6961]) [ ] o.a.s.h.a.CoreAdminOperation Checking request status for : 1
[junit4] 2> 1682501 INFO (TEST-StatsReloadRaceTest.testParallelReloadAndStats-seed#[5E9B7AB8DA0C6961]) [ ] o.a.s.h.a.CoreAdminOperation Checking request status for : 1
[junit4] 2> 1682501 INFO (TEST-StatsReloadRaceTest.testParallelReloadAndStats-seed#[5E9B7AB8DA0C6961]) [ ] o.a.s.h.a.CoreAdminOperation Checking request status for : 1
[junit4] 2> 1682502 INFO (TEST-StatsReloadRaceTest.testParallelReloadAndStats-seed#[5E9B7AB8DA0C6961]) [ ] o.a.s.h.a.CoreAdminOperation Checking request status for : 1
[junit4] 2> 1682502 INFO (TEST-StatsReloadRaceTest.testParallelReloadAndStats-seed#[5E9B7AB8DA0C6961]) [ ] o.a.s.h.a.CoreAdminOperation Checking request status for : 1
[junit4] 2> 1682502 INFO (TEST-StatsReloadRaceTest.testParallelReloadAndStats-seed#[5E9B7AB8DA0C6961]) [ ] o.a.s.h.a.CoreAdminOperation Checking request status for : 1
[junit4] 2> 1682503 INFO (TEST-StatsReloadRaceTest.testParallelReloadAndStats-seed#[5E9B7AB8DA0C6961]) [ ] o.a.s.h.a.CoreAdminOperation Checking request status for : 1
[junit4] 2> 1682503 INFO (TEST-StatsReloadRaceTest.testParallelReloadAndStats-seed#[5E9B7AB8DA0C6961]) [ ] o.a.s.h.a.CoreAdminOperation Checking request status for : 1
[junit4] 2> 1682503 INFO (TEST-StatsReloadRaceTest.testParallelReloadAndStats-seed#[5E9B7AB8DA0C6961]) [ ] o.a.s.h.a.CoreAdminOperation Checking request status for : 1
[junit4] 2> 1682504 INFO (TEST-StatsReloadRaceTest.testParallelReloadAndStats-seed#[5E9B7AB8DA0C6961]) [ ] o.a.s.h.a.CoreAdminOperation Checking request status for : 1
[junit4] 2> 1682504 INFO (TEST-StatsReloadRaceTest.testParallelReloadAndStats-seed#[5E9B7AB8DA0C6961]) [ ] o.a.s.h.a.CoreAdminOperation Checking request status for : 1
[junit4] 2> 1682504 INFO (TEST-StatsReloadRaceTest.testParallelReloadAndStats-seed#[5E9B7AB8DA0C6961]) [ ] o.a.s.h.a.CoreAdminOperation Checking request status for : 1
[junit4] 2> 1682504 INFO (TEST-StatsReloadRaceTest.testParallelReloadAndStats-seed#[5E9B7AB8DA0C6961]) [ ] o.a.s.h.a.CoreAdminOperation Checking request status for : 1
[junit4] 2> 1682504 INFO (TEST-StatsReloadRaceTest.testParallelReloadAndStats-seed#[5E9B7AB8DA0C6961]) [ ] o.a.s.h.a.CoreAdminOperation Checking request status for : 1
[junit4] 2> 1682505 INFO (TEST-StatsReloadRaceTest.testParallelReloadAndStats-seed#[5E9B7AB8DA0C6961]) [ ] o.a.s.h.a.CoreAdminOperation Checking request status for : 1
[junit4] 2> 1682505 INFO (TEST-StatsReloadRaceTest.testParallelReloadAndStats-seed#[5E9B7AB8DA0C6961]) [ ] o.a.s.h.a.CoreAdminOperation Checking request status for : 1
[junit4] 2> 1682510 INFO (TEST-StatsReloadRaceTest.testParallelReloadAndStats-seed#[5E9B7AB8DA0C6961]) [ ] o.a.s.h.a.CoreAdminOperation Checking request status for : 1
[junit4] 2> 1682511 INFO (TEST-StatsReloadRaceTest.testParallelReloadAndStats-seed#[5E9B7AB8DA0C6961]) [ ] o.a.s.h.a.CoreAdminOperation Checking request status for : 1
[junit4] 2> 1682511 INFO (TEST-StatsReloadRaceTest.testParallelReloadAndStats-seed#[5E9B7AB8DA0C6961]) [ ] o.a.s.h.a.CoreAdminOperation Checking request status for : 1
[junit4] 2> 1682511 INFO (TEST-StatsReloadRaceTest.testParallelReloadAndStats-seed#[5E9B7AB8DA0C6961]) [ ] o.a.s.h.a.CoreAdminOperation Checking request status for : 1
[junit4] 2> 1682511 INFO (TEST-StatsReloadRaceTest.testParallelReloadAndStats-seed#[5E9B7AB8DA0C6961]) [ ] o.a.s.h.a.CoreAdminOperation Checking request status for : 1
[junit4] 2> 1682512 INFO (TEST-StatsReloadRaceTest.testParallelReloadAndStats-seed#[5E9B7AB8DA0C6961]) [ ] o.a.s.h.a.CoreAdminOperation Checking request status for : 1
[junit4] 2> 1682512 INFO (TEST-StatsReloadRaceTest.testParallelReloadAndStats-seed#[5E9B7AB8DA0C6961]) [ ] o.a.s.h.a.CoreAdminOperation Checking request status for : 1
[junit4] 2> 1682512 INFO (TEST-StatsReloadRaceTest.testParallelReloadAndStats-seed#[5E9B7AB8DA0C6961]) [ ] o.a.s.h.a.CoreAdminOperation Checking request status for : 1
[junit4] 2> 1682512 INFO (TEST-StatsReloadRaceTest.testParallelReloadAndStats-seed#[5E9B7AB8DA0C6961]) [ ] o.a.s.h.a.CoreAdminOperation Checking request status for : 1
[junit4] 2> 1682513 INFO (TEST-StatsReloadRaceTest.testParallelReloadAndStats-seed#[5E9B7AB8DA0C6961]) [ ] o.a.s.h.a.CoreAdminOperation Checking request status for : 1
[junit4] 2> 1682513 INFO (TEST-StatsReloadRaceTest.testParallelReloadAndStats-seed#[5E9B7AB8DA0C6961]) [ ] o.a.s.h.a.CoreAdminOperation Checking request status for : 1
[junit4] 2> 1682514 INFO (TEST-StatsReloadRaceTest.testParallelReloadAndStats-seed#[5E9B7AB8DA0C6961]) [ ] o.a.s.h.a.CoreAdminOperation Checking request status for : 1
[junit4] 2> 1682515 INFO (TEST-StatsReloadRaceTest.testParallelReloadAndStats-seed#[5E9B7AB8DA0C6961]) [ ] o.a.s.h.a.CoreAdminOperation Checking request status for : 1
[junit4] 2> 1682515 INFO (TEST-StatsReloadRaceTest.testParallelReloadAndStats-seed#[5E9B7AB8DA0C6961]) [ ] o.a.s.h.a.CoreAdminOperation Checking request status for : 1
[junit4] 2> 1682516 INFO (TEST-StatsReloadRaceTest.testParallelReloadAndStats-seed#[5E9B7AB8DA0C6961]) [ ] o.a.s.h.a.CoreAdminOperation Checking request status for : 1
[junit4] 2> 1682516 INFO (TEST-StatsReloadRaceTest.testParallelReloadAndStats-seed#[5E9B7AB8DA0C6961]) [ ] o.a.s.h.a.CoreAdminOperation Checking request status for : 1
[junit4] 2> 1682516 INFO (TEST-StatsReloadRaceTest.testParallelReloadAndStats-seed#[5E9B7AB8DA0C6961]) [ ] o.a.s.h.a.CoreAdminOperation Checking request status for : 1
[junit4] 2> 1682516 INFO (TEST-StatsReloadRaceTest.testParallelReloadAndStats-seed#[5E9B7AB8DA0C6961]) [ ] o.a.s.h.a.CoreAdminOperation Checking request status for : 1
[junit4] 2> 1682517 INFO (TEST-StatsReloadRaceTest.testParallelReloadAndStats-seed#[5E9B7AB8DA0C6961]) [ ] o.a.s.h.a.CoreAdminOperation Checking request status for : 1
[junit4] 2> 1682517 INFO (TEST-StatsReloadRaceTest.testParallelReloadAndStats-seed#[5E9B7AB8DA0C6961]) [ ] o.a.s.h.a.CoreAdminOperation Checking request status for : 1
[junit4] 2> 1682517 INFO (TEST-StatsReloadRaceTest.testParallelReloadAndStats-seed#[5E9B7AB8DA0C6961]) [ ] o.a.s.h.a.CoreAdminOperation Checking request status for : 1
[junit4] 2> 1682518 INFO (TEST-StatsReloadRaceTest.testParallelReloadAndStats-seed#[5E9B7AB8DA0C6961]) [ ] o.a.s.h.a.CoreAdminOperation Checking request status for : 1
[junit4] 2> 1682518 INFO (TEST-StatsReloadRaceTest.testParallelReloadAndStats-seed#[5E9B7AB8DA0C6961]) [ ] o.a.s.h.a.CoreAdminOperation Checking request status for : 1
[junit4] 2> 1682518 INFO (TEST-StatsReloadRaceTest.testParallelReloadAndStats-seed#[5E9B7AB8DA0C6961]) [ ] o.a.s.h.a.CoreAdminOperation Checking request status for : 1
[junit4] 2> 1682518 INFO (TEST-StatsReloadRaceTest.testParallelReloadAndStats-seed#[5E9B7AB8DA0C6961]) [ ] o.a.s.h.a.CoreAdminOperation Checking request status for : 1
[junit4] 2> 1682519 INFO (TEST-StatsReloadRaceTest.testParallelReloadAndStats-seed#[5E9B7AB8DA0C6961]) [ ] o.a.s.h.a.CoreAdminOperation Checking request status for : 1
[junit4] 2> 1682519 INFO (TEST-StatsReloadRaceTest.testParallelReloadAndStats-seed#[5E9B7AB8DA0C6961]) [ ] o.a.s.h.a.CoreAdminOperation Checking request status for : 1
[junit4] 2> 1682519 INFO (TEST-StatsReloadRaceTest.testParallelReloadAndStats-seed#[5E9B7AB8DA0C6961]) [ ] o.a.s.h.a.CoreAdminOperation Checking request status for : 1
[junit4] 2> 1682519 INFO (TEST-StatsReloadRaceTest.testParallelReloadAndStats-seed#[5E9B7AB8DA0C6961]) [ ] o.a.s.h.a.CoreAdminOperation Checking request status for : 1
[junit4] 2> 1682519 INFO (TEST-StatsReloadRaceTest.testParallelReloadAndStats-seed#[5E9B7AB8DA0C6961]) [ ] o.a.s.h.a.CoreAdminOperation Checking request status for : 1
[junit4] 2> 1682519 INFO (TEST-StatsReloadRaceTest.testParallelReloadAndStats-seed#[5E9B7AB8DA0C6961]) [ ] o.a.s.h.a.CoreAdminOperation Checking request status for : 1
[junit4] 2> 1682520 INFO (TEST-StatsReloadRaceTest.testParallelReloadAndStats-seed#[5E9B7AB8DA0C6961]) [ ] o.a.s.h.a.CoreAdminOperation Checking request status for : 1
[junit4] 2> 1682520 INFO (TEST-StatsReloadRaceTest.testParallelReloadAndStats-seed#[5E9B7AB8DA0C6961]) [ ] o.a.s.h.a.CoreAdminOperation Checking request status for : 1
[junit4] 2> 1682520 INFO (TEST-StatsReloadRaceTest.testParallelReloadAndStats-seed#[5E9B7AB8DA0C6961]) [ ] o.a.s.h.a.CoreAdminOperation Checking request status for : 1
[junit4] 2> 1682521 INFO (TEST-StatsReloadRaceTest.testParallelReloadAndStats-seed#[5E9B7AB8DA0C6961]) [ ] o.a.s.h.a.CoreAdminOperation Checking request status for : 1
[junit4] 2> 1682521 INFO (TEST-StatsReloadRaceTest.testParallelReloadAndStats-seed#[5E9B7AB8DA0C6961]) [ ] o.a.s.h.a.CoreAdminOperation Checking request status for : 1
[junit4] 2> 1682521 INFO (TEST-StatsReloadRaceTest.testParallelReloadAndStats-seed#[5E9B7AB8DA0C6961]) [ ] o.a.s.h.a.CoreAdminOperation Checking request status for : 1
[junit4] 2> 1682521 INFO (TEST-StatsReloadRaceTest.testParallelReloadAndStats-seed#[5E9B7AB8DA0C6961]) [ ] o.a.s.h.a.CoreAdminOperation Checking request status for : 1
[junit4] 2> 1682521 INFO (TEST-StatsReloadRaceTest.testParallelReloadAndStats-seed#[5E9B7AB8DA0C6961]) [ ] o.a.s.h.a.CoreAdminOperation Checking request status for : 1
[junit4] 2> 1682521 INFO (TEST-StatsReloadRaceTest.testParallelReloadAndStats-seed#[5E9B7AB8DA0C6961]) [ ] o.a.s.h.a.CoreAdminOperation Checking request status for : 1
[junit4] 2> 1682522 INFO (TEST-StatsReloadRaceTest.testParallelReloadAndStats-seed#[5E9B7AB8DA0C6961]) [ ] o.a.s.h.a.CoreAdminOperation Checking request status for : 1
[junit4] 2> 1682522 INFO (TEST-StatsReloadRaceTest.testParallelReloadAndStats-seed#[5E9B7AB8DA0C6961]) [ ] o.a.s.h.a.CoreAdminOperation Checking request status for : 1
[junit4] 2> 1682522 INFO (TEST-StatsReloadRaceTest.testParallelReloadAndStats-seed#[5E9B7AB8DA0C6961]) [ ] o.a.s.h.a.CoreAdminOperation Checking request status for : 1
[junit4] 2> 1682523 INFO (TEST-StatsReloadRaceTest.testParallelReloadAndStats-seed#[5E9B7AB8DA0C6961]) [ ] o.a.s.h.a.CoreAdminOperation Checking request status for : 1
[junit4] 2> 1682523 INFO (TEST-StatsReloadRaceTest.testParallelReloadAndStats-seed#[5E9B7AB8DA0C6961]) [ ] o.a.s.h.a.CoreAdminOperation Checking request status for : 1
[junit4] 2> 1682523 INFO (TEST-StatsReloadRaceTest.testParallelReloadAndStats-seed#[5E9B7AB8DA0C6961]) [ ] o.a.s.h.a.CoreAdminOperation Checking request status for : 1
[junit4] 2> 1682523 INFO (TEST-StatsReloadRaceTest.testParallelReloadAndStats-seed#[5E9B7AB8DA0C6961]) [ ] o.a.s.h.a.CoreAdminOperation Checking request status for : 1
[junit4] 2> 1682523 INFO (TEST-StatsReloadRaceTest.testParallelReloadAndStats-seed#[5E9B7AB8DA0C6961]) [ ] o.a.s.h.a.CoreAdminOperation Checking request status for : 1
[junit4] 2> 1682523 INFO (TEST-StatsReloadRaceTest.testParallelReloadAndStats-seed#[5E9B7AB8DA0C6961]) [ ] o.a.s.h.a.CoreAdminOperation Checking request status for : 1
[junit4] 2> 1682524 INFO (TEST-StatsReloadRaceTest.testParallelReloadAndStats-seed#[5E9B7AB8DA0C6961]) [ ] o.a.s.h.a.CoreAdminOperation Checking request status for : 1
[junit4] 2> 1682524 INFO (TEST-StatsReloadRaceTest.testParallelReloadAndStats-seed#[5E9B7AB8DA0C6961]) [ ] o.a.s.h.a.CoreAdminOperation Checking request status for : 1
[junit4] 2> 1682524 INFO (TEST-StatsReloadRaceTest.testParallelReloadAndStats-seed#[5E9B7AB8DA0C6961]) [ ] o.a.s.h.a.CoreAdminOperation Checking request status for : 1
[junit4] 2> 1682525 INFO (TEST-StatsReloadRaceTest.testParallelReloadAndStats-seed#[5E9B7AB8DA0C6961]) [ ] o.a.s.h.a.CoreAdminOperation Checking request status for : 1
[junit4] 2> 168
[...truncated too long message...]
1683556 INFO (parallelCoreAdminExecutor-8117-thread-3) [ ] o.a.s.s.SolrIndexSearcher Opening [Searcher@43d171e8[collection1] main]
[junit4] 2> 1683556 INFO (parallelCoreAdminExecutor-8117-thread-3) [ ] o.a.s.c.SolrCore [collection1] CLOSING SolrCore org.apache.solr.core.SolrCore@20bab941
[junit4] 2> 1683556 INFO (parallelCoreAdminExecutor-8117-thread-3) [ ] o.a.s.m.SolrMetricManager Closing metric reporters for registry=solr.core.collection1, tag=549108033
[junit4] 2> 1683557 INFO (searcherExecutor-8132-thread-1) [ ] o.a.s.c.SolrCore [collection1] Registered new searcher Searcher@43d171e8[collection1] main{ExitableDirectoryReader(UninvertingDirectoryReader(Uninverting(_0(7.0.0):c31)))}
[junit4] 2> 1693562 INFO (TEST-StatsReloadRaceTest.testParallelReloadAndStats-seed#[5E9B7AB8DA0C6961]) [ ] o.a.s.SolrTestCaseJ4 ###Ending testParallelReloadAndStats
[junit4] 2> NOTE: reproduce with: ant test -Dtestcase=StatsReloadRaceTest -Dtests.method=testParallelReloadAndStats -Dtests.seed=5E9B7AB8DA0C6961 -Dtests.multiplier=3 -Dtests.slow=true -Dtests.locale=en-IL -Dtests.timezone=America/Montevideo -Dtests.asserts=true -Dtests.file.encoding=UTF-8
[junit4] FAILURE 11.2s J0 | StatsReloadRaceTest.testParallelReloadAndStats <<<
[junit4] > Throwable #1: java.lang.AssertionError: Key SEARCHER.searcher.indexVersion not found in registry solr.core.collection1
[junit4] > at __randomizedtesting.SeedInfo.seed([5E9B7AB8DA0C6961:91051F8155FD013E]:0)
[junit4] > at org.apache.solr.handler.admin.StatsReloadRaceTest.requestMetrics(StatsReloadRaceTest.java:132)
[junit4] > at org.apache.solr.handler.admin.StatsReloadRaceTest.testParallelReloadAndStats(StatsReloadRaceTest.java:70)
[junit4] > at java.base/jdk.internal.reflect.NativeMethodAccessorImpl.invoke0(Native Method)
[junit4] > at java.base/jdk.internal.reflect.NativeMethodAccessorImpl.invoke(NativeMethodAccessorImpl.java:62)
[junit4] > at java.base/jdk.internal.reflect.DelegatingMethodAccessorImpl.invoke(DelegatingMethodAccessorImpl.java:43)
[junit4] > at java.base/java.lang.reflect.Method.invoke(Method.java:563)
[junit4] > at java.base/java.lang.Thread.run(Thread.java:844)
[junit4] 2> 1693563 INFO (SUITE-StatsReloadRaceTest-seed#[5E9B7AB8DA0C6961]-worker) [ ] o.a.s.SolrTestCaseJ4 ###deleteCore
[junit4] 2> 1693563 INFO (SUITE-StatsReloadRaceTest-seed#[5E9B7AB8DA0C6961]-worker) [ ] o.a.s.c.CoreContainer Shutting down CoreContainer instance=1951280645
[junit4] 2> 1693563 INFO (SUITE-StatsReloadRaceTest-seed#[5E9B7AB8DA0C6961]-worker) [ ] o.a.s.m.SolrMetricManager Closing metric reporters for registry=solr.node, tag=null
[junit4] 2> 1693564 INFO (SUITE-StatsReloadRaceTest-seed#[5E9B7AB8DA0C6961]-worker) [ ] o.a.s.m.SolrMetricManager Closing metric reporters for registry=solr.jvm, tag=null
[junit4] 2> 1693565 INFO (SUITE-StatsReloadRaceTest-seed#[5E9B7AB8DA0C6961]-worker) [ ] o.a.s.m.SolrMetricManager Closing metric reporters for registry=solr.jetty, tag=null
[junit4] 2> 1693565 INFO (SUITE-StatsReloadRaceTest-seed#[5E9B7AB8DA0C6961]-worker) [ ] o.a.s.c.TransientSolrCoreCacheDefault Allocating transient cache for 2147483647 transient cores
[junit4] 2> 1693565 INFO (coreCloseExecutor-8136-thread-1) [ ] o.a.s.c.SolrCore [collection1] CLOSING SolrCore org.apache.solr.core.SolrCore@21852512
[junit4] 2> 1693566 INFO (coreCloseExecutor-8136-thread-1) [ ] o.a.s.m.SolrMetricManager Closing metric reporters for registry=solr.core.collection1, tag=562373906
[junit4] 2> NOTE: leaving temporary files on disk at: /home/jenkins/workspace/Lucene-Solr-master-Linux/solr/build/solr-core/test/J0/temp/solr.handler.admin.StatsReloadRaceTest_5E9B7AB8DA0C6961-001
[junit4] 2> NOTE: test params are: codec=Asserting(Lucene70): {name_s=PostingsFormat(name=LuceneFixedGap), range_facet_l_dv=PostingsFormat(name=MockRandom), multiDefault=Lucene50(blocksize=128), intDefault=BlockTreeOrds(blocksize=128), id=PostingsFormat(name=MockRandom), range_facet_i_dv=BlockTreeOrds(blocksize=128), range_facet_l=BlockTreeOrds(blocksize=128), timestamp=BlockTreeOrds(blocksize=128)}, docValues:{range_facet_l_dv=DocValuesFormat(name=Direct), _version_=DocValuesFormat(name=Memory), range_facet_i_dv=DocValuesFormat(name=Memory), intDvoDefault=DocValuesFormat(name=Asserting), timestamp=DocValuesFormat(name=Memory)}, maxPointsInLeafNode=432, maxMBSortInHeap=5.612018924117055, sim=RandomSimilarity(queryNorm=false): {}, locale=en-IL, timezone=America/Montevideo
[junit4] 2> NOTE: Linux 4.4.0-72-generic amd64/Oracle Corporation 9-ea (64-bit)/cpus=12,threads=1,free=272931048,total=532676608
[junit4] 2> NOTE: All tests run in this JVM: [DistributedFacetPivotWhiteBoxTest, TestRangeQuery, StandardRequestHandlerTest, TestInfoStreamLogging, CacheHeaderTest, TestUseDocValuesAsStored2, TestDocumentBuilder, TestBadConfig, CursorMarkTest, TestRTimerTree, DocValuesNotIndexedTest, TestSortByMinMaxFunction, HdfsRecoverLeaseTest, RankQueryTest, SolrShardReporterTest, TimeZoneUtilsTest, BadCopyFieldTest, CustomCollectionTest, FileBasedSpellCheckerTest, ClassificationUpdateProcessorIntegrationTest, URLClassifyProcessorTest, TestGraphMLResponseWriter, TestCryptoKeys, TestDocTermOrds, UUIDFieldTest, JavabinLoaderTest, BlockJoinFacetRandomTest, TestNumericTerms64, ConfigureRecoveryStrategyTest, TestSearcherReuse, BitVectorTest, TestChildDocTransformer, DistributedExpandComponentTest, PolyFieldTest, TestQueryWrapperFilter, LeaderElectionContextKeyTest, TestDFISimilarityFactory, PreAnalyzedUpdateProcessorTest, SolrXmlInZkTest, TestFieldCacheWithThreads, TestCustomStream, TestSolrDeletionPolicy2, ZkNodePropsTest, TestSolrConfigHandlerCloud, DistributedSpellCheckComponentTest, TestRestoreCore, TestFieldCacheSort, TestJoin, MultiTermTest, AnalysisErrorHandlingTest, PropertiesRequestHandlerTest, TestCustomSort, SearchHandlerTest, ManagedSchemaRoundRobinCloudTest, ReplicaListTransformerTest, DateMathParserTest, TestCollapseQParserPlugin, HdfsChaosMonkeySafeLeaderTest, TestRandomFaceting, TestManagedSchemaAPI, V2ApiIntegrationTest, TestJettySolrRunner, TestReRankQParserPlugin, CheckHdfsIndexTest, DistributedSuggestComponentTest, TlogReplayBufferedWhileIndexingTest, CoreMergeIndexesAdminHandlerTest, RequiredFieldsTest, TestRandomDVFaceting, CursorPagingTest, TestDistributedSearch, MinimalSchemaTest, TestCrossCoreJoin, TestAtomicUpdateErrorCases, CloudMLTQParserTest, ResponseLogComponentTest, TestCloudRecovery, TestReloadAndDeleteDocs, PeerSyncWithIndexFingerprintCachingTest, ConjunctionSolrSpellCheckerTest, JSONWriterTest, TestConfigSetProperties, TestCustomDocTransformer, TestJsonFacets, TestSizeLimitedDistributedMap, SignatureUpdateProcessorFactoryTest, HLLSerializationTest, TestRawResponseWriter, TestExpandComponent, TestConfigSetsAPI, TestCodecSupport, TestUniqueKeyFieldResource, TestRestManager, TestRealTimeGet, MetricUtilsTest, DistanceUnitsTest, HdfsSyncSliceTest, CollectionReloadTest, RAMDirectoryFactoryTest, TestSolrCloudWithSecureImpersonation, TestSha256AuthenticationProvider, DefaultValueUpdateProcessorTest, FastVectorHighlighterTest, TestReplicationHandler, TestDFRSimilarityFactory, TestSolrXml, ConfigSetsAPITest, OverriddenZkACLAndCredentialsProvidersTest, TestStressLiveNodes, DateRangeFieldTest, UniqFieldsUpdateProcessorFactoryTest, TestLazyCores, NodeMutatorTest, BasicDistributedZk2Test, SyncSliceTest, LeaderElectionIntegrationTest, ClusterStateUpdateTest, ZkCLITest, TestFaceting, TestRecovery, DistributedTermsComponentTest, SolrCmdDistributorTest, TestFunctionQuery, TestIndexSearcher, CurrencyFieldOpenExchangeTest, DistributedQueryElevationComponentTest, TestExtendedDismaxParser, TestFoldingMultitermQuery, SuggesterTSTTest, TestStressLucene, SuggesterWFSTTest, SchemaVersionSpecificBehaviorTest, QueryEqualityTest, TestRemoteStreaming, XsltUpdateRequestHandlerTest, LukeRequestHandlerTest, TestValueSourceCache, RegexBoostProcessorTest, ReturnFieldsTest, JsonLoaderTest, TestPHPSerializedResponseWriter, TestComponentsName, HighlighterConfigTest, TestQuerySenderListener, AlternateDirectoryTest, TestQuerySenderNoQuery, CopyFieldTest, BadComponentTest, TestStressRecovery, TestLMDirichletSimilarityFactory, TestFastWriter, ResourceLoaderTest, OpenExchangeRatesOrgProviderTest, PreAnalyzedFieldTest, TestSystemIdResolver, TestSuggestSpellingConverter, SpellingQueryConverterTest, DOMUtilTest, ClusterStateTest, TestLRUCache, TestUtils, CircularListTest, DistributedMLTComponentTest, TestCursorMarkWithoutUniqueKey, TestHighlightDedupGrouping, TestTolerantSearch, TestPathTrie, AliasIntegrationTest, CdcrReplicationHandlerTest, CdcrVersionReplicationTest, CollectionTooManyReplicasTest, ConnectionManagerTest, DeleteLastCustomShardedReplicaTest, DeleteNodeTest, DeleteStatusTest, DistribJoinFromCollectionTest, DistributedQueueTest, HttpPartitionTest, MigrateRouteKeyTest, OutOfBoxZkACLAndCredentialsProvidersTest, OverseerModifyCollectionTest, PeerSyncReplicationTest, ReplicationFactorTest, RollingRestartTest, SharedFSAutoReplicaFailoverUtilsTest, SimpleCollectionCreateDeleteTest, SolrCLIZkUtilsTest, TestAuthenticationFramework, TestCloudDeleteByQuery, TestCloudInspectUtil, TestCloudPseudoReturnFields, TestClusterProperties, TestCollectionAPI, TestDownShardTolerantSearch, TestExclusionRuleCollectionAccess, TestLeaderElectionZkExpiry, TestLocalFSCloudBackupRestore, TestRandomFlRTGCloud, TestRequestStatusCollectionAPI, TestSolrCloudWithDelegationTokens, TestSolrCloudWithKerberosAlt, TestStressCloudBlindAtomicUpdates, TriLevelCompositeIdRoutingTest, BlobRepositoryCloudTest, CachingDirectoryFactoryTest, TestConfigSets, TestImplicitCoreProperties, TestInitParams, TestBlobHandler, TestSQLHandlerNonCloud, CoreAdminRequestStatusTest, MetricsHandlerTest, StatsReloadRaceTest]
[junit4] Completed [577/702 (1!)] on J0 in 12.05s, 1 test, 1 failure <<< FAILURES!
[...truncated 36657 lines...]