You are viewing a plain text version of this content. The canonical link for it is here.
Posted to dev@lucene.apache.org by Policeman Jenkins Server <je...@thetaphi.de> on 2014/01/30 04:12:35 UTC
[JENKINS] Lucene-Solr-4.x-Linux (32bit/ibm-j9-jdk7) - Build # 9186
- Failure!
Build: http://jenkins.thetaphi.de/job/Lucene-Solr-4.x-Linux/9186/
Java: 32bit/ibm-j9-jdk7 -Xjit:exclude={org/apache/lucene/util/fst/FST.pack(IIF)Lorg/apache/lucene/util/fst/FST;}
4 tests failed.
REGRESSION: org.apache.solr.handler.component.DistributedQueryElevationComponentTest.testDistribSearch
Error Message:
.responseHeader.params.fl!=sort (unordered or missing)
Stack Trace:
junit.framework.AssertionFailedError: .responseHeader.params.fl!=sort (unordered or missing)
at __randomizedtesting.SeedInfo.seed([306E79645EA3A8DE:B188F77C29FCC8E2]:0)
at junit.framework.Assert.fail(Assert.java:50)
at org.apache.solr.BaseDistributedSearchTestCase.compareSolrResponses(BaseDistributedSearchTestCase.java:840)
at org.apache.solr.BaseDistributedSearchTestCase.compareResponses(BaseDistributedSearchTestCase.java:859)
at org.apache.solr.BaseDistributedSearchTestCase.query(BaseDistributedSearchTestCase.java:562)
at org.apache.solr.BaseDistributedSearchTestCase.query(BaseDistributedSearchTestCase.java:542)
at org.apache.solr.BaseDistributedSearchTestCase.query(BaseDistributedSearchTestCase.java:521)
at org.apache.solr.handler.component.DistributedQueryElevationComponentTest.doTest(DistributedQueryElevationComponentTest.java:81)
at org.apache.solr.BaseDistributedSearchTestCase.testDistribSearch(BaseDistributedSearchTestCase.java:867)
at sun.reflect.NativeMethodAccessorImpl.invoke0(Native Method)
at sun.reflect.NativeMethodAccessorImpl.invoke(NativeMethodAccessorImpl.java:88)
at sun.reflect.DelegatingMethodAccessorImpl.invoke(DelegatingMethodAccessorImpl.java:55)
at java.lang.reflect.Method.invoke(Method.java:613)
at com.carrotsearch.randomizedtesting.RandomizedRunner.invoke(RandomizedRunner.java:1559)
at com.carrotsearch.randomizedtesting.RandomizedRunner.access$600(RandomizedRunner.java:79)
at com.carrotsearch.randomizedtesting.RandomizedRunner$6.evaluate(RandomizedRunner.java:737)
at com.carrotsearch.randomizedtesting.RandomizedRunner$7.evaluate(RandomizedRunner.java:773)
at com.carrotsearch.randomizedtesting.RandomizedRunner$8.evaluate(RandomizedRunner.java:787)
at com.carrotsearch.randomizedtesting.rules.SystemPropertiesRestoreRule$1.evaluate(SystemPropertiesRestoreRule.java:53)
at org.apache.lucene.util.TestRuleSetupTeardownChained$1.evaluate(TestRuleSetupTeardownChained.java:50)
at org.apache.lucene.util.TestRuleFieldCacheSanity$1.evaluate(TestRuleFieldCacheSanity.java:51)
at org.apache.lucene.util.AbstractBeforeAfterRule$1.evaluate(AbstractBeforeAfterRule.java:46)
at com.carrotsearch.randomizedtesting.rules.SystemPropertiesInvariantRule$1.evaluate(SystemPropertiesInvariantRule.java:55)
at org.apache.lucene.util.TestRuleThreadAndTestName$1.evaluate(TestRuleThreadAndTestName.java:49)
at org.apache.lucene.util.TestRuleIgnoreAfterMaxFailures$1.evaluate(TestRuleIgnoreAfterMaxFailures.java:70)
at org.apache.lucene.util.TestRuleMarkFailure$1.evaluate(TestRuleMarkFailure.java:48)
at com.carrotsearch.randomizedtesting.rules.StatementAdapter.evaluate(StatementAdapter.java:36)
at com.carrotsearch.randomizedtesting.ThreadLeakControl$StatementRunner.run(ThreadLeakControl.java:358)
at com.carrotsearch.randomizedtesting.ThreadLeakControl.forkTimeoutingTask(ThreadLeakControl.java:782)
at com.carrotsearch.randomizedtesting.ThreadLeakControl$3.evaluate(ThreadLeakControl.java:442)
at com.carrotsearch.randomizedtesting.RandomizedRunner.runSingleTest(RandomizedRunner.java:746)
at com.carrotsearch.randomizedtesting.RandomizedRunner$3.evaluate(RandomizedRunner.java:648)
at com.carrotsearch.randomizedtesting.RandomizedRunner$4.evaluate(RandomizedRunner.java:682)
at com.carrotsearch.randomizedtesting.RandomizedRunner$5.evaluate(RandomizedRunner.java:693)
at com.carrotsearch.randomizedtesting.rules.StatementAdapter.evaluate(StatementAdapter.java:36)
at com.carrotsearch.randomizedtesting.rules.SystemPropertiesRestoreRule$1.evaluate(SystemPropertiesRestoreRule.java:53)
at org.apache.lucene.util.AbstractBeforeAfterRule$1.evaluate(AbstractBeforeAfterRule.java:46)
at org.apache.lucene.util.TestRuleStoreClassName$1.evaluate(TestRuleStoreClassName.java:42)
at com.carrotsearch.randomizedtesting.rules.SystemPropertiesInvariantRule$1.evaluate(SystemPropertiesInvariantRule.java:55)
at com.carrotsearch.randomizedtesting.rules.NoShadowingOrOverridesOnMethodsRule$1.evaluate(NoShadowingOrOverridesOnMethodsRule.java:39)
at com.carrotsearch.randomizedtesting.rules.NoShadowingOrOverridesOnMethodsRule$1.evaluate(NoShadowingOrOverridesOnMethodsRule.java:39)
at com.carrotsearch.randomizedtesting.rules.StatementAdapter.evaluate(StatementAdapter.java:36)
at org.apache.lucene.util.TestRuleAssertionsRequired$1.evaluate(TestRuleAssertionsRequired.java:43)
at org.apache.lucene.util.TestRuleMarkFailure$1.evaluate(TestRuleMarkFailure.java:48)
at org.apache.lucene.util.TestRuleIgnoreAfterMaxFailures$1.evaluate(TestRuleIgnoreAfterMaxFailures.java:70)
at org.apache.lucene.util.TestRuleIgnoreTestSuites$1.evaluate(TestRuleIgnoreTestSuites.java:55)
at com.carrotsearch.randomizedtesting.rules.StatementAdapter.evaluate(StatementAdapter.java:36)
at com.carrotsearch.randomizedtesting.ThreadLeakControl$StatementRunner.run(ThreadLeakControl.java:358)
at java.lang.Thread.run(Thread.java:780)
REGRESSION: org.apache.solr.handler.component.TermVectorComponentDistributedTest.testDistribSearch
Error Message:
.termVectors.0.test_offtv!=test_basictv (unordered or missing)
Stack Trace:
junit.framework.AssertionFailedError: .termVectors.0.test_offtv!=test_basictv (unordered or missing)
at __randomizedtesting.SeedInfo.seed([306E79645EA3A8DE:B188F77C29FCC8E2]:0)
at junit.framework.Assert.fail(Assert.java:50)
at org.apache.solr.BaseDistributedSearchTestCase.compareSolrResponses(BaseDistributedSearchTestCase.java:840)
at org.apache.solr.BaseDistributedSearchTestCase.compareResponses(BaseDistributedSearchTestCase.java:859)
at org.apache.solr.BaseDistributedSearchTestCase.query(BaseDistributedSearchTestCase.java:562)
at org.apache.solr.BaseDistributedSearchTestCase.query(BaseDistributedSearchTestCase.java:542)
at org.apache.solr.BaseDistributedSearchTestCase.query(BaseDistributedSearchTestCase.java:521)
at org.apache.solr.handler.component.TermVectorComponentDistributedTest.doTest(TermVectorComponentDistributedTest.java:127)
at org.apache.solr.BaseDistributedSearchTestCase.testDistribSearch(BaseDistributedSearchTestCase.java:873)
at sun.reflect.NativeMethodAccessorImpl.invoke0(Native Method)
at sun.reflect.NativeMethodAccessorImpl.invoke(NativeMethodAccessorImpl.java:88)
at sun.reflect.DelegatingMethodAccessorImpl.invoke(DelegatingMethodAccessorImpl.java:55)
at java.lang.reflect.Method.invoke(Method.java:613)
at com.carrotsearch.randomizedtesting.RandomizedRunner.invoke(RandomizedRunner.java:1559)
at com.carrotsearch.randomizedtesting.RandomizedRunner.access$600(RandomizedRunner.java:79)
at com.carrotsearch.randomizedtesting.RandomizedRunner$6.evaluate(RandomizedRunner.java:737)
at com.carrotsearch.randomizedtesting.RandomizedRunner$7.evaluate(RandomizedRunner.java:773)
at com.carrotsearch.randomizedtesting.RandomizedRunner$8.evaluate(RandomizedRunner.java:787)
at com.carrotsearch.randomizedtesting.rules.SystemPropertiesRestoreRule$1.evaluate(SystemPropertiesRestoreRule.java:53)
at org.apache.lucene.util.TestRuleSetupTeardownChained$1.evaluate(TestRuleSetupTeardownChained.java:50)
at org.apache.lucene.util.TestRuleFieldCacheSanity$1.evaluate(TestRuleFieldCacheSanity.java:51)
at org.apache.lucene.util.AbstractBeforeAfterRule$1.evaluate(AbstractBeforeAfterRule.java:46)
at com.carrotsearch.randomizedtesting.rules.SystemPropertiesInvariantRule$1.evaluate(SystemPropertiesInvariantRule.java:55)
at org.apache.lucene.util.TestRuleThreadAndTestName$1.evaluate(TestRuleThreadAndTestName.java:49)
at org.apache.lucene.util.TestRuleIgnoreAfterMaxFailures$1.evaluate(TestRuleIgnoreAfterMaxFailures.java:70)
at org.apache.lucene.util.TestRuleMarkFailure$1.evaluate(TestRuleMarkFailure.java:48)
at com.carrotsearch.randomizedtesting.rules.StatementAdapter.evaluate(StatementAdapter.java:36)
at com.carrotsearch.randomizedtesting.ThreadLeakControl$StatementRunner.run(ThreadLeakControl.java:358)
at com.carrotsearch.randomizedtesting.ThreadLeakControl.forkTimeoutingTask(ThreadLeakControl.java:782)
at com.carrotsearch.randomizedtesting.ThreadLeakControl$3.evaluate(ThreadLeakControl.java:442)
at com.carrotsearch.randomizedtesting.RandomizedRunner.runSingleTest(RandomizedRunner.java:746)
at com.carrotsearch.randomizedtesting.RandomizedRunner$3.evaluate(RandomizedRunner.java:648)
at com.carrotsearch.randomizedtesting.RandomizedRunner$4.evaluate(RandomizedRunner.java:682)
at com.carrotsearch.randomizedtesting.RandomizedRunner$5.evaluate(RandomizedRunner.java:693)
at com.carrotsearch.randomizedtesting.rules.StatementAdapter.evaluate(StatementAdapter.java:36)
at com.carrotsearch.randomizedtesting.rules.SystemPropertiesRestoreRule$1.evaluate(SystemPropertiesRestoreRule.java:53)
at org.apache.lucene.util.AbstractBeforeAfterRule$1.evaluate(AbstractBeforeAfterRule.java:46)
at org.apache.lucene.util.TestRuleStoreClassName$1.evaluate(TestRuleStoreClassName.java:42)
at com.carrotsearch.randomizedtesting.rules.SystemPropertiesInvariantRule$1.evaluate(SystemPropertiesInvariantRule.java:55)
at com.carrotsearch.randomizedtesting.rules.NoShadowingOrOverridesOnMethodsRule$1.evaluate(NoShadowingOrOverridesOnMethodsRule.java:39)
at com.carrotsearch.randomizedtesting.rules.NoShadowingOrOverridesOnMethodsRule$1.evaluate(NoShadowingOrOverridesOnMethodsRule.java:39)
at com.carrotsearch.randomizedtesting.rules.StatementAdapter.evaluate(StatementAdapter.java:36)
at org.apache.lucene.util.TestRuleAssertionsRequired$1.evaluate(TestRuleAssertionsRequired.java:43)
at org.apache.lucene.util.TestRuleMarkFailure$1.evaluate(TestRuleMarkFailure.java:48)
at org.apache.lucene.util.TestRuleIgnoreAfterMaxFailures$1.evaluate(TestRuleIgnoreAfterMaxFailures.java:70)
at org.apache.lucene.util.TestRuleIgnoreTestSuites$1.evaluate(TestRuleIgnoreTestSuites.java:55)
at com.carrotsearch.randomizedtesting.rules.StatementAdapter.evaluate(StatementAdapter.java:36)
at com.carrotsearch.randomizedtesting.ThreadLeakControl$StatementRunner.run(ThreadLeakControl.java:358)
at java.lang.Thread.run(Thread.java:780)
REGRESSION: org.apache.solr.update.HardAutoCommitTest.testCommitWithin
Error Message:
Exception during query
Stack Trace:
java.lang.RuntimeException: Exception during query
at __randomizedtesting.SeedInfo.seed([306E79645EA3A8DE:8ABC161CDD8D46CB]:0)
at org.apache.solr.SolrTestCaseJ4.assertQ(SolrTestCaseJ4.java:644)
at org.apache.solr.update.HardAutoCommitTest.testCommitWithin(HardAutoCommitTest.java:79)
at sun.reflect.NativeMethodAccessorImpl.invoke0(Native Method)
at sun.reflect.NativeMethodAccessorImpl.invoke(NativeMethodAccessorImpl.java:88)
at sun.reflect.DelegatingMethodAccessorImpl.invoke(DelegatingMethodAccessorImpl.java:55)
at java.lang.reflect.Method.invoke(Method.java:613)
at com.carrotsearch.randomizedtesting.RandomizedRunner.invoke(RandomizedRunner.java:1559)
at com.carrotsearch.randomizedtesting.RandomizedRunner.access$600(RandomizedRunner.java:79)
at com.carrotsearch.randomizedtesting.RandomizedRunner$6.evaluate(RandomizedRunner.java:737)
at com.carrotsearch.randomizedtesting.RandomizedRunner$7.evaluate(RandomizedRunner.java:773)
at com.carrotsearch.randomizedtesting.RandomizedRunner$8.evaluate(RandomizedRunner.java:787)
at com.carrotsearch.randomizedtesting.rules.SystemPropertiesRestoreRule$1.evaluate(SystemPropertiesRestoreRule.java:53)
at org.apache.lucene.util.TestRuleSetupTeardownChained$1.evaluate(TestRuleSetupTeardownChained.java:50)
at org.apache.lucene.util.TestRuleFieldCacheSanity$1.evaluate(TestRuleFieldCacheSanity.java:51)
at org.apache.lucene.util.AbstractBeforeAfterRule$1.evaluate(AbstractBeforeAfterRule.java:46)
at com.carrotsearch.randomizedtesting.rules.SystemPropertiesInvariantRule$1.evaluate(SystemPropertiesInvariantRule.java:55)
at org.apache.lucene.util.TestRuleThreadAndTestName$1.evaluate(TestRuleThreadAndTestName.java:49)
at org.apache.lucene.util.TestRuleIgnoreAfterMaxFailures$1.evaluate(TestRuleIgnoreAfterMaxFailures.java:70)
at org.apache.lucene.util.TestRuleMarkFailure$1.evaluate(TestRuleMarkFailure.java:48)
at com.carrotsearch.randomizedtesting.rules.StatementAdapter.evaluate(StatementAdapter.java:36)
at com.carrotsearch.randomizedtesting.ThreadLeakControl$StatementRunner.run(ThreadLeakControl.java:358)
at com.carrotsearch.randomizedtesting.ThreadLeakControl.forkTimeoutingTask(ThreadLeakControl.java:782)
at com.carrotsearch.randomizedtesting.ThreadLeakControl$3.evaluate(ThreadLeakControl.java:442)
at com.carrotsearch.randomizedtesting.RandomizedRunner.runSingleTest(RandomizedRunner.java:746)
at com.carrotsearch.randomizedtesting.RandomizedRunner$3.evaluate(RandomizedRunner.java:648)
at com.carrotsearch.randomizedtesting.RandomizedRunner$4.evaluate(RandomizedRunner.java:682)
at com.carrotsearch.randomizedtesting.RandomizedRunner$5.evaluate(RandomizedRunner.java:693)
at com.carrotsearch.randomizedtesting.rules.StatementAdapter.evaluate(StatementAdapter.java:36)
at com.carrotsearch.randomizedtesting.rules.SystemPropertiesRestoreRule$1.evaluate(SystemPropertiesRestoreRule.java:53)
at org.apache.lucene.util.AbstractBeforeAfterRule$1.evaluate(AbstractBeforeAfterRule.java:46)
at org.apache.lucene.util.TestRuleStoreClassName$1.evaluate(TestRuleStoreClassName.java:42)
at com.carrotsearch.randomizedtesting.rules.SystemPropertiesInvariantRule$1.evaluate(SystemPropertiesInvariantRule.java:55)
at com.carrotsearch.randomizedtesting.rules.NoShadowingOrOverridesOnMethodsRule$1.evaluate(NoShadowingOrOverridesOnMethodsRule.java:39)
at com.carrotsearch.randomizedtesting.rules.NoShadowingOrOverridesOnMethodsRule$1.evaluate(NoShadowingOrOverridesOnMethodsRule.java:39)
at com.carrotsearch.randomizedtesting.rules.StatementAdapter.evaluate(StatementAdapter.java:36)
at org.apache.lucene.util.TestRuleAssertionsRequired$1.evaluate(TestRuleAssertionsRequired.java:43)
at org.apache.lucene.util.TestRuleMarkFailure$1.evaluate(TestRuleMarkFailure.java:48)
at org.apache.lucene.util.TestRuleIgnoreAfterMaxFailures$1.evaluate(TestRuleIgnoreAfterMaxFailures.java:70)
at org.apache.lucene.util.TestRuleIgnoreTestSuites$1.evaluate(TestRuleIgnoreTestSuites.java:55)
at com.carrotsearch.randomizedtesting.rules.StatementAdapter.evaluate(StatementAdapter.java:36)
at com.carrotsearch.randomizedtesting.ThreadLeakControl$StatementRunner.run(ThreadLeakControl.java:358)
at java.lang.Thread.run(Thread.java:780)
Caused by: java.lang.RuntimeException: REQUEST FAILED: xpath=//result[@numFound=0]
xml response was: <?xml version="1.0" encoding="UTF-8"?>
<response>
<lst name="responseHeader"><int name="status">0</int><int name="QTime">2878</int></lst><result name="response" numFound="1" start="0"><doc><int name="id">529</int><int name="range_facet_si">529</int><arr name="range_facet_l"><long>529</long></arr><arr name="range_facet_sl"><long>529</long></arr><arr name="field_t"><str>what's inside?</str></arr><arr name="subject"><str>info</str></arr><long name="_version_">1458622040672043008</long><int name="intDefault">42</int><date name="timestamp">2014-01-30T02:52:57.533Z</date><arr name="multiDefault"><str>muLti-Default</str></arr></doc></result>
</response>
request was:rows=20&start=0&version=2.2&qt=standard&q=id:529
at org.apache.solr.SolrTestCaseJ4.assertQ(SolrTestCaseJ4.java:637)
... 41 more
REGRESSION: org.apache.solr.update.processor.SignatureUpdateProcessorFactoryTest.testDupeDetection
Error Message:
expected:<1> but was:<3>
Stack Trace:
java.lang.AssertionError: expected:<1> but was:<3>
at __randomizedtesting.SeedInfo.seed([306E79645EA3A8DE:6B5E82AC5DE40BA2]:0)
at org.junit.Assert.fail(Assert.java:93)
at org.junit.Assert.failNotEquals(Assert.java:647)
at org.junit.Assert.assertEquals(Assert.java:128)
at org.junit.Assert.assertEquals(Assert.java:472)
at org.junit.Assert.assertEquals(Assert.java:456)
at org.apache.solr.update.processor.SignatureUpdateProcessorFactoryTest.checkNumDocs(SignatureUpdateProcessorFactoryTest.java:71)
at org.apache.solr.update.processor.SignatureUpdateProcessorFactoryTest.testDupeDetection(SignatureUpdateProcessorFactoryTest.java:119)
at sun.reflect.NativeMethodAccessorImpl.invoke0(Native Method)
at sun.reflect.NativeMethodAccessorImpl.invoke(NativeMethodAccessorImpl.java:88)
at sun.reflect.DelegatingMethodAccessorImpl.invoke(DelegatingMethodAccessorImpl.java:55)
at java.lang.reflect.Method.invoke(Method.java:613)
at com.carrotsearch.randomizedtesting.RandomizedRunner.invoke(RandomizedRunner.java:1559)
at com.carrotsearch.randomizedtesting.RandomizedRunner.access$600(RandomizedRunner.java:79)
at com.carrotsearch.randomizedtesting.RandomizedRunner$6.evaluate(RandomizedRunner.java:737)
at com.carrotsearch.randomizedtesting.RandomizedRunner$7.evaluate(RandomizedRunner.java:773)
at com.carrotsearch.randomizedtesting.RandomizedRunner$8.evaluate(RandomizedRunner.java:787)
at com.carrotsearch.randomizedtesting.rules.SystemPropertiesRestoreRule$1.evaluate(SystemPropertiesRestoreRule.java:53)
at org.apache.lucene.util.TestRuleSetupTeardownChained$1.evaluate(TestRuleSetupTeardownChained.java:50)
at org.apache.lucene.util.TestRuleFieldCacheSanity$1.evaluate(TestRuleFieldCacheSanity.java:51)
at org.apache.lucene.util.AbstractBeforeAfterRule$1.evaluate(AbstractBeforeAfterRule.java:46)
at com.carrotsearch.randomizedtesting.rules.SystemPropertiesInvariantRule$1.evaluate(SystemPropertiesInvariantRule.java:55)
at org.apache.lucene.util.TestRuleThreadAndTestName$1.evaluate(TestRuleThreadAndTestName.java:49)
at org.apache.lucene.util.TestRuleIgnoreAfterMaxFailures$1.evaluate(TestRuleIgnoreAfterMaxFailures.java:70)
at org.apache.lucene.util.TestRuleMarkFailure$1.evaluate(TestRuleMarkFailure.java:48)
at com.carrotsearch.randomizedtesting.rules.StatementAdapter.evaluate(StatementAdapter.java:36)
at com.carrotsearch.randomizedtesting.ThreadLeakControl$StatementRunner.run(ThreadLeakControl.java:358)
at com.carrotsearch.randomizedtesting.ThreadLeakControl.forkTimeoutingTask(ThreadLeakControl.java:782)
at com.carrotsearch.randomizedtesting.ThreadLeakControl$3.evaluate(ThreadLeakControl.java:442)
at com.carrotsearch.randomizedtesting.RandomizedRunner.runSingleTest(RandomizedRunner.java:746)
at com.carrotsearch.randomizedtesting.RandomizedRunner$3.evaluate(RandomizedRunner.java:648)
at com.carrotsearch.randomizedtesting.RandomizedRunner$4.evaluate(RandomizedRunner.java:682)
at com.carrotsearch.randomizedtesting.RandomizedRunner$5.evaluate(RandomizedRunner.java:693)
at com.carrotsearch.randomizedtesting.rules.StatementAdapter.evaluate(StatementAdapter.java:36)
at com.carrotsearch.randomizedtesting.rules.SystemPropertiesRestoreRule$1.evaluate(SystemPropertiesRestoreRule.java:53)
at org.apache.lucene.util.AbstractBeforeAfterRule$1.evaluate(AbstractBeforeAfterRule.java:46)
at org.apache.lucene.util.TestRuleStoreClassName$1.evaluate(TestRuleStoreClassName.java:42)
at com.carrotsearch.randomizedtesting.rules.SystemPropertiesInvariantRule$1.evaluate(SystemPropertiesInvariantRule.java:55)
at com.carrotsearch.randomizedtesting.rules.NoShadowingOrOverridesOnMethodsRule$1.evaluate(NoShadowingOrOverridesOnMethodsRule.java:39)
at com.carrotsearch.randomizedtesting.rules.NoShadowingOrOverridesOnMethodsRule$1.evaluate(NoShadowingOrOverridesOnMethodsRule.java:39)
at com.carrotsearch.randomizedtesting.rules.StatementAdapter.evaluate(StatementAdapter.java:36)
at org.apache.lucene.util.TestRuleAssertionsRequired$1.evaluate(TestRuleAssertionsRequired.java:43)
at org.apache.lucene.util.TestRuleMarkFailure$1.evaluate(TestRuleMarkFailure.java:48)
at org.apache.lucene.util.TestRuleIgnoreAfterMaxFailures$1.evaluate(TestRuleIgnoreAfterMaxFailures.java:70)
at org.apache.lucene.util.TestRuleIgnoreTestSuites$1.evaluate(TestRuleIgnoreTestSuites.java:55)
at com.carrotsearch.randomizedtesting.rules.StatementAdapter.evaluate(StatementAdapter.java:36)
at com.carrotsearch.randomizedtesting.ThreadLeakControl$StatementRunner.run(ThreadLeakControl.java:358)
at java.lang.Thread.run(Thread.java:780)
Build Log:
[...truncated 10386 lines...]
[junit4] Suite: org.apache.solr.update.HardAutoCommitTest
[junit4] 2> 439299 T1956 oas.SolrTestCaseJ4.initCore ####initCore
[junit4] 2> Creating dataDir: /mnt/ssd/jenkins/workspace/Lucene-Solr-4.x-Linux/solr/build/solr-core/test/J1/./solrtest-HardAutoCommitTest-1391050374938
[junit4] 2> 439300 T1956 oasc.SolrResourceLoader.<init> new SolrResourceLoader for directory: '/mnt/ssd/jenkins/workspace/Lucene-Solr-4.x-Linux/solr/build/solr-core/test-files/solr/collection1/'
[junit4] 2> 439303 T1956 oasc.SolrResourceLoader.replaceClassLoader Adding 'file:/mnt/ssd/jenkins/workspace/Lucene-Solr-4.x-Linux/solr/build/solr-core/test-files/solr/collection1/lib/classes/' to classloader
[junit4] 2> 439305 T1956 oasc.SolrResourceLoader.replaceClassLoader Adding 'file:/mnt/ssd/jenkins/workspace/Lucene-Solr-4.x-Linux/solr/build/solr-core/test-files/solr/collection1/lib/README' to classloader
[junit4] 2> 439374 T1956 oasc.SolrConfig.<init> Using Lucene MatchVersion: LUCENE_47
[junit4] 2> 439453 T1956 oasc.SolrConfig.<init> Loaded SolrConfig: solrconfig.xml
[junit4] 2> 439454 T1956 oass.IndexSchema.readSchema Reading Solr Schema from schema.xml
[junit4] 2> 439469 T1956 oass.IndexSchema.readSchema [null] Schema name=test
[junit4] 2> 440204 T1956 oass.ByteField.init WARN ByteField is deprecated and will be removed in 5.0. You should use TrieIntField instead.
[junit4] 2> 440205 T1956 oass.ShortField.init WARN ShortField is deprecated and will be removed in 5.0. You should use TrieIntField instead.
[junit4] 2> 440207 T1956 oass.OpenExchangeRatesOrgProvider.init Initialized with rates=open-exchange-rates.json, refreshInterval=1440.
[junit4] 2> 440214 T1956 oass.IndexSchema.readSchema default search field in schema is text
[junit4] 2> 440218 T1956 oass.IndexSchema.readSchema unique key field: id
[junit4] 2> 440224 T1956 oass.FileExchangeRateProvider.reload Reloading exchange rates from file currency.xml
[junit4] 2> 440228 T1956 oass.FileExchangeRateProvider.reload Reloading exchange rates from file currency.xml
[junit4] 2> 440235 T1956 oass.OpenExchangeRatesOrgProvider.reload Reloading exchange rates from open-exchange-rates.json
[junit4] 2> 440237 T1956 oass.OpenExchangeRatesOrgProvider$OpenExchangeRates.<init> WARN Unknown key IMPORTANT NOTE
[junit4] 2> 440238 T1956 oass.OpenExchangeRatesOrgProvider$OpenExchangeRates.<init> WARN Expected key, got STRING
[junit4] 2> 440239 T1956 oass.OpenExchangeRatesOrgProvider.reload Reloading exchange rates from open-exchange-rates.json
[junit4] 2> 440240 T1956 oass.OpenExchangeRatesOrgProvider$OpenExchangeRates.<init> WARN Unknown key IMPORTANT NOTE
[junit4] 2> 440241 T1956 oass.OpenExchangeRatesOrgProvider$OpenExchangeRates.<init> WARN Expected key, got STRING
[junit4] 2> 440243 T1956 oasc.SolrResourceLoader.locateSolrHome JNDI not configured for solr (NoInitialContextEx)
[junit4] 2> 440244 T1956 oasc.SolrResourceLoader.locateSolrHome using system property solr.solr.home: /mnt/ssd/jenkins/workspace/Lucene-Solr-4.x-Linux/solr/build/solr-core/test-files/solr
[junit4] 2> 440244 T1956 oasc.SolrResourceLoader.<init> new SolrResourceLoader for directory: '/mnt/ssd/jenkins/workspace/Lucene-Solr-4.x-Linux/solr/build/solr-core/test-files/solr/'
[junit4] 2> 440256 T1956 oasc.SolrResourceLoader.locateSolrHome JNDI not configured for solr (NoInitialContextEx)
[junit4] 2> 440257 T1956 oasc.SolrResourceLoader.locateSolrHome using system property solr.solr.home: /mnt/ssd/jenkins/workspace/Lucene-Solr-4.x-Linux/solr/build/solr-core/test-files/solr
[junit4] 2> 440257 T1956 oasc.SolrResourceLoader.<init> new SolrResourceLoader for deduced Solr Home: '/mnt/ssd/jenkins/workspace/Lucene-Solr-4.x-Linux/solr/build/solr-core/test-files/solr/'
[junit4] 2> 440308 T1956 oasc.CoreContainer.<init> New CoreContainer 214436865
[junit4] 2> 440308 T1956 oasc.CoreContainer.load Loading cores into CoreContainer [instanceDir=/mnt/ssd/jenkins/workspace/Lucene-Solr-4.x-Linux/solr/build/solr-core/test-files/solr/]
[junit4] 2> 440309 T1956 oashc.HttpShardHandlerFactory.getParameter Setting socketTimeout to: 0
[junit4] 2> 440310 T1956 oashc.HttpShardHandlerFactory.getParameter Setting urlScheme to: http://
[junit4] 2> 440310 T1956 oashc.HttpShardHandlerFactory.getParameter Setting connTimeout to: 0
[junit4] 2> 440311 T1956 oashc.HttpShardHandlerFactory.getParameter Setting maxConnectionsPerHost to: 20
[junit4] 2> 440311 T1956 oashc.HttpShardHandlerFactory.getParameter Setting corePoolSize to: 0
[junit4] 2> 440312 T1956 oashc.HttpShardHandlerFactory.getParameter Setting maximumPoolSize to: 2147483647
[junit4] 2> 440312 T1956 oashc.HttpShardHandlerFactory.getParameter Setting maxThreadIdleTime to: 5
[junit4] 2> 440312 T1956 oashc.HttpShardHandlerFactory.getParameter Setting sizeOfQueue to: -1
[junit4] 2> 440313 T1956 oashc.HttpShardHandlerFactory.getParameter Setting fairnessPolicy to: false
[junit4] 2> 440317 T1956 oasl.LogWatcher.createWatcher SLF4J impl is org.slf4j.impl.Log4jLoggerFactory
[junit4] 2> 440317 T1956 oasl.LogWatcher.newRegisteredLogWatcher Registering Log Listener [Log4j (org.slf4j.impl.Log4jLoggerFactory)]
[junit4] 2> 440318 T1956 oasc.CoreContainer.load Host Name:
[junit4] 2> 440322 T1957 oasc.CoreContainer.create Creating SolrCore 'collection1' using instanceDir: /mnt/ssd/jenkins/workspace/Lucene-Solr-4.x-Linux/solr/build/solr-core/test-files/solr/collection1
[junit4] 2> 440323 T1957 oasc.SolrResourceLoader.<init> new SolrResourceLoader for directory: '/mnt/ssd/jenkins/workspace/Lucene-Solr-4.x-Linux/solr/build/solr-core/test-files/solr/collection1/'
[junit4] 2> 440323 T1957 oasc.SolrResourceLoader.replaceClassLoader Adding 'file:/mnt/ssd/jenkins/workspace/Lucene-Solr-4.x-Linux/solr/build/solr-core/test-files/solr/collection1/lib/classes/' to classloader
[junit4] 2> 440324 T1957 oasc.SolrResourceLoader.replaceClassLoader Adding 'file:/mnt/ssd/jenkins/workspace/Lucene-Solr-4.x-Linux/solr/build/solr-core/test-files/solr/collection1/lib/README' to classloader
[junit4] 2> 440361 T1957 oasc.SolrConfig.<init> Using Lucene MatchVersion: LUCENE_47
[junit4] 2> 440416 T1957 oasc.SolrConfig.<init> Loaded SolrConfig: solrconfig.xml
[junit4] 2> 440417 T1957 oass.IndexSchema.readSchema Reading Solr Schema from schema.xml
[junit4] 2> 440423 T1957 oass.IndexSchema.readSchema [collection1] Schema name=test
[junit4] 2> 440772 T1957 oass.ByteField.init WARN ByteField is deprecated and will be removed in 5.0. You should use TrieIntField instead.
[junit4] 2> 440773 T1957 oass.ShortField.init WARN ShortField is deprecated and will be removed in 5.0. You should use TrieIntField instead.
[junit4] 2> 440773 T1957 oass.OpenExchangeRatesOrgProvider.init Initialized with rates=open-exchange-rates.json, refreshInterval=1440.
[junit4] 2> 440778 T1957 oass.IndexSchema.readSchema default search field in schema is text
[junit4] 2> 440781 T1957 oass.IndexSchema.readSchema unique key field: id
[junit4] 2> 440787 T1957 oass.FileExchangeRateProvider.reload Reloading exchange rates from file currency.xml
[junit4] 2> 440791 T1957 oass.FileExchangeRateProvider.reload Reloading exchange rates from file currency.xml
[junit4] 2> 440795 T1957 oass.OpenExchangeRatesOrgProvider.reload Reloading exchange rates from open-exchange-rates.json
[junit4] 2> 440796 T1957 oass.OpenExchangeRatesOrgProvider$OpenExchangeRates.<init> WARN Unknown key IMPORTANT NOTE
[junit4] 2> 440796 T1957 oass.OpenExchangeRatesOrgProvider$OpenExchangeRates.<init> WARN Expected key, got STRING
[junit4] 2> 440796 T1957 oass.OpenExchangeRatesOrgProvider.reload Reloading exchange rates from open-exchange-rates.json
[junit4] 2> 440797 T1957 oass.OpenExchangeRatesOrgProvider$OpenExchangeRates.<init> WARN Unknown key IMPORTANT NOTE
[junit4] 2> 440797 T1957 oass.OpenExchangeRatesOrgProvider$OpenExchangeRates.<init> WARN Expected key, got STRING
[junit4] 2> 440797 T1957 oasc.SolrCore.initDirectoryFactory org.apache.solr.core.MockDirectoryFactory
[junit4] 2> 440798 T1957 oasc.SolrCore.<init> [collection1] Opening new SolrCore at /mnt/ssd/jenkins/workspace/Lucene-Solr-4.x-Linux/solr/build/solr-core/test-files/solr/collection1/, dataDir=/mnt/ssd/jenkins/workspace/Lucene-Solr-4.x-Linux/solr/build/solr-core/test/J1/./solrtest-HardAutoCommitTest-1391050374938/
[junit4] 2> 440798 T1957 oasc.JmxMonitoredMap.<init> JMX monitoring is enabled. Adding Solr mbeans to JMX Server: com.sun.jmx.mbeanserver.JmxMBeanServer@75ce0da8
[junit4] 2> 440800 T1957 oasc.CachingDirectoryFactory.get return new directory for /mnt/ssd/jenkins/workspace/Lucene-Solr-4.x-Linux/solr/build/solr-core/test/J1/./solrtest-HardAutoCommitTest-1391050374938
[junit4] 2> 440800 T1957 oasc.SolrCore.getNewIndexDir New index directory detected: old=null new=/mnt/ssd/jenkins/workspace/Lucene-Solr-4.x-Linux/solr/build/solr-core/test/J1/./solrtest-HardAutoCommitTest-1391050374938/index/
[junit4] 2> 440800 T1957 oasc.SolrCore.initIndex WARN [collection1] Solr index directory '/mnt/ssd/jenkins/workspace/Lucene-Solr-4.x-Linux/solr/build/solr-core/test/J1/./solrtest-HardAutoCommitTest-1391050374938/index' doesn't exist. Creating new index...
[junit4] 2> 440801 T1957 oasc.CachingDirectoryFactory.get return new directory for /mnt/ssd/jenkins/workspace/Lucene-Solr-4.x-Linux/solr/build/solr-core/test/J1/./solrtest-HardAutoCommitTest-1391050374938/index
[junit4] 2> 440801 T1957 oasu.RandomMergePolicy.<init> RandomMergePolicy wrapping class org.apache.lucene.index.TieredMergePolicy: [TieredMergePolicy: maxMergeAtOnce=16, maxMergeAtOnceExplicit=31, maxMergedSegmentMB=8.2392578125, floorSegmentMB=1.681640625, forceMergeDeletesPctAllowed=29.06394384950395, segmentsPerTier=15.0, maxCFSSegmentSizeMB=8.796093022207999E12, noCFSRatio=0.350724233226522
[junit4] 2> 440802 T1957 oasc.SolrDeletionPolicy.onCommit SolrDeletionPolicy.onCommit: commits: num=1
[junit4] 2> commit{dir=RateLimitedDirectoryWrapper(MockDirectoryWrapper(org.apache.lucene.store.RAMDirectory@8ab600d4 lockFactory=org.apache.lucene.store.SingleInstanceLockFactory@bc0d0834)),segFN=segments_1,generation=1}
[junit4] 2> 440802 T1957 oasc.SolrDeletionPolicy.updateCommits newest commit generation = 1
[junit4] 2> 440803 T1957 oasc.SolrCore.initWriters created xml: solr.XMLResponseWriter
[junit4] 2> 440805 T1957 oasup.UpdateRequestProcessorChain.init creating updateRequestProcessorChain "dedupe"
[junit4] 2> 440805 T1957 oasup.UpdateRequestProcessorChain.init inserting DistributedUpdateProcessorFactory into updateRequestProcessorChain "dedupe"
[junit4] 2> 440806 T1957 oasup.UpdateRequestProcessorChain.init creating updateRequestProcessorChain "dedupe-allfields"
[junit4] 2> 440806 T1957 oasup.UpdateRequestProcessorChain.init inserting DistributedUpdateProcessorFactory into updateRequestProcessorChain "dedupe-allfields"
[junit4] 2> 440806 T1957 oasup.UpdateRequestProcessorChain.init creating updateRequestProcessorChain "stored_sig"
[junit4] 2> 440807 T1957 oasup.UpdateRequestProcessorChain.init inserting DistributedUpdateProcessorFactory into updateRequestProcessorChain "stored_sig"
[junit4] 2> 440807 T1957 oasup.UpdateRequestProcessorChain.init creating updateRequestProcessorChain "uniq-fields"
[junit4] 2> 440808 T1957 oasup.UniqFieldsUpdateProcessorFactory.init WARN Use of the 'fields' init param in UniqFieldsUpdateProcessorFactory is deprecated, please use 'fieldName' (or another FieldMutatingUpdateProcessorFactory selector option) instead
[junit4] 2> 440808 T1957 oasup.UniqFieldsUpdateProcessorFactory.init Replacing 'fields' init param with (individual) 'fieldName' params
[junit4] 2> 440808 T1957 oasup.UpdateRequestProcessorChain.init inserting DistributedUpdateProcessorFactory into updateRequestProcessorChain "uniq-fields"
[junit4] 2> 440809 T1957 oasup.UpdateRequestProcessorChain.init creating updateRequestProcessorChain "distrib-dup-test-chain-explicit"
[junit4] 2> 440809 T1957 oasup.UpdateRequestProcessorChain.init creating updateRequestProcessorChain "distrib-dup-test-chain-implicit"
[junit4] 2> 440809 T1957 oasup.UpdateRequestProcessorChain.init inserting DistributedUpdateProcessorFactory into updateRequestProcessorChain "distrib-dup-test-chain-implicit"
[junit4] 2> 440810 T1957 oasc.SolrCore.loadUpdateProcessorChains no updateRequestProcessorChain defined as default, creating implicit default
[junit4] 2> 440810 T1957 oasc.RequestHandlers.initHandlersFromConfig adding lazy requestHandler: solr.ReplicationHandler
[junit4] 2> 440810 T1957 oasc.RequestHandlers.initHandlersFromConfig created /replication: solr.ReplicationHandler
[junit4] 2> 440811 T1957 oasc.RequestHandlers.initHandlersFromConfig created standard: solr.StandardRequestHandler
[junit4] 2> 440811 T1957 oasc.RequestHandlers.initHandlersFromConfig created /get: solr.RealTimeGetHandler
[junit4] 2> 440812 T1957 oasc.RequestHandlers.initHandlersFromConfig created dismax: solr.SearchHandler
[junit4] 2> 440812 T1957 oasc.RequestHandlers.initHandlersFromConfig created mock: org.apache.solr.core.MockQuerySenderListenerReqHandler
[junit4] 2> 440813 T1957 oasc.RequestHandlers.initHandlersFromConfig created /admin/: org.apache.solr.handler.admin.AdminHandlers
[junit4] 2> 440813 T1957 oasc.RequestHandlers.initHandlersFromConfig created /admin/file: solr.admin.ShowFileRequestHandler
[junit4] 2> 440814 T1957 oasc.RequestHandlers.initHandlersFromConfig created defaults: solr.StandardRequestHandler
[junit4] 2> 440814 T1957 oasc.RequestHandlers.initHandlersFromConfig adding lazy requestHandler: solr.StandardRequestHandler
[junit4] 2> 440814 T1957 oasc.RequestHandlers.initHandlersFromConfig created lazy: solr.StandardRequestHandler
[junit4] 2> 440815 T1957 oasc.RequestHandlers.initHandlersFromConfig created /update: solr.UpdateRequestHandler
[junit4] 2> 440815 T1957 oasc.RequestHandlers.initHandlersFromConfig created /terms: org.apache.solr.handler.component.SearchHandler
[junit4] 2> 440816 T1957 oasc.RequestHandlers.initHandlersFromConfig created spellCheckCompRH: org.apache.solr.handler.component.SearchHandler
[junit4] 2> 440816 T1957 oasc.RequestHandlers.initHandlersFromConfig created spellCheckCompRH_Direct: org.apache.solr.handler.component.SearchHandler
[junit4] 2> 440816 T1957 oasc.RequestHandlers.initHandlersFromConfig created spellCheckWithWordbreak: org.apache.solr.handler.component.SearchHandler
[junit4] 2> 440817 T1957 oasc.RequestHandlers.initHandlersFromConfig created spellCheckWithWordbreak_Direct: org.apache.solr.handler.component.SearchHandler
[junit4] 2> 440817 T1957 oasc.RequestHandlers.initHandlersFromConfig created spellCheckCompRH1: org.apache.solr.handler.component.SearchHandler
[junit4] 2> 440818 T1957 oasc.RequestHandlers.initHandlersFromConfig created mltrh: org.apache.solr.handler.component.SearchHandler
[junit4] 2> 440818 T1957 oasc.RequestHandlers.initHandlersFromConfig created tvrh: org.apache.solr.handler.component.SearchHandler
[junit4] 2> 440819 T1957 oasc.RequestHandlers.initHandlersFromConfig created /mlt: solr.MoreLikeThisHandler
[junit4] 2> 440819 T1957 oasc.RequestHandlers.initHandlersFromConfig created /debug/dump: solr.DumpRequestHandler
[junit4] 2> 440821 T1957 oashl.XMLLoader.init xsltCacheLifetimeSeconds=60
[junit4] 2> 440822 T1957 oasc.SolrCore.initDeprecatedSupport WARN solrconfig.xml uses deprecated <admin/gettableFiles>, Please update your config to use the ShowFileRequestHandler.
[junit4] 2> 440824 T1957 oasu.CommitTracker.<init> Hard AutoCommit: disabled
[junit4] 2> 440825 T1957 oasu.CommitTracker.<init> Soft AutoCommit: disabled
[junit4] 2> 440825 T1957 oasu.RandomMergePolicy.<init> RandomMergePolicy wrapping class org.apache.lucene.index.TieredMergePolicy: [TieredMergePolicy: maxMergeAtOnce=44, maxMergeAtOnceExplicit=24, maxMergedSegmentMB=42.54296875, floorSegmentMB=1.41796875, forceMergeDeletesPctAllowed=16.69467948836289, segmentsPerTier=46.0, maxCFSSegmentSizeMB=8.796093022207999E12, noCFSRatio=0.6034589679402396
[junit4] 2> 440826 T1957 oasc.SolrDeletionPolicy.onInit SolrDeletionPolicy.onInit: commits: num=1
[junit4] 2> commit{dir=RateLimitedDirectoryWrapper(MockDirectoryWrapper(org.apache.lucene.store.RAMDirectory@8ab600d4 lockFactory=org.apache.lucene.store.SingleInstanceLockFactory@bc0d0834)),segFN=segments_1,generation=1}
[junit4] 2> 440826 T1957 oasc.SolrDeletionPolicy.updateCommits newest commit generation = 1
[junit4] 2> 440827 T1957 oass.SolrIndexSearcher.<init> Opening Searcher@f7f3199 main
[junit4] 2> 440827 T1957 oashc.SpellCheckComponent.inform Initializing spell checkers
[junit4] 2> 440832 T1957 oass.DirectSolrSpellChecker.init init: {name=direct,classname=DirectSolrSpellChecker,field=lowerfilt,minQueryLength=3}
[junit4] 2> 440852 T1958 oasc.SolrCore.registerSearcher [collection1] Registered new searcher Searcher@f7f3199 main{StandardDirectoryReader(segments_1:1:nrt)}
[junit4] 2> 440855 T1957 oasc.CoreContainer.registerCore registering core: collection1
[junit4] 2> 440857 T1956 oas.SolrTestCaseJ4.initCore ####initCore end
[junit4] 2> 440861 T1956 oas.SolrTestCaseJ4.setUp ###Starting testCommitWithin
[junit4] 2> ASYNC NEW_CORE C754 name=collection1 org.apache.solr.core.SolrCore@97ea5056
[junit4] 2> 440864 T1956 C754 oasup.LogUpdateProcessor.finish [collection1] webapp=null path=null params={} {deleteByQuery=*:* (-1458622039588864000)} 0 2
[junit4] 2> 440868 T1956 oasc.CoreContainer.reload Reloading SolrCore 'collection1' using instanceDir: /mnt/ssd/jenkins/workspace/Lucene-Solr-4.x-Linux/solr/build/solr-core/test-files/solr/collection1
[junit4] 2> 440868 T1956 oasc.SolrResourceLoader.<init> new SolrResourceLoader for directory: '/mnt/ssd/jenkins/workspace/Lucene-Solr-4.x-Linux/solr/build/solr-core/test-files/solr/collection1/'
[junit4] 2> 440869 T1956 oasc.SolrResourceLoader.replaceClassLoader Adding 'file:/mnt/ssd/jenkins/workspace/Lucene-Solr-4.x-Linux/solr/build/solr-core/test-files/solr/collection1/lib/classes/' to classloader
[junit4] 2> 440870 T1956 oasc.SolrResourceLoader.replaceClassLoader Adding 'file:/mnt/ssd/jenkins/workspace/Lucene-Solr-4.x-Linux/solr/build/solr-core/test-files/solr/collection1/lib/README' to classloader
[junit4] 2> 440922 T1956 oasc.SolrConfig.<init> Using Lucene MatchVersion: LUCENE_47
[junit4] 2> 440971 T1956 oasc.SolrConfig.<init> Loaded SolrConfig: solrconfig.xml
[junit4] 2> 440972 T1956 oass.IndexSchema.readSchema Reading Solr Schema from schema.xml
[junit4] 2> 440978 T1956 oass.IndexSchema.readSchema [collection1] Schema name=test
[junit4] 2> 441313 T1956 oass.ByteField.init WARN ByteField is deprecated and will be removed in 5.0. You should use TrieIntField instead.
[junit4] 2> 441314 T1956 oass.ShortField.init WARN ShortField is deprecated and will be removed in 5.0. You should use TrieIntField instead.
[junit4] 2> 441315 T1956 oass.OpenExchangeRatesOrgProvider.init Initialized with rates=open-exchange-rates.json, refreshInterval=1440.
[junit4] 2> 441320 T1956 oass.IndexSchema.readSchema default search field in schema is text
[junit4] 2> 441323 T1956 oass.IndexSchema.readSchema unique key field: id
[junit4] 2> 441328 T1956 oass.FileExchangeRateProvider.reload Reloading exchange rates from file currency.xml
[junit4] 2> 441332 T1956 oass.FileExchangeRateProvider.reload Reloading exchange rates from file currency.xml
[junit4] 2> 441336 T1956 oass.OpenExchangeRatesOrgProvider.reload Reloading exchange rates from open-exchange-rates.json
[junit4] 2> 441336 T1956 oass.OpenExchangeRatesOrgProvider$OpenExchangeRates.<init> WARN Unknown key IMPORTANT NOTE
[junit4] 2> 441337 T1956 oass.OpenExchangeRatesOrgProvider$OpenExchangeRates.<init> WARN Expected key, got STRING
[junit4] 2> 441338 T1956 oass.OpenExchangeRatesOrgProvider.reload Reloading exchange rates from open-exchange-rates.json
[junit4] 2> 441338 T1956 oass.OpenExchangeRatesOrgProvider$OpenExchangeRates.<init> WARN Unknown key IMPORTANT NOTE
[junit4] 2> 441339 T1956 oass.OpenExchangeRatesOrgProvider$OpenExchangeRates.<init> WARN Expected key, got STRING
[junit4] 2> 441339 T1956 oasc.SolrCore.<init> [collection1] Opening new SolrCore at /mnt/ssd/jenkins/workspace/Lucene-Solr-4.x-Linux/solr/build/solr-core/test-files/solr/collection1/, dataDir=/mnt/ssd/jenkins/workspace/Lucene-Solr-4.x-Linux/solr/build/solr-core/test/J1/./solrtest-HardAutoCommitTest-1391050374938/
[junit4] 2> 441340 T1956 oasc.JmxMonitoredMap.<init> JMX monitoring is enabled. Adding Solr mbeans to JMX Server: com.sun.jmx.mbeanserver.JmxMBeanServer@75ce0da8
[junit4] 2> 441341 T1956 oasc.SolrCore.getNewIndexDir New index directory detected: old=null new=/mnt/ssd/jenkins/workspace/Lucene-Solr-4.x-Linux/solr/build/solr-core/test/J1/./solrtest-HardAutoCommitTest-1391050374938/index/
[junit4] 2> 441341 T1956 oasc.SolrCore.initWriters created xml: solr.XMLResponseWriter
[junit4] 2> 441344 T1956 oasup.UpdateRequestProcessorChain.init creating updateRequestProcessorChain "dedupe"
[junit4] 2> 441345 T1956 oasup.UpdateRequestProcessorChain.init inserting DistributedUpdateProcessorFactory into updateRequestProcessorChain "dedupe"
[junit4] 2> 441345 T1956 oasup.UpdateRequestProcessorChain.init creating updateRequestProcessorChain "dedupe-allfields"
[junit4] 2> 441346 T1956 oasup.UpdateRequestProcessorChain.init inserting DistributedUpdateProcessorFactory into updateRequestProcessorChain "dedupe-allfields"
[junit4] 2> 441346 T1956 oasup.UpdateRequestProcessorChain.init creating updateRequestProcessorChain "stored_sig"
[junit4] 2> 441347 T1956 oasup.UpdateRequestProcessorChain.init inserting DistributedUpdateProcessorFactory into updateRequestProcessorChain "stored_sig"
[junit4] 2> 441347 T1956 oasup.UpdateRequestProcessorChain.init creating updateRequestProcessorChain "uniq-fields"
[junit4] 2> 441348 T1956 oasup.UniqFieldsUpdateProcessorFactory.init WARN Use of the 'fields' init param in UniqFieldsUpdateProcessorFactory is deprecated, please use 'fieldName' (or another FieldMutatingUpdateProcessorFactory selector option) instead
[junit4] 2> 441348 T1956 oasup.UniqFieldsUpdateProcessorFactory.init Replacing 'fields' init param with (individual) 'fieldName' params
[junit4] 2> 441349 T1956 oasup.UpdateRequestProcessorChain.init inserting DistributedUpdateProcessorFactory into updateRequestProcessorChain "uniq-fields"
[junit4] 2> 441349 T1956 oasup.UpdateRequestProcessorChain.init creating updateRequestProcessorChain "distrib-dup-test-chain-explicit"
[junit4] 2> 441350 T1956 oasup.UpdateRequestProcessorChain.init creating updateRequestProcessorChain "distrib-dup-test-chain-implicit"
[junit4] 2> 441350 T1956 oasup.UpdateRequestProcessorChain.init inserting DistributedUpdateProcessorFactory into updateRequestProcessorChain "distrib-dup-test-chain-implicit"
[junit4] 2> 441351 T1956 oasc.SolrCore.loadUpdateProcessorChains no updateRequestProcessorChain defined as default, creating implicit default
[junit4] 2> 441351 T1956 oasc.RequestHandlers.initHandlersFromConfig adding lazy requestHandler: solr.ReplicationHandler
[junit4] 2> 441352 T1956 oasc.RequestHandlers.initHandlersFromConfig created /replication: solr.ReplicationHandler
[junit4] 2> 441352 T1956 oasc.RequestHandlers.initHandlersFromConfig created standard: solr.StandardRequestHandler
[junit4] 2> 441353 T1956 oasc.RequestHandlers.initHandlersFromConfig created /get: solr.RealTimeGetHandler
[junit4] 2> 441354 T1956 oasc.RequestHandlers.initHandlersFromConfig created dismax: solr.SearchHandler
[junit4] 2> 441355 T1956 oasc.RequestHandlers.initHandlersFromConfig created mock: org.apache.solr.core.MockQuerySenderListenerReqHandler
[junit4] 2> 441355 T1956 oasc.RequestHandlers.initHandlersFromConfig created /admin/: org.apache.solr.handler.admin.AdminHandlers
[junit4] 2> 441356 T1956 oasc.RequestHandlers.initHandlersFromConfig created /admin/file: solr.admin.ShowFileRequestHandler
[junit4] 2> 441356 T1956 oasc.RequestHandlers.initHandlersFromConfig created defaults: solr.StandardRequestHandler
[junit4] 2> 441357 T1956 oasc.RequestHandlers.initHandlersFromConfig adding lazy requestHandler: solr.StandardRequestHandler
[junit4] 2> 441357 T1956 oasc.RequestHandlers.initHandlersFromConfig created lazy: solr.StandardRequestHandler
[junit4] 2> 441358 T1956 oasc.RequestHandlers.initHandlersFromConfig created /update: solr.UpdateRequestHandler
[junit4] 2> 441359 T1956 oasc.RequestHandlers.initHandlersFromConfig created /terms: org.apache.solr.handler.component.SearchHandler
[junit4] 2> 441359 T1956 oasc.RequestHandlers.initHandlersFromConfig created spellCheckCompRH: org.apache.solr.handler.component.SearchHandler
[junit4] 2> 441360 T1956 oasc.RequestHandlers.initHandlersFromConfig created spellCheckCompRH_Direct: org.apache.solr.handler.component.SearchHandler
[junit4] 2> 441361 T1956 oasc.RequestHandlers.initHandlersFromConfig created spellCheckWithWordbreak: org.apache.solr.handler.component.SearchHandler
[junit4] 2> 441361 T1956 oasc.RequestHandlers.initHandlersFromConfig created spellCheckWithWordbreak_Direct: org.apache.solr.handler.component.SearchHandler
[junit4] 2> 441362 T1956 oasc.RequestHandlers.initHandlersFromConfig created spellCheckCompRH1: org.apache.solr.handler.component.SearchHandler
[junit4] 2> 441363 T1956 oasc.RequestHandlers.initHandlersFromConfig created mltrh: org.apache.solr.handler.component.SearchHandler
[junit4] 2> 441363 T1956 oasc.RequestHandlers.initHandlersFromConfig created tvrh: org.apache.solr.handler.component.SearchHandler
[junit4] 2> 441364 T1956 oasc.RequestHandlers.initHandlersFromConfig created /mlt: solr.MoreLikeThisHandler
[junit4] 2> 441365 T1956 oasc.RequestHandlers.initHandlersFromConfig created /debug/dump: solr.DumpRequestHandler
[junit4] 2> 441366 T1956 oashl.XMLLoader.init xsltCacheLifetimeSeconds=60
[junit4] 2> 441368 T1956 oasc.SolrCore.initDeprecatedSupport WARN solrconfig.xml uses deprecated <admin/gettableFiles>, Please update your config to use the ShowFileRequestHandler.
[junit4] 2> 441369 T1956 oasu.CommitTracker.<init> Hard AutoCommit: disabled
[junit4] 2> 441370 T1956 oasu.CommitTracker.<init> Soft AutoCommit: disabled
[junit4] 2> 441371 T1956 oass.SolrIndexSearcher.<init> Opening Searcher@6a59d64a main
[junit4] 2> 441371 T1956 oashc.SpellCheckComponent.inform Initializing spell checkers
[junit4] 2> 441372 T1956 oass.DirectSolrSpellChecker.init init: {name=direct,classname=DirectSolrSpellChecker,field=lowerfilt,minQueryLength=3}
[junit4] 2> 441379 T1960 oasc.SolrCore.registerSearcher [collection1] Registered new searcher Searcher@6a59d64a main{StandardDirectoryReader(segments_1:1:nrt)}
[junit4] 2> 441384 T1956 oasu.DefaultSolrCoreState.newIndexWriter Creating new IndexWriter...
[junit4] 2> 441384 T1956 oasu.DefaultSolrCoreState.newIndexWriter Waiting until IndexWriter is unused... core=collection1
[junit4] 2> 441385 T1956 oasu.DefaultSolrCoreState.newIndexWriter Closing old IndexWriter... core=collection1
[junit4] 2> 441386 T1956 oasu.RandomMergePolicy.<init> RandomMergePolicy wrapping class org.apache.lucene.index.AlcoholicMergePolicy: [AlcoholicMergePolicy: minMergeSize=0, mergeFactor=10, maxMergeSize=1079268064, maxMergeSizeForForcedMerge=9223372036854775807, calibrateSizeByDeletes=true, maxMergeDocs=2147483647, maxCFSSegmentSizeMB=8.796093022207999E12, noCFSRatio=0.1]
[junit4] 2> 441387 T1956 oasc.SolrDeletionPolicy.onInit SolrDeletionPolicy.onInit: commits: num=1
[junit4] 2> commit{dir=RateLimitedDirectoryWrapper(MockDirectoryWrapper(org.apache.lucene.store.RAMDirectory@8ab600d4 lockFactory=org.apache.lucene.store.SingleInstanceLockFactory@bc0d0834)),segFN=segments_1,generation=1}
[junit4] 2> 441387 T1956 oasc.SolrDeletionPolicy.updateCommits newest commit generation = 1
[junit4] 2> 441388 T1956 oasu.DefaultSolrCoreState.newIndexWriter New IndexWriter is ready to be used.
[junit4] 2> 441388 T1956 oass.SolrIndexSearcher.<init> Opening Searcher@d4d549fa main
[junit4] 2> 441389 T1956 oasc.CoreContainer.registerCore replacing core: collection1
[junit4] 2> 441389 T1956 oasc.SolrCore.close [collection1] CLOSING SolrCore org.apache.solr.core.SolrCore@97ea5056
[junit4] 2> 441390 T1960 oasc.SolrCore.registerSearcher [collection1] Registered new searcher Searcher@d4d549fa main{StandardDirectoryReader(segments_1:1:nrt)}
[junit4] 2> 441394 T1956 oasu.DirectUpdateHandler2.close closing DirectUpdateHandler2{commits=0,autocommits=0,soft autocommits=0,optimizes=0,rollbacks=0,expungeDeletes=0,docsPending=0,adds=0,deletesById=0,deletesByQuery=1,errors=0,cumulative_adds=0,cumulative_deletesById=0,cumulative_deletesByQuery=1,cumulative_errors=0,transaction_logs_total_size=0,transaction_logs_total_number=0}
[junit4] 2> 441395 T1956 oasc.SolrCore.closeSearcher [collection1] Closing main searcher on request.
[junit4] 2> 441896 T1956 oasup.LogUpdateProcessor.finish [collection1] {add=[529 (1458622040672043008)]} 0 498
[junit4] 2> 443896 T1961 oasu.DirectUpdateHandler2.commit start commit{,optimize=false,openSearcher=true,waitSearcher=true,expungeDeletes=false,softCommit=false,prepareCommit=false}
[junit4] 2> 443898 T1961 oasc.SolrDeletionPolicy.onCommit SolrDeletionPolicy.onCommit: commits: num=2
[junit4] 2> commit{dir=RateLimitedDirectoryWrapper(MockDirectoryWrapper(org.apache.lucene.store.RAMDirectory@8ab600d4 lockFactory=org.apache.lucene.store.SingleInstanceLockFactory@bc0d0834)),segFN=segments_1,generation=1}
[junit4] 2> commit{dir=RateLimitedDirectoryWrapper(MockDirectoryWrapper(org.apache.lucene.store.RAMDirectory@8ab600d4 lockFactory=org.apache.lucene.store.SingleInstanceLockFactory@bc0d0834)),segFN=segments_2,generation=2}
[junit4] 2> 443899 T1961 oasc.SolrDeletionPolicy.updateCommits newest commit generation = 2
[junit4] 2> 443900 T1961 oass.SolrIndexSearcher.<init> Opening Searcher@436ca942 main
[junit4] 2> 443901 T1961 oasu.DirectUpdateHandler2.commit end_commit_flush
[junit4] 2> 443902 T1960 oasc.SolrCore.registerSearcher [collection1] Registered new searcher Searcher@436ca942 main{StandardDirectoryReader(segments_2:3:nrt _0(4.7):C1)}
[junit4] 2> ASYNC NEW_CORE C755 name=collection1 org.apache.solr.core.SolrCore@bdf84954
[junit4] 2> 444775 T1956 C755 oasc.SolrCore.execute [collection1] webapp=null path=null params={rows=20&start=0&version=2.2&qt=standard&q=id:529} hits=1 status=0 QTime=2878
[junit4] 2> 444788 T1956 oas.SolrTestCaseJ4.assertQ ERROR REQUEST FAILED: xpath=//result[@numFound=0]
[junit4] 2> xml response was: <?xml version="1.0" encoding="UTF-8"?>
[junit4] 2> <response>
[junit4] 2> <lst name="responseHeader"><int name="status">0</int><int name="QTime">2878</int></lst><result name="response" numFound="1" start="0"><doc><int name="id">529</int><int name="range_facet_si">529</int><arr name="range_facet_l"><long>529</long></arr><arr name="range_facet_sl"><long>529</long></arr><arr name="field_t"><str>what's inside?</str></arr><arr name="subject"><str>info</str></arr><long name="_version_">1458622040672043008</long><int name="intDefault">42</int><date name="timestamp">2014-01-30T02:52:57.533Z</date><arr name="multiDefault"><str>muLti-Default</str></arr></doc></result>
[junit4] 2> </response>
[junit4] 2>
[junit4] 2> request was:rows=20&start=0&version=2.2&qt=standard&q=id:529
[junit4] 2> 444789 T1956 oasc.SolrException.log ERROR REQUEST FAILED: rows=20&start=0&version=2.2&qt=standard&q=id:529:java.lang.RuntimeException: REQUEST FAILED: xpath=//result[@numFound=0]
[junit4] 2> xml response was: <?xml version="1.0" encoding="UTF-8"?>
[junit4] 2> <response>
[junit4] 2> <lst name="responseHeader"><int name="status">0</int><int name="QTime">2878</int></lst><result name="response" numFound="1" start="0"><doc><int name="id">529</int><int name="range_facet_si">529</int><arr name="range_facet_l"><long>529</long></arr><arr name="range_facet_sl"><long>529</long></arr><arr name="field_t"><str>what's inside?</str></arr><arr name="subject"><str>info</str></arr><long name="_version_">1458622040672043008</long><int name="intDefault">42</int><date name="timestamp">2014-01-30T02:52:57.533Z</date><arr name="multiDefault"><str>muLti-Default</str></arr></doc></result>
[junit4] 2> </response>
[junit4] 2>
[junit4] 2> request was:rows=20&start=0&version=2.2&qt=standard&q=id:529
[junit4] 2> at org.apache.solr.SolrTestCaseJ4.assertQ(SolrTestCaseJ4.java:637)
[junit4] 2> at org.apache.solr.update.HardAutoCommitTest.testCommitWithin(HardAutoCommitTest.java:79)
[junit4] 2> at sun.reflect.NativeMethodAccessorImpl.invoke0(Native Method)
[junit4] 2> at sun.reflect.NativeMethodAccessorImpl.invoke(NativeMethodAccessorImpl.java:88)
[junit4] 2> at sun.reflect.DelegatingMethodAccessorImpl.invoke(DelegatingMethodAccessorImpl.java:55)
[junit4] 2> at java.lang.reflect.Method.invoke(Method.java:613)
[junit4] 2> at com.carrotsearch.randomizedtesting.RandomizedRunner.invoke(RandomizedRunner.java:1559)
[junit4] 2> at com.carrotsearch.randomizedtesting.RandomizedRunner.access$600(RandomizedRunner.java:79)
[junit4] 2> at com.carrotsearch.randomizedtesting.RandomizedRunner$6.evaluate(RandomizedRunner.java:737)
[junit4] 2> at com.carrotsearch.randomizedtesting.RandomizedRunner$7.evaluate(RandomizedRunner.java:773)
[junit4] 2> at com.carrotsearch.randomizedtesting.RandomizedRunner$8.evaluate(RandomizedRunner.java:787)
[junit4] 2> at com.carrotsearch.randomizedtesting.rules.SystemPropertiesRestoreRule$1.evaluate(SystemPropertiesRestoreRule.java:53)
[junit4] 2> at org.apache.lucene.util.TestRuleSetupTeardownChained$1.evaluate(TestRuleSetupTeardownChained.java:50)
[junit4] 2> at org.apache.lucene.util.TestRuleFieldCacheSanity$1.evaluate(TestRuleFieldCacheSanity.java:51)
[junit4] 2> at org.apache.lucene.util.AbstractBeforeAfterRule$1.evaluate(AbstractBeforeAfterRule.java:46)
[junit4] 2> at com.carrotsearch.randomizedtesting.rules.SystemPropertiesInvariantRule$1.evaluate(SystemPropertiesInvariantRule.java:55)
[junit4] 2> at org.apache.lucene.util.TestRuleThreadAndTestName$1.evaluate(TestRuleThreadAndTestName.java:49)
[junit4] 2> at org.apache.lucene.util.TestRuleIgnoreAfterMaxFailures$1.evaluate(TestRuleIgnoreAfterMaxFailures.java:70)
[junit4] 2> at org.apache.lucene.util.TestRuleMarkFailure$1.evaluate(TestRuleMarkFailure.java:48)
[junit4] 2> at com.carrotsearch.randomizedtesting.rules.StatementAdapter.evaluate(StatementAdapter.java:36)
[junit4] 2> at com.carrotsearch.randomizedtesting.ThreadLeakControl$StatementRunner.run(ThreadLeakControl.java:358)
[junit4] 2> at com.carrotsearch.randomizedtesting.ThreadLeakControl.forkTimeoutingTask(ThreadLeakControl.java:782)
[junit4] 2> at com.carrotsearch.randomizedtesting.ThreadLeakControl$3.evaluate(ThreadLeakControl.java:442)
[junit4] 2> at com.carrotsearch.randomizedtesting.RandomizedRunner.runSingleTest(RandomizedRunner.java:746)
[junit4] 2> at com.carrotsearch.randomizedtesting.RandomizedRunner$3.evaluate(RandomizedRunner.java:648)
[junit4] 2> at com.carrotsearch.randomizedtesting.RandomizedRunner$4.evaluate(RandomizedRunner.java:682)
[junit4] 2> at com.carrotsearch.randomizedtesting.RandomizedRunner$5.evaluate(RandomizedRunner.java:693)
[junit4] 2> at com.carrotsearch.randomizedtesting.rules.StatementAdapter.evaluate(StatementAdapter.java:36)
[junit4] 2> at com.carrotsearch.randomizedtesting.rules.SystemPropertiesRestoreRule$1.evaluate(SystemPropertiesRestoreRule.java:53)
[junit4] 2> at org.apache.lucene.util.AbstractBeforeAfterRule$1.evaluate(AbstractBeforeAfterRule.java:46)
[junit4] 2> at org.apache.lucene.util.TestRuleStoreClassName$1.evaluate(TestRuleStoreClassName.java:42)
[junit4] 2> at com.carrotsearch.randomizedtesting.rules.SystemPropertiesInvariantRule$1.evaluate(SystemPropertiesInvariantRule.java:55)
[junit4] 2> at com.carrotsearch.randomizedtesting.rules.NoShadowingOrOverridesOnMethodsRule$1.evaluate(NoShadowingOrOverridesOnMethodsRule.java:39)
[junit4] 2> at com.carrotsearch.randomizedtesting.rules.NoShadowingOrOverridesOnMethodsRule$1.evaluate(NoShadowingOrOverridesOnMethodsRule.java:39)
[junit4] 2> at com.carrotsearch.randomizedtesting.rules.StatementAdapter.evaluate(StatementAdapter.java:36)
[junit4] 2> at org.apache.lucene.util.TestRuleAssertionsRequired$1.evaluate(TestRuleAssertionsRequired.java:43)
[junit4] 2> at org.apache.lucene.util.TestRuleMarkFailure$1.evaluate(TestRuleMarkFailure.java:48)
[junit4] 2> at org.apache.lucene.util.TestRuleIgnoreAfterMaxFailures$1.evaluate(TestRuleIgnoreAfterMaxFailures.java:70)
[junit4] 2> at org.apache.lucene.util.TestRuleIgnoreTestSuites$1.evaluate(TestRuleIgnoreTestSuites.java:55)
[junit4] 2> at com.carrotsearch.randomizedtesting.rules.StatementAdapter.evaluate(StatementAdapter.java:36)
[junit4] 2> at com.carrotsearch.randomizedtesting.ThreadLeakControl$StatementRunner.run(ThreadLeakControl.java:358)
[junit4] 2> at java.lang.Thread.run(Thread.java:780)
[junit4] 2>
[junit4] 2> 444790 T1956 oas.SolrTestCaseJ4.tearDown ###Ending testCommitWithin
[junit4] 2> NOTE: reproduce with: ant test -Dtestcase=HardAutoCommitTest -Dtests.method=testCommitWithin -Dtests.seed=306E79645EA3A8DE -Dtests.multiplier=3 -Dtests.slow=true -Dtests.locale=es_US -Dtests.timezone=Etc/GMT-12 -Dtests.file.encoding=UTF-8
[junit4] ERROR 3.94s J1 | HardAutoCommitTest.testCommitWithin <<<
[junit4] > Throwable #1: java.lang.RuntimeException: Exception during query
[junit4] > at __randomizedtesting.SeedInfo.seed([306E79645EA3A8DE:8ABC161CDD8D46CB]:0)
[junit4] > at org.apache.solr.SolrTestCaseJ4.assertQ(SolrTestCaseJ4.java:644)
[junit4] > at org.apache.solr.update.HardAutoCommitTest.testCommitWithin(HardAutoCommitTest.java:79)
[junit4] > at java.lang.Thread.run(Thread.java:780)
[junit4] > Caused by: java.lang.RuntimeException: REQUEST FAILED: xpath=//result[@numFound=0]
[junit4] > xml response was: <?xml version="1.0" encoding="UTF-8"?>
[junit4] > <response>
[junit4] > <lst name="responseHeader"><int name="status">0</int><int name="QTime">2878</int></lst><result name="response" numFound="1" start="0"><doc><int name="id">529</int><int name="range_facet_si">529</int><arr name="range_facet_l"><long>529</long></arr><arr name="range_facet_sl"><long>529</long></arr><arr name="field_t"><str>what's inside?</str></arr><arr name="subject"><str>info</str></arr><long name="_version_">1458622040672043008</long><int name="intDefault">42</int><date name="timestamp">2014-01-30T02:52:57.533Z</date><arr name="multiDefault"><str>muLti-Default</str></arr></doc></result>
[junit4] > </response>
[junit4] > request was:rows=20&start=0&version=2.2&qt=standard&q=id:529
[junit4] > at org.apache.solr.SolrTestCaseJ4.assertQ(SolrTestCaseJ4.java:637)
[junit4] > ... 41 more
[junit4] 2> 444801 T1956 oas.SolrTestCaseJ4.deleteCore ###deleteCore
[junit4] 2> 444801 T1956 oasc.CoreContainer.shutdown Shutting down CoreContainer instance=214436865
[junit4] 2> 444801 T1956 oasc.SolrCore.close [collection1] CLOSING SolrCore org.apache.solr.core.SolrCore@bdf84954
[junit4] 2> 444811 T1956 oasu.DirectUpdateHandler2.close closing DirectUpdateHandler2{commits=1,autocommits=1,soft autocommits=0,optimizes=0,rollbacks=0,expungeDeletes=0,docsPending=0,adds=0,deletesById=0,deletesByQuery=0,errors=0,cumulative_adds=1,cumulative_deletesById=0,cumulative_deletesByQuery=0,cumulative_errors=0,transaction_logs_total_size=151,transaction_logs_total_number=1}
[junit4] 2> 444812 T1956 oasu.SolrCoreState.decrefSolrCoreState Closing SolrCoreState
[junit4] 2> 444812 T1956 oasu.DefaultSolrCoreState.closeIndexWriter SolrCoreState ref count has reached 0 - closing IndexWriter
[junit4] 2> 444812 T1956 oasu.DefaultSolrCoreState.closeIndexWriter closing IndexWriter with IndexWriterCloser
[junit4] 2> 444813 T1956 oasc.SolrCore.closeSearcher [collection1] Closing main searcher on request.
[junit4] 2> 444814 T1956 oasc.CachingDirectoryFactory.close Closing MockDirectoryFactory - 2 directories currently being tracked
[junit4] 2> 444814 T1956 oasc.CachingDirectoryFactory.closeCacheValue looking to close /mnt/ssd/jenkins/workspace/Lucene-Solr-4.x-Linux/solr/build/solr-core/test/J1/./solrtest-HardAutoCommitTest-1391050374938/index [CachedDir<<refCount=0;path=/mnt/ssd/jenkins/workspace/Lucene-Solr-4.x-Linux/solr/build/solr-core/test/J1/./solrtest-HardAutoCommitTest-1391050374938/index;done=false>>]
[junit4] 2> 444814 T1956 oasc.CachingDirectoryFactory.close Closing directory: /mnt/ssd/jenkins/workspace/Lucene-Solr-4.x-Linux/solr/build/solr-core/test/J1/./solrtest-HardAutoCommitTest-1391050374938/index
[junit4] 2> 444815 T1956 oasc.CachingDirectoryFactory.closeCacheValue looking to close /mnt/ssd/jenkins/workspace/Lucene-Solr-4.x-Linux/solr/build/solr-core/test/J1/./solrtest-HardAutoCommitTest-1391050374938 [CachedDir<<refCount=0;path=/mnt/ssd/jenkins/workspace/Lucene-Solr-4.x-Linux/solr/build/solr-core/test/J1/./solrtest-HardAutoCommitTest-1391050374938;done=false>>]
[junit4] 2> 444815 T1956 oasc.CachingDirectoryFactory.close Closing directory: /mnt/ssd/jenkins/workspace/Lucene-Solr-4.x-Linux/solr/build/solr-core/test/J1/./solrtest-HardAutoCommitTest-1391050374938
[junit4] 2> NOTE: test params are: codec=Lucene46: {multiDefault=PostingsFormat(name=NestedPulsing), field_t=PostingsFormat(name=FSTPulsing41), intDefault=PostingsFormat(name=Memory doPackFST= true), id=PostingsFormat(name=FSTPulsing41), range_facet_si=PostingsFormat(name=NestedPulsing), range_facet_l=PostingsFormat(name=NestedPulsing), subject=PostingsFormat(name=NestedPulsing), _version_=PostingsFormat(name=Memory doPackFST= true), timestamp=PostingsFormat(name=NestedPulsing), text=MockVariableIntBlock(baseBlockSize=48), range_facet_sl=PostingsFormat(name=FSTPulsing41)}, docValues:{}, sim=DefaultSimilarity, locale=es_US, timezone=Etc/GMT-12
[junit4] 2> NOTE: Linux 3.8.0-35-generic x86/IBM Corporation 1.7.0 (32-bit)/cpus=8,threads=1,free=82782680,total=185270272
[junit4] 2> NOTE: All tests run in this JVM: [TestAtomicUpdateErrorCases, SpellingQueryConverterTest, TestIndexSearcher, SuggesterWFSTTest, TestUniqueKeyFieldResource, TestQuerySenderNoQuery, TestBinaryResponseWriter, HighlighterTest, TestCoreDiscovery, TestUtils, RAMDirectoryFactoryTest, MultiTermTest, HdfsRecoveryZkTest, TestDistributedMissingSort, TestRecovery, TestShardHandlerFactory, SolrRequestParserTest, StatsComponentTest, TestFastWriter, TestSchemaResource, TestIBSimilarityFactory, TestSchemaVersionResource, TestSolrCoreProperties, TestCollationField, TestPartialUpdateDeduplication, HighlighterConfigTest, TestSchemaSimilarityResource, TestXIncludeConfig, DateFieldTest, TestStressReorder, HdfsCollectionsAPIDistributedZkTest, SolrXmlInZkTest, TestRandomFaceting, FileUtilsTest, TestDFRSimilarityFactory, TestNumberUtils, CurrencyFieldOpenExchangeTest, HdfsChaosMonkeySafeLeaderTest, TriLevelCompositeIdRoutingTest, DistanceFunctionTest, SimplePostToolTest, IndexBasedSpellCheckerTest, FullSolrCloudDistribCmdsTest, DirectSolrSpellCheckerTest, RequiredFieldsTest, PluginInfoTest, TestSimpleQParserPlugin, SolrCoreCheckLockOnStartupTest, RequestHandlersTest, TestArbitraryIndexDir, ChaosMonkeySafeLeaderTest, DefaultValueUpdateProcessorTest, SolrIndexConfigTest, TestStressRecovery, HardAutoCommitTest]
[junit4] Completed on J1 in 5.58s, 1 test, 1 error <<< FAILURES!
[...truncated 92 lines...]
[junit4] Suite: org.apache.solr.handler.component.TermVectorComponentDistributedTest
[junit4] 2> 550258 T2310 oas.BaseDistributedSearchTestCase.initHostContext Setting hostContext system property: /
[junit4] 2> 550261 T2310 oas.SolrTestCaseJ4.setUp ###Starting testDistribSearch
[junit4] 2> 550263 T2310 oejs.Server.doStart jetty-8.1.10.v20130312
[junit4] 2> 550265 T2310 oejs.AbstractConnector.doStart Started SelectChannelConnector@127.0.0.1:56246
[junit4] 2> 550266 T2310 oass.SolrDispatchFilter.init SolrDispatchFilter.init()
[junit4] 2> 550266 T2310 oasc.SolrResourceLoader.locateSolrHome JNDI not configured for solr (NoInitialContextEx)
[junit4] 2> 550267 T2310 oasc.SolrResourceLoader.locateSolrHome using system property solr.solr.home: /mnt/ssd/jenkins/workspace/Lucene-Solr-4.x-Linux/solr/build/solr-core/test-files/solr
[junit4] 2> 550267 T2310 oasc.SolrResourceLoader.<init> new SolrResourceLoader for directory: '/mnt/ssd/jenkins/workspace/Lucene-Solr-4.x-Linux/solr/build/solr-core/test-files/solr/'
[junit4] 2> 550275 T2310 oasc.ConfigSolr.fromFile Loading container configuration from /mnt/ssd/jenkins/workspace/Lucene-Solr-4.x-Linux/solr/build/solr-core/test-files/solr/solr.xml
[junit4] 2> 550309 T2310 oasc.CoreContainer.<init> New CoreContainer -1430891325
[junit4] 2> 550310 T2310 oasc.CoreContainer.load Loading cores into CoreContainer [instanceDir=/mnt/ssd/jenkins/workspace/Lucene-Solr-4.x-Linux/solr/build/solr-core/test-files/solr/]
[junit4] 2> 550311 T2310 oashc.HttpShardHandlerFactory.getParameter Setting socketTimeout to: 90000
[junit4] 2> 550312 T2310 oashc.HttpShardHandlerFactory.getParameter Setting urlScheme to: http://
[junit4] 2> 550312 T2310 oashc.HttpShardHandlerFactory.getParameter Setting connTimeout to: 15000
[junit4] 2> 550313 T2310 oashc.HttpShardHandlerFactory.getParameter Setting maxConnectionsPerHost to: 20
[junit4] 2> 550313 T2310 oashc.HttpShardHandlerFactory.getParameter Setting corePoolSize to: 0
[junit4] 2> 550314 T2310 oashc.HttpShardHandlerFactory.getParameter Setting maximumPoolSize to: 2147483647
[junit4] 2> 550314 T2310 oashc.HttpShardHandlerFactory.getParameter Setting maxThreadIdleTime to: 5
[junit4] 2> 550315 T2310 oashc.HttpShardHandlerFactory.getParameter Setting sizeOfQueue to: -1
[junit4] 2> 550315 T2310 oashc.HttpShardHandlerFactory.getParameter Setting fairnessPolicy to: false
[junit4] 2> 550319 T2310 oasl.LogWatcher.createWatcher SLF4J impl is org.slf4j.impl.Log4jLoggerFactory
[junit4] 2> 550320 T2310 oasl.LogWatcher.newRegisteredLogWatcher Registering Log Listener [Log4j (org.slf4j.impl.Log4jLoggerFactory)]
[junit4] 2> 550320 T2310 oasc.CoreContainer.load Host Name: 127.0.0.1
[junit4] 2> 550324 T2320 oasc.CoreContainer.create Creating SolrCore 'collection1' using instanceDir: /mnt/ssd/jenkins/workspace/Lucene-Solr-4.x-Linux/solr/build/solr-core/test-files/solr/collection1
[junit4] 2> 550324 T2320 oasc.SolrResourceLoader.<init> new SolrResourceLoader for directory: '/mnt/ssd/jenkins/workspace/Lucene-Solr-4.x-Linux/solr/build/solr-core/test-files/solr/collection1/'
[junit4] 2> 550325 T2320 oasc.SolrResourceLoader.replaceClassLoader Adding 'file:/mnt/ssd/jenkins/workspace/Lucene-Solr-4.x-Linux/solr/build/solr-core/test-files/solr/collection1/lib/classes/' to classloader
[junit4] 2> 550325 T2320 oasc.SolrResourceLoader.replaceClassLoader Adding 'file:/mnt/ssd/jenkins/workspace/Lucene-Solr-4.x-Linux/solr/build/solr-core/test-files/solr/collection1/lib/README' to classloader
[junit4] 2> 550375 T2320 oasc.SolrConfig.<init> Using Lucene MatchVersion: LUCENE_47
[junit4] 2> 550429 T2320 oasc.SolrConfig.<init> Loaded SolrConfig: solrconfig.xml
[junit4] 2> 550430 T2320 oass.IndexSchema.readSchema Reading Solr Schema from schema.xml
[junit4] 2> 550436 T2320 oass.IndexSchema.readSchema [collection1] Schema name=test
[junit4] 2> 550783 T2320 oass.ByteField.init WARN ByteField is deprecated and will be removed in 5.0. You should use TrieIntField instead.
[junit4] 2> 550784 T2320 oass.ShortField.init WARN ShortField is deprecated and will be removed in 5.0. You should use TrieIntField instead.
[junit4] 2> 550784 T2320 oass.OpenExchangeRatesOrgProvider.init Initialized with rates=open-exchange-rates.json, refreshInterval=1440.
[junit4] 2> 550791 T2320 oass.IndexSchema.readSchema default search field in schema is text
[junit4] 2> 550794 T2320 oass.IndexSchema.readSchema unique key field: id
[junit4] 2> 550799 T2320 oass.FileExchangeRateProvider.reload Reloading exchange rates from file currency.xml
[junit4] 2> 550803 T2320 oass.FileExchangeRateProvider.reload Reloading exchange rates from file currency.xml
[junit4] 2> 550807 T2320 oass.OpenExchangeRatesOrgProvider.reload Reloading exchange rates from open-exchange-rates.json
[junit4] 2> 550807 T2320 oass.OpenExchangeRatesOrgProvider$OpenExchangeRates.<init> WARN Unknown key IMPORTANT NOTE
[junit4] 2> 550807 T2320 oass.OpenExchangeRatesOrgProvider$OpenExchangeRates.<init> WARN Expected key, got STRING
[junit4] 2> 550808 T2320 oass.OpenExchangeRatesOrgProvider.reload Reloading exchange rates from open-exchange-rates.json
[junit4] 2> 550808 T2320 oass.OpenExchangeRatesOrgProvider$OpenExchangeRates.<init> WARN Unknown key IMPORTANT NOTE
[junit4] 2> 550809 T2320 oass.OpenExchangeRatesOrgProvider$OpenExchangeRates.<init> WARN Expected key, got STRING
[junit4] 2> 550809 T2320 oasc.SolrCore.initDirectoryFactory org.apache.solr.core.MockDirectoryFactory
[junit4] 2> 550809 T2320 oasc.SolrCore.<init> [collection1] Opening new SolrCore at /mnt/ssd/jenkins/workspace/Lucene-Solr-4.x-Linux/solr/build/solr-core/test-files/solr/collection1/, dataDir=./org.apache.solr.handler.component.TermVectorComponentDistributedTest-1391050485900/control/data/
[junit4] 2> 550810 T2320 oasc.JmxMonitoredMap.<init> JMX monitoring is enabled. Adding Solr mbeans to JMX Server: com.sun.jmx.mbeanserver.JmxMBeanServer@75ce0da8
[junit4] 2> 550811 T2320 oasc.CachingDirectoryFactory.get return new directory for ./org.apache.solr.handler.component.TermVectorComponentDistributedTest-1391050485900/control/data
[junit4] 2> 550811 T2320 oasc.SolrCore.getNewIndexDir New index directory detected: old=null new=./org.apache.solr.handler.component.TermVectorComponentDistributedTest-1391050485900/control/data/index/
[junit4] 2> 550811 T2320 oasc.SolrCore.initIndex WARN [collection1] Solr index directory './org.apache.solr.handler.component.TermVectorComponentDistributedTest-1391050485900/control/data/index' doesn't exist. Creating new index...
[junit4] 2> 550812 T2320 oasc.CachingDirectoryFactory.get return new directory for ./org.apache.solr.handler.component.TermVectorComponentDistributedTest-1391050485900/control/data/index
[junit4] 2> 550812 T2320 oasu.RandomMergePolicy.<init> RandomMergePolicy wrapping class org.apache.lucene.index.LogByteSizeMergePolicy: [LogByteSizeMergePolicy: minMergeSize=1677721, mergeFactor=46, maxMergeSize=2147483648, maxMergeSizeForForcedMerge=9223372036854775807, calibrateSizeByDeletes=false, maxMergeDocs=2147483647, maxCFSSegmentSizeMB=8.796093022207999E12, noCFSRatio=0.5929081638136808]
[junit4] 2> 550813 T2320 oasc.SolrDeletionPolicy.onCommit SolrDeletionPolicy.onCommit: commits: num=1
[junit4] 2> commit{dir=RateLimitedDirectoryWrapper(MockDirectoryWrapper(org.apache.lucene.store.RAMDirectory@36b4bab4 lockFactory=org.apache.lucene.store.SingleInstanceLockFactory@1566e01c)),segFN=segments_1,generation=1}
[junit4] 2> 550813 T2320 oasc.SolrDeletionPolicy.updateCommits newest commit generation = 1
[junit4] 2> 550814 T2320 oasc.SolrCore.initWriters created xml: solr.XMLResponseWriter
[junit4] 2> 550816 T2320 oasup.UpdateRequestProcessorChain.init creating updateRequestProcessorChain "dedupe"
[junit4] 2> 550816 T2320 oasup.UpdateRequestProcessorChain.init inserting DistributedUpdateProcessorFactory into updateRequestProcessorChain "dedupe"
[junit4] 2> 550817 T2320 oasup.UpdateRequestProcessorChain.init creating updateRequestProcessorChain "dedupe-allfields"
[junit4] 2> 550817 T2320 oasup.UpdateRequestProcessorChain.init inserting DistributedUpdateProcessorFactory into updateRequestProcessorChain "dedupe-allfields"
[junit4] 2> 550817 T2320 oasup.UpdateRequestProcessorChain.init creating updateRequestProcessorChain "stored_sig"
[junit4] 2> 550818 T2320 oasup.UpdateRequestProcessorChain.init inserting DistributedUpdateProcessorFactory into updateRequestProcessorChain "stored_sig"
[junit4] 2> 550818 T2320 oasup.UpdateRequestProcessorChain.init creating updateRequestProcessorChain "uniq-fields"
[junit4] 2> 550818 T2320 oasup.UniqFieldsUpdateProcessorFactory.init WARN Use of the 'fields' init param in UniqFieldsUpdateProcessorFactory is deprecated, please use 'fieldName' (or another FieldMutatingUpdateProcessorFactory selector option) instead
[junit4] 2> 550819 T2320 oasup.UniqFieldsUpdateProcessorFactory.init Replacing 'fields' init param with (individual) 'fieldName' params
[junit4] 2> 550819 T2320 oasup.UpdateRequestProcessorChain.init inserting DistributedUpdateProcessorFactory into updateRequestProcessorChain "uniq-fields"
[junit4] 2> 550819 T2320 oasup.UpdateRequestProcessorChain.init creating updateRequestProcessorChain "distrib-dup-test-chain-explicit"
[junit4] 2> 550820 T2320 oasup.UpdateRequestProcessorChain.init creating updateRequestProcessorChain "distrib-dup-test-chain-implicit"
[junit4] 2> 550820 T2320 oasup.UpdateRequestProcessorChain.init inserting DistributedUpdateProcessorFactory into updateRequestProcessorChain "distrib-dup-test-chain-implicit"
[junit4] 2> 550821 T2320 oasc.SolrCore.loadUpdateProcessorChains no updateRequestProcessorChain defined as default, creating implicit default
[junit4] 2> 550821 T2320 oasc.RequestHandlers.initHandlersFromConfig adding lazy requestHandler: solr.ReplicationHandler
[junit4] 2> 550821 T2320 oasc.RequestHandlers.initHandlersFromConfig created /replication: solr.ReplicationHandler
[junit4] 2> 550822 T2320 oasc.RequestHandlers.initHandlersFromConfig created standard: solr.StandardRequestHandler
[junit4] 2> 550822 T2320 oasc.RequestHandlers.initHandlersFromConfig created /get: solr.RealTimeGetHandler
[junit4] 2> 550823 T2320 oasc.RequestHandlers.initHandlersFromConfig created dismax: solr.SearchHandler
[junit4] 2> 550823 T2320 oasc.RequestHandlers.initHandlersFromConfig created mock: org.apache.solr.core.MockQuerySenderListenerReqHandler
[junit4] 2> 550823 T2320 oasc.RequestHandlers.initHandlersFromConfig created /admin/: org.apache.solr.handler.admin.AdminHandlers
[junit4] 2> 550824 T2320 oasc.RequestHandlers.initHandlersFromConfig created /admin/file: solr.admin.ShowFileRequestHandler
[junit4] 2> 550824 T2320 oasc.RequestHandlers.initHandlersFromConfig created defaults: solr.StandardRequestHandler
[junit4] 2> 550825 T2320 oasc.RequestHandlers.initHandlersFromConfig adding lazy requestHandler: solr.StandardRequestHandler
[junit4] 2> 550825 T2320 oasc.RequestHandlers.initHandlersFromConfig created lazy: solr.StandardRequestHandler
[junit4] 2> 550825 T2320 oasc.RequestHandlers.initHandlersFromConfig created /update: solr.UpdateRequestHandler
[junit4] 2> 550826 T2320 oasc.RequestHandlers.initHandlersFromConfig created /terms: org.apache.solr.handler.component.SearchHandler
[junit4] 2> 550826 T2320 oasc.RequestHandlers.initHandlersFromConfig created spellCheckCompRH: org.apache.solr.handler.component.SearchHandler
[junit4] 2> 550827 T2320 oasc.RequestHandlers.initHandlersFromConfig created spellCheckCompRH_Direct: org.apache.solr.handler.component.SearchHandler
[junit4] 2> 550827 T2320 oasc.RequestHandlers.initHandlersFromConfig created spellCheckWithWordbreak: org.apache.solr.handler.component.SearchHandler
[junit4] 2> 550827 T2320 oasc.RequestHandlers.initHandlersFromConfig created spellCheckWithWordbreak_Direct: org.apache.solr.handler.component.SearchHandler
[junit4] 2> 550828 T2320 oasc.RequestHandlers.initHandlersFromConfig created spellCheckCompRH1: org.apache.solr.handler.component.SearchHandler
[junit4] 2> 550828 T2320 oasc.RequestHandlers.initHandlersFromConfig created mltrh: org.apache.solr.handler.component.SearchHandler
[junit4] 2> 550829 T2320 oasc.RequestHandlers.initHandlersFromConfig created tvrh: org.apache.solr.handler.component.SearchHandler
[junit4] 2> 550829 T2320 oasc.RequestHandlers.initHandlersFromConfig created /mlt: solr.MoreLikeThisHandler
[junit4] 2> 550830 T2320 oasc.RequestHandlers.initHandlersFromConfig created /debug/dump: solr.DumpRequestHandler
[junit4] 2> 550831 T2320 oashl.XMLLoader.init xsltCacheLifetimeSeconds=60
[junit4] 2> 550832 T2320 oasc.SolrCore.initDeprecatedSupport WARN solrconfig.xml uses deprecated <admin/gettableFiles>, Please update your config to use the ShowFileRequestHandler.
[junit4] 2> 550834 T2320 oasu.CommitTracker.<init> Hard AutoCommit: disabled
[junit4] 2> 550835 T2320 oasu.CommitTracker.<init> Soft AutoCommit: disabled
[junit4] 2> 550835 T2320 oasu.RandomMergePolicy.<init> RandomMergePolicy wrapping class org.apache.lucene.index.TieredMergePolicy: [TieredMergePolicy: maxMergeAtOnce=50, maxMergeAtOnceExplicit=35, maxMergedSegmentMB=30.490234375, floorSegmentMB=1.923828125, forceMergeDeletesPctAllowed=6.5149740477332525, segmentsPerTier=41.0, maxCFSSegmentSizeMB=8.796093022207999E12, noCFSRatio=1.0
[junit4] 2> 550836 T2320 oasc.SolrDeletionPolicy.onInit SolrDeletionPolicy.onInit: commits: num=1
[junit4] 2> commit{dir=RateLimitedDirectoryWrapper(MockDirectoryWrapper(org.apache.lucene.store.RAMDirectory@36b4bab4 lockFactory=org.apache.lucene.store.SingleInstanceLockFactory@1566e01c)),segFN=segments_1,generation=1}
[junit4] 2> 550836 T2320 oasc.SolrDeletionPolicy.updateCommits newest commit generation = 1
[junit4] 2> 550837 T2320 oass.SolrIndexSearcher.<init> Opening Searcher@aa2df85 main
[junit4] 2> 550837 T2320 oashc.SpellCheckComponent.inform Initializing spell checkers
[junit4] 2> 550971 T2320 oass.DirectSolrSpellChecker.init init: {name=direct,classname=DirectSolrSpellChecker,field=lowerfilt,minQueryLength=3}
[junit4] 2> 550988 T2321 oasc.SolrCore.registerSearcher [collection1] Registered new searcher Searcher@aa2df85 main{StandardDirectoryReader(segments_1:1:nrt)}
[junit4] 2> 550991 T2320 oasc.CoreContainer.registerCore registering core: collection1
[junit4] 2> 550992 T2310 oass.SolrDispatchFilter.init user.dir=/mnt/ssd/jenkins/workspace/Lucene-Solr-4.x-Linux/solr/build/solr-core/test/J1
[junit4] 2> 550993 T2310 oass.SolrDispatchFilter.init SolrDispatchFilter.init() done
[junit4] 2> 550995 T2310 oejs.Server.doStart jetty-8.1.10.v20130312
[junit4] 2> 550998 T2310 oejs.AbstractConnector.doStart Started SelectChannelConnector@127.0.0.1:50576
[junit4] 2> 550999 T2310 oass.SolrDispatchFilter.init SolrDispatchFilter.init()
[junit4] 2> 551000 T2310 oasc.SolrResourceLoader.locateSolrHome JNDI not configured for solr (NoInitialContextEx)
[junit4] 2> 551001 T2310 oasc.SolrResourceLoader.locateSolrHome using system property solr.solr.home: /mnt/ssd/jenkins/workspace/Lucene-Solr-4.x-Linux/solr/build/solr-core/test-files/solr
[junit4] 2> 551001 T2310 oasc.SolrResourceLoader.<init> new SolrResourceLoader for directory: '/mnt/ssd/jenkins/workspace/Lucene-Solr-4.x-Linux/solr/build/solr-core/test-files/solr/'
[junit4] 2> 551014 T2310 oasc.ConfigSolr.fromFile Loading container configuration from /mnt/ssd/jenkins/workspace/Lucene-Solr-4.x-Linux/solr/build/solr-core/test-files/solr/solr.xml
[junit4] 2> 551053 T2310 oasc.CoreContainer.<init> New CoreContainer 1198932545
[junit4] 2> 551053 T2310 oasc.CoreContainer.load Loading cores into CoreContainer [instanceDir=/mnt/ssd/jenkins/workspace/Lucene-Solr-4.x-Linux/solr/build/solr-core/test-files/solr/]
[junit4] 2> 551055 T2310 oashc.HttpShardHandlerFactory.getParameter Setting socketTimeout to: 90000
[junit4] 2> 551055 T2310 oashc.HttpShardHandlerFactory.getParameter Setting urlScheme to: http://
[junit4] 2> 551056 T2310 oashc.HttpShardHandlerFactory.getParameter Setting connTimeout to: 15000
[junit4] 2> 551056 T2310 oashc.HttpShardHandlerFactory.getParameter Setting maxConnectionsPerHost to: 20
[junit4] 2> 551057 T2310 oashc.HttpShardHandlerFactory.getParameter Setting corePoolSize to: 0
[junit4] 2> 551057 T2310 oashc.HttpShardHandlerFactory.getParameter Setting maximumPoolSize to: 2147483647
[junit4] 2> 551058 T2310 oashc.HttpShardHandlerFactory.getParameter Setting maxThreadIdleTime to: 5
[junit4] 2> 551059 T2310 oashc.HttpShardHandlerFactory.getParameter Setting sizeOfQueue to: -1
[junit4] 2> 551059 T2310 oashc.HttpShardHandlerFactory.getParameter Setting fairnessPolicy to: false
[junit4] 2> 551063 T2310 oasl.LogWatcher.createWatcher SLF4J impl is org.slf4j.impl.Log4jLoggerFactory
[junit4] 2> 551063 T2310 oasl.LogWatcher.newRegisteredLogWatcher Registering Log Listener [Log4j (org.slf4j.impl.Log4jLoggerFactory)]
[junit4] 2> 551064 T2310 oasc.CoreContainer.load Host Name: 127.0.0.1
[junit4] 2> 551067 T2332 oasc.CoreContainer.create Creating SolrCore 'collection1' using instanceDir: /mnt/ssd/jenkins/workspace/Lucene-Solr-4.x-Linux/solr/build/solr-core/test-files/solr/collection1
[junit4] 2> 551068 T2332 oasc.SolrResourceLoader.<init> new SolrResourceLoader for directory: '/mnt/ssd/jenkins/workspace/Lucene-Solr-4.x-Linux/solr/build/solr-core/test-files/solr/collection1/'
[junit4] 2> 551068 T2332 oasc.SolrResourceLoader.replaceClassLoader Adding 'file:/mnt/ssd/jenkins/workspace/Lucene-Solr-4.x-Linux/solr/build/solr-core/test-files/solr/collection1/lib/classes/' to classloader
[junit4] 2> 551069 T2332 oasc.SolrResourceLoader.replaceClassLoader Adding 'file:/mnt/ssd/jenkins/workspace/Lucene-Solr-4.x-Linux/solr/build/solr-core/test-files/solr/collection1/lib/README' to classloader
[junit4] 2> 551104 T2332 oasc.SolrConfig.<init> Using Lucene MatchVersion: LUCENE_47
[junit4] 2> 551175 T2332 oasc.SolrConfig.<init> Loaded SolrConfig: solrconfig.xml
[junit4] 2> 551176 T2332 oass.IndexSchema.readSchema Reading Solr Schema from schema.xml
[junit4] 2> 551186 T2332 oass.IndexSchema.readSchema [collection1] Schema name=test
[junit4] 2> 551514 T2332 oass.ByteField.init WARN ByteField is deprecated and will be removed in 5.0. You should use TrieIntField instead.
[junit4] 2> 551515 T2332 oass.ShortField.init WARN ShortField is deprecated and will be removed in 5.0. You should use TrieIntField instead.
[junit4] 2> 551515 T2332 oass.OpenExchangeRatesOrgProvider.init Initialized with rates=open-exchange-rates.json, refreshInterval=1440.
[junit4] 2> 551520 T2332 oass.IndexSchema.readSchema default search field in schema is text
[junit4] 2> 551523 T2332 oass.IndexSchema.readSchema unique key field: id
[junit4] 2> 551528 T2332 oass.FileExchangeRateProvider.reload Reloading exchange rates from file currency.xml
[junit4] 2> 551531 T2332 oass.FileExchangeRateProvider.reload Reloading exchange rates from file currency.xml
[junit4] 2> 551535 T2332 oass.OpenExchangeRatesOrgProvider.reload Reloading exchange rates from open-exchange-rates.json
[junit4] 2> 551541 T2332 oass.OpenExchangeRatesOrgProvider$OpenExchangeRates.<init> WARN Unknown key IMPORTANT NOTE
[junit4] 2> 551542 T2332 oass.OpenExchangeRatesOrgProvider$OpenExchangeRates.<init> WARN Expected key, got STRING
[junit4] 2> 551542 T2332 oass.OpenExchangeRatesOrgProvider.reload Reloading exchange rates from open-exchange-rates.json
[junit4] 2> 551543 T2332 oass.OpenExchangeRatesOrgProvider$OpenExchangeRates.<init> WARN Unknown key IMPORTANT NOTE
[junit4] 2> 551543 T2332 oass.OpenExchangeRatesOrgProvider$OpenExchangeRates.<init> WARN Expected key, got STRING
[junit4] 2> 551543 T2332 oasc.SolrCore.initDirectoryFactory org.apache.solr.core.MockDirectoryFactory
[junit4] 2> 551544 T2332 oasc.SolrCore.<init> [collection1] Opening new SolrCore at /mnt/ssd/jenkins/workspace/Lucene-Solr-4.x-Linux/solr/build/solr-core/test-files/solr/collection1/, dataDir=./org.apache.solr.handler.component.TermVectorComponentDistributedTest-1391050485900/shard0/data/
[junit4] 2> 551544 T2332 oasc.JmxMonitoredMap.<init> JMX monitoring is enabled. Adding Solr mbeans to JMX Server: com.sun.jmx.mbeanserver.JmxMBeanServer@75ce0da8
[junit4] 2> 551545 T2332 oasc.CachingDirectoryFactory.get return new directory for ./org.apache.solr.handler.component.TermVectorComponentDistributedTest-1391050485900/shard0/data
[junit4] 2> 551545 T2332 oasc.SolrCore.getNewIndexDir New index directory detected: old=null new=./org.apache.solr.handler.component.TermVectorComponentDistributedTest-1391050485900/shard0/data/index/
[junit4] 2> 551546 T2332 oasc.SolrCore.initIndex WARN [collection1] Solr index directory './org.apache.solr.handler.component.TermVectorComponentDistributedTest-1391050485900/shard0/data/index' doesn't exist. Creating new index...
[junit4] 2> 551546 T2332 oasc.CachingDirectoryFactory.get return new directory for ./org.apache.solr.handler.component.TermVectorComponentDistributedTest-1391050485900/shard0/data/index
[junit4] 2> 551547 T2332 oasu.RandomMergePolicy.<init> RandomMergePolicy wrapping class org.apache.lucene.index.LogByteSizeMergePolicy: [LogByteSizeMergePolicy: minMergeSize=1677721, mergeFactor=46, maxMergeSize=2147483648, maxMergeSizeForForcedMerge=9223372036854775807, calibrateSizeByDeletes=false, maxMergeDocs=2147483647, maxCFSSegmentSizeMB=8.796093022207999E12, noCFSRatio=0.5929081638136808]
[junit4] 2> 551547 T2332 oasc.SolrDeletionPolicy.onCommit SolrDeletionPolicy.onCommit: commits: num=1
[junit4] 2> commit{dir=RateLimitedDirectoryWrapper(MockDirectoryWrapper(org.apache.lucene.store.RAMDirectory@e4257829 lockFactory=org.apache.lucene.store.SingleInstanceLockFactory@f74a6da9)),segFN=segments_1,generation=1}
[junit4] 2> 551548 T2332 oasc.SolrDeletionPolicy.updateCommits newest commit generation = 1
[junit4] 2> 551548 T2332 oasc.SolrCore.initWriters created xml: solr.XMLResponseWriter
[junit4] 2> 551550 T2332 oasup.UpdateRequestProcessorChain.init creating updateRequestProcessorChain "dedupe"
[junit4] 2> 551551 T2332 oasup.UpdateRequestProcessorChain.init inserting DistributedUpdateProcessorFactory into updateRequestProcessorChain "dedupe"
[junit4] 2> 551551 T2332 oasup.UpdateRequestProcessorChain.init creating updateRequestProcessorChain "dedupe-allfields"
[junit4] 2> 551552 T2332 oasup.UpdateRequestProcessorChain.init inserting DistributedUpdateProcessorFactory into updateRequestProcessorChain "dedupe-allfields"
[junit4] 2> 551552 T2332 oasup.UpdateRequestProcessorChain.init creating updateRequestProcessorChain "stored_sig"
[junit4] 2> 551552 T2332 oasup.UpdateRequestProcessorChain.init inserting DistributedUpdateProcessorFactory into updateRequestProcessorChain "stored_sig"
[junit4] 2> 551553 T2332 oasup.UpdateRequestProcessorChain.init creating updateRequestProcessorChain "uniq-fields"
[junit4] 2> 551553 T2332 oasup.UniqFieldsUpdateProcessorFactory.init WARN Use of the 'fields' init param in UniqFieldsUpdateProcessorFactory is deprecated, please use 'fieldName' (or another FieldMutatingUpdateProcessorFactory selector option) instead
[junit4] 2> 551553 T2332 oasup.UniqFieldsUpdateProcessorFactory.init Replacing 'fields' init param with (individual) 'fieldName' params
[junit4] 2> 551554 T2332 oasup.UpdateRequestProcessorChain.init inserting DistributedUpdateProcessorFactory into updateRequestProcessorChain "uniq-fields"
[junit4] 2> 551554 T2332 oasup.UpdateRequestProcessorChain.init creating updateRequestProcessorChain "distrib-dup-test-chain-explicit"
[junit4] 2> 551554 T2332 oasup.UpdateRequestProcessorChain.init creating updateRequestProcessorChain "distrib-dup-test-chain-implicit"
[junit4] 2> 551555 T2332 oasup.UpdateRequestProcessorChain.init inserting DistributedUpdateProcessorFactory into updateRequestProcessorChain "distrib-dup-test-chain-implicit"
[junit4] 2> 551555 T2332 oasc.SolrCore.loadUpdateProcessorChains no updateRequestProcessorChain defined as default, creating implicit default
[junit4] 2> 551556 T2332 oasc.RequestHandlers.initHandlersFromConfig adding lazy requestHandler: solr.ReplicationHandler
[junit4] 2> 551556 T2332 oasc.RequestHandlers.initHandlersFromConfig created /replication: solr.ReplicationHandler
[junit4] 2> 551556 T2332 oasc.RequestHandlers.initHandlersFromConfig created standard: solr.StandardRequestHandler
[junit4] 2> 551557 T2332 oasc.RequestHandlers.initHandlersFromConfig created /get: solr.RealTimeGetHandler
[junit4] 2> 551557 T2332 oasc.R
[...truncated too long message...]
Registered new searcher Searcher@c632a52f main{StandardDirectoryReader(segments_10:156:nrt)}
[junit4] 2> 1061267 T4349 C1281 oasup.LogUpdateProcessor.finish [collection1] webapp=null path=null params={} {commit=} 0 6
[junit4] 2> 1061272 T4349 oasu.DirectUpdateHandler2.commit start commit{,optimize=false,openSearcher=true,waitSearcher=true,expungeDeletes=false,softCommit=false,prepareCommit=false}
[junit4] 2> 1061273 T4349 oasc.SolrDeletionPolicy.onCommit SolrDeletionPolicy.onCommit: commits: num=2
[junit4] 2> commit{dir=RateLimitedDirectoryWrapper(MockDirectoryWrapper(org.apache.lucene.store.RAMDirectory@32ac5b16 lockFactory=org.apache.lucene.store.SingleInstanceLockFactory@e386a8c0)),segFN=segments_10,generation=36}
[junit4] 2> commit{dir=RateLimitedDirectoryWrapper(MockDirectoryWrapper(org.apache.lucene.store.RAMDirectory@32ac5b16 lockFactory=org.apache.lucene.store.SingleInstanceLockFactory@e386a8c0)),segFN=segments_11,generation=37}
[junit4] 2> 1061274 T4349 oasc.SolrDeletionPolicy.updateCommits newest commit generation = 37
[junit4] 2> 1061275 T4349 oass.SolrIndexSearcher.<init> Opening Searcher@ab96ac41 main
[junit4] 2> 1061276 T4349 oasu.DirectUpdateHandler2.commit end_commit_flush
[junit4] 2> 1061277 T4351 oasc.SolrCore.registerSearcher [collection1] Registered new searcher Searcher@ab96ac41 main{StandardDirectoryReader(segments_11:158:nrt _1b(4.7):c3)}
[junit4] 2> 1061278 T4349 oas.SolrTestCaseJ4.tearDown ###Ending testDupeAllFieldsDetection
[junit4] 2> 1061282 T4349 oas.SolrTestCaseJ4.setUp ###Starting testFailNonIndexedSigWithOverwriteDupes
[junit4] 2> 1061283 T4349 C1281 oasu.DirectUpdateHandler2.deleteAll [collection1] REMOVING ALL DOCUMENTS FROM INDEX
[junit4] 2> 1061283 T4349 C1281 oasup.LogUpdateProcessor.finish [collection1] webapp=null path=null params={} {deleteByQuery=*:*} 0 0
[junit4] 2> 1061285 T4349 C1281 oasu.DirectUpdateHandler2.commit start commit{,optimize=false,openSearcher=true,waitSearcher=true,expungeDeletes=false,softCommit=false,prepareCommit=false}
[junit4] 2> 1061285 T4349 C1281 oasc.SolrDeletionPolicy.onCommit SolrDeletionPolicy.onCommit: commits: num=2
[junit4] 2> commit{dir=RateLimitedDirectoryWrapper(MockDirectoryWrapper(org.apache.lucene.store.RAMDirectory@32ac5b16 lockFactory=org.apache.lucene.store.SingleInstanceLockFactory@e386a8c0)),segFN=segments_11,generation=37}
[junit4] 2> commit{dir=RateLimitedDirectoryWrapper(MockDirectoryWrapper(org.apache.lucene.store.RAMDirectory@32ac5b16 lockFactory=org.apache.lucene.store.SingleInstanceLockFactory@e386a8c0)),segFN=segments_12,generation=38}
[junit4] 2> 1061286 T4349 C1281 oasc.SolrDeletionPolicy.updateCommits newest commit generation = 38
[junit4] 2> 1061287 T4349 C1281 oass.SolrIndexSearcher.<init> Opening Searcher@dfc710c main
[junit4] 2> 1061288 T4349 C1281 oasu.DirectUpdateHandler2.commit end_commit_flush
[junit4] 2> 1061289 T4351 oasc.SolrCore.registerSearcher [collection1] Registered new searcher Searcher@dfc710c main{StandardDirectoryReader(segments_12:159:nrt)}
[junit4] 2> 1061290 T4349 C1281 oasup.LogUpdateProcessor.finish [collection1] webapp=null path=null params={} {commit=} 0 5
[junit4] 2> 1061291 T4349 oas.SolrTestCaseJ4.tearDown ###Ending testFailNonIndexedSigWithOverwriteDupes
[junit4] 2> 1061293 T4349 oas.SolrTestCaseJ4.deleteCore ###deleteCore
[junit4] 2> 1061293 T4349 oasc.CoreContainer.shutdown Shutting down CoreContainer instance=1917722782
[junit4] 2> 1061294 T4349 oasc.SolrCore.close [collection1] CLOSING SolrCore org.apache.solr.core.SolrCore@6b9c2711
[junit4] 2> 1061313 T4349 oasu.DirectUpdateHandler2.close closing DirectUpdateHandler2{commits=42,autocommits=0,soft autocommits=0,optimizes=0,rollbacks=0,expungeDeletes=0,docsPending=0,adds=0,deletesById=0,deletesByQuery=0,errors=0,cumulative_adds=253,cumulative_deletesById=0,cumulative_deletesByQuery=6,cumulative_errors=0}
[junit4] 2> 1061314 T4349 oasu.SolrCoreState.decrefSolrCoreState Closing SolrCoreState
[junit4] 2> 1061314 T4349 oasu.DefaultSolrCoreState.closeIndexWriter SolrCoreState ref count has reached 0 - closing IndexWriter
[junit4] 2> 1061314 T4349 oasu.DefaultSolrCoreState.closeIndexWriter closing IndexWriter with IndexWriterCloser
[junit4] 2> 1061315 T4349 oasc.SolrCore.closeSearcher [collection1] Closing main searcher on request.
[junit4] 2> 1061315 T4349 oasc.CachingDirectoryFactory.close Closing MockDirectoryFactory - 2 directories currently being tracked
[junit4] 2> 1061316 T4349 oasc.CachingDirectoryFactory.closeCacheValue looking to close /mnt/ssd/jenkins/workspace/Lucene-Solr-4.x-Linux/solr/build/solr-core/test/J0/./solrtest-SignatureUpdateProcessorFactoryTest-1391050994541 [CachedDir<<refCount=0;path=/mnt/ssd/jenkins/workspace/Lucene-Solr-4.x-Linux/solr/build/solr-core/test/J0/./solrtest-SignatureUpdateProcessorFactoryTest-1391050994541;done=false>>]
[junit4] 2> 1061316 T4349 oasc.CachingDirectoryFactory.close Closing directory: /mnt/ssd/jenkins/workspace/Lucene-Solr-4.x-Linux/solr/build/solr-core/test/J0/./solrtest-SignatureUpdateProcessorFactoryTest-1391050994541
[junit4] 2> 1061317 T4349 oasc.CachingDirectoryFactory.closeCacheValue looking to close /mnt/ssd/jenkins/workspace/Lucene-Solr-4.x-Linux/solr/build/solr-core/test/J0/./solrtest-SignatureUpdateProcessorFactoryTest-1391050994541/index [CachedDir<<refCount=0;path=/mnt/ssd/jenkins/workspace/Lucene-Solr-4.x-Linux/solr/build/solr-core/test/J0/./solrtest-SignatureUpdateProcessorFactoryTest-1391050994541/index;done=false>>]
[junit4] 2> 1061317 T4349 oasc.CachingDirectoryFactory.close Closing directory: /mnt/ssd/jenkins/workspace/Lucene-Solr-4.x-Linux/solr/build/solr-core/test/J0/./solrtest-SignatureUpdateProcessorFactoryTest-1391050994541/index
[junit4] 2> NOTE: test params are: codec=Lucene40, sim=DefaultSimilarity, locale=el_GR_PREEURO, timezone=Asia/Hong_Kong
[junit4] 2> NOTE: Linux 3.8.0-35-generic x86/IBM Corporation 1.7.0 (32-bit)/cpus=8,threads=1,free=189589920,total=261554176
[junit4] 2> NOTE: All tests run in this JVM: [CacheHeaderTest, SolrInfoMBeanTest, TestRealTimeGet, AutoCommitTest, SOLR749Test, TestElisionMultitermQuery, CoreMergeIndexesAdminHandlerTest, SynonymTokenizerTest, TestDocumentBuilder, CursorMarkTest, TestNonNRTOpen, TestFreeTextSuggestions, HdfsLockFactoryTest, ChangedSchemaMergeTest, TestBadConfig, ClusterStateTest, SliceStateUpdateTest, CachingDirectoryFactoryTest, UpdateParamsTest, FieldMutatingUpdateProcessorTest, TestSolrDeletionPolicy1, TermsComponentTest, SyncSliceTest, TestStressVersions, DocValuesTest, SolrCoreTest, TestFaceting, TestPHPSerializedResponseWriter, OverseerTest, StressHdfsTest, TestDefaultSearchFieldResource, RegexBoostProcessorTest, AnalysisAfterCoreReloadTest, DistributedSpellCheckComponentTest, TestGroupingSearch, TestSearchPerf, TestSolrQueryParserDefaultOperatorResource, EchoParamsTest, TestRemoteStreaming, TestPseudoReturnFields, URLClassifyProcessorTest, TestSolrXmlPersistor, BlockDirectoryTest, TestSolrIndexConfig, CircularListTest, TestImplicitCoreProperties, TestCharFilters, AssignTest, TestInfoStreamLogging, PolyFieldTest, AddSchemaFieldsUpdateProcessorFactoryTest, TestExtendedDismaxParser, BasicDistributedZkTest, TestDynamicFieldResource, TestTrie, DeleteShardTest, PreAnalyzedUpdateProcessorTest, TestSurroundQueryParser, TestLuceneMatchVersion, LeaderElectionTest, TestRandomMergePolicy, TestCloudManagedSchema, BadCopyFieldTest, CSVRequestHandlerTest, TestAddFieldRealTimeGet, SuggesterFSTTest, SystemInfoHandlerTest, TestCollapseQParserPlugin, TestRandomDVFaceting, ClusterStateUpdateTest, UnloadDistributedZkTest, UUIDFieldTest, ResourceLoaderTest, CoreAdminHandlerTest, LoggingHandlerTest, TestReloadAndDeleteDocs, TestManagedSchemaFieldResource, DateMathParserTest, TestCoreContainer, DocValuesMissingTest, SampleTest, QueryEqualityTest, CollectionsAPIDistributedZkTest, OpenCloseCoreStressTest, ShardRoutingTest, BasicZkTest, ZkCLITest, ShardRoutingCustomTest, TestDistributedSearch, TestDistributedGrouping, TestMultiCoreConfBootstrap, DistributedTermsComponentTest, TestRangeQuery, SimpleFacetsTest, SpellCheckComponentTest, SolrCmdDistributorTest, QueryElevationComponentTest, TestSort, TestFunctionQuery, BasicFunctionalityTest, TestLazyCores, OverseerCollectionProcessorTest, SoftAutoCommitTest, CurrencyFieldXmlFileTest, SignatureUpdateProcessorFactoryTest]
[junit4] Completed on J0 in 2.49s, 6 tests, 1 failure <<< FAILURES!
[...truncated 455 lines...]
BUILD FAILED
/mnt/ssd/jenkins/workspace/Lucene-Solr-4.x-Linux/build.xml:459: The following error occurred while executing this line:
/mnt/ssd/jenkins/workspace/Lucene-Solr-4.x-Linux/build.xml:452: The following error occurred while executing this line:
/mnt/ssd/jenkins/workspace/Lucene-Solr-4.x-Linux/build.xml:39: The following error occurred while executing this line:
/mnt/ssd/jenkins/workspace/Lucene-Solr-4.x-Linux/extra-targets.xml:37: The following error occurred while executing this line:
/mnt/ssd/jenkins/workspace/Lucene-Solr-4.x-Linux/solr/build.xml:189: The following error occurred while executing this line:
/mnt/ssd/jenkins/workspace/Lucene-Solr-4.x-Linux/solr/common-build.xml:491: The following error occurred while executing this line:
/mnt/ssd/jenkins/workspace/Lucene-Solr-4.x-Linux/lucene/common-build.xml:1308: The following error occurred while executing this line:
/mnt/ssd/jenkins/workspace/Lucene-Solr-4.x-Linux/lucene/common-build.xml:941: There were test failures: 355 suites, 1549 tests, 1 error, 3 failures, 35 ignored (7 assumptions)
Total time: 55 minutes 32 seconds
Build step 'Invoke Ant' marked build as failure
Description set: Java: 32bit/ibm-j9-jdk7 -Xjit:exclude={org/apache/lucene/util/fst/FST.pack(IIF)Lorg/apache/lucene/util/fst/FST;}
Archiving artifacts
Recording test results
Email was triggered for: Failure
Sending email for trigger: Failure