You are viewing a plain text version of this content. The canonical link for it is here.
Posted to notifications@directory.apache.org by Apache Jenkins Server <je...@builds.apache.org> on 2014/03/10 05:03:59 UTC

Build failed in Jenkins: dir-apacheds-ubuntu-deploy #1285

See <https://builds.apache.org/job/dir-apacheds-ubuntu-deploy/1285/>

------------------------------------------
[...truncated 152 lines...]
[INFO] Installing <https://builds.apache.org/job/dir-apacheds-ubuntu-deploy/ws/trunk/i18n/pom.xml> to /home/jenkins/jenkins-slave/maven-repositories/1/org/apache/directory/server/apacheds-i18n/2.0.0-M17-SNAPSHOT/apacheds-i18n-2.0.0-M17-SNAPSHOT.pom
[INFO] 
[INFO] --- maven-bundle-plugin:2.3.7:install (default-install) @ apacheds-i18n ---
[INFO] Installing org/apache/directory/server/apacheds-i18n/2.0.0-M17-SNAPSHOT/apacheds-i18n-2.0.0-M17-SNAPSHOT.jar
[INFO] Writing OBR metadata
[INFO] 
[INFO] --- maven-deploy-plugin:2.7:deploy (default-deploy) @ apacheds-i18n ---
Downloading: https://repository.apache.org/content/repositories/snapshots/org/apache/directory/server/apacheds-i18n/2.0.0-M17-SNAPSHOT/maven-metadata.xml
Downloaded: https://repository.apache.org/content/repositories/snapshots/org/apache/directory/server/apacheds-i18n/2.0.0-M17-SNAPSHOT/maven-metadata.xml (802 B at 2.1 KB/sec)
Uploading: https://repository.apache.org/content/repositories/snapshots/org/apache/directory/server/apacheds-i18n/2.0.0-M17-SNAPSHOT/apacheds-i18n-2.0.0-M17-20140310.040234-3.jar
Uploaded: https://repository.apache.org/content/repositories/snapshots/org/apache/directory/server/apacheds-i18n/2.0.0-M17-SNAPSHOT/apacheds-i18n-2.0.0-M17-20140310.040234-3.jar (44 KB at 118.9 KB/sec)
Uploading: https://repository.apache.org/content/repositories/snapshots/org/apache/directory/server/apacheds-i18n/2.0.0-M17-SNAPSHOT/apacheds-i18n-2.0.0-M17-20140310.040234-3.pom
Uploaded: https://repository.apache.org/content/repositories/snapshots/org/apache/directory/server/apacheds-i18n/2.0.0-M17-SNAPSHOT/apacheds-i18n-2.0.0-M17-20140310.040234-3.pom (3 KB at 6.4 KB/sec)
Downloading: https://repository.apache.org/content/repositories/snapshots/org/apache/directory/server/apacheds-i18n/maven-metadata.xml
Downloaded: https://repository.apache.org/content/repositories/snapshots/org/apache/directory/server/apacheds-i18n/maven-metadata.xml (496 B at 1.9 KB/sec)
Uploading: https://repository.apache.org/content/repositories/snapshots/org/apache/directory/server/apacheds-i18n/2.0.0-M17-SNAPSHOT/maven-metadata.xml
Uploaded: https://repository.apache.org/content/repositories/snapshots/org/apache/directory/server/apacheds-i18n/2.0.0-M17-SNAPSHOT/maven-metadata.xml (802 B at 2.5 KB/sec)
Uploading: https://repository.apache.org/content/repositories/snapshots/org/apache/directory/server/apacheds-i18n/maven-metadata.xml
Uploaded: https://repository.apache.org/content/repositories/snapshots/org/apache/directory/server/apacheds-i18n/maven-metadata.xml (496 B at 1.2 KB/sec)
[INFO] 
[INFO] --- maven-bundle-plugin:2.3.7:deploy (default-deploy) @ apacheds-i18n ---
[INFO] Remote OBR update disabled (enable with -DremoteOBR)
[JENKINS] Archiving disabled
[INFO]                                                                         
[INFO] ------------------------------------------------------------------------
[INFO] Building ApacheDS Core Constants 2.0.0-M17-SNAPSHOT
[INFO] ------------------------------------------------------------------------
[INFO] 
[INFO] --- maven-clean-plugin:2.4.1:clean (default-clean) @ apacheds-core-constants ---
[INFO] Deleting <https://builds.apache.org/job/dir-apacheds-ubuntu-deploy/ws/trunk/core-constants/target>
[INFO] 
[INFO] --- maven-remote-resources-plugin:1.2.1:process (default) @ apacheds-core-constants ---
[INFO] 
[INFO] --- maven-resources-plugin:2.6:resources (default-resources) @ apacheds-core-constants ---
[INFO] Using 'UTF-8' encoding to copy filtered resources.
[INFO] Copying 0 resource
[INFO] Copying 3 resources
[INFO] 
[INFO] --- maven-compiler-plugin:3.1:compile (default-compile) @ apacheds-core-constants ---
[INFO] Changes detected - recompiling the module!
[INFO] Compiling 4 source files to <https://builds.apache.org/job/dir-apacheds-ubuntu-deploy/ws/trunk/core-constants/target/classes>
[INFO] 
[INFO] --- maven-resources-plugin:2.6:testResources (default-testResources) @ apacheds-core-constants ---
[INFO] Using 'UTF-8' encoding to copy filtered resources.
[INFO] skip non existing resourceDirectory <https://builds.apache.org/job/dir-apacheds-ubuntu-deploy/ws/trunk/core-constants/src/test/resources>
[INFO] Copying 3 resources
[INFO] 
[INFO] --- maven-compiler-plugin:3.1:testCompile (default-testCompile) @ apacheds-core-constants ---
[INFO] No sources to compile
[INFO] 
[INFO] --- maven-surefire-plugin:2.15:test (default-test) @ apacheds-core-constants ---
[INFO] 
[JENKINS] Recording test results[INFO] --- maven-bundle-plugin:2.3.7:bundle (default-bundle) @ apacheds-core-constants ---

[INFO] 
[INFO] --- maven-site-plugin:3.3:attach-descriptor (attach-descriptor) @ apacheds-core-constants ---
[INFO] 
[INFO] --- tools-maven-plugin:1.4:verify-legal-files (verify-legal-files) @ apacheds-core-constants ---
[INFO] Checking legal files in: apacheds-core-constants-2.0.0-M17-SNAPSHOT.jar
[INFO] 
[INFO] --- maven-install-plugin:2.4:install (default-install) @ apacheds-core-constants ---
[INFO] Installing <https://builds.apache.org/job/dir-apacheds-ubuntu-deploy/ws/trunk/core-constants/target/apacheds-core-constants-2.0.0-M17-SNAPSHOT.jar> to /home/jenkins/jenkins-slave/maven-repositories/1/org/apache/directory/server/apacheds-core-constants/2.0.0-M17-SNAPSHOT/apacheds-core-constants-2.0.0-M17-SNAPSHOT.jar
[INFO] Installing <https://builds.apache.org/job/dir-apacheds-ubuntu-deploy/ws/trunk/core-constants/pom.xml> to /home/jenkins/jenkins-slave/maven-repositories/1/org/apache/directory/server/apacheds-core-constants/2.0.0-M17-SNAPSHOT/apacheds-core-constants-2.0.0-M17-SNAPSHOT.pom
[INFO] 
[INFO] --- maven-bundle-plugin:2.3.7:install (default-install) @ apacheds-core-constants ---
[INFO] Installing org/apache/directory/server/apacheds-core-constants/2.0.0-M17-SNAPSHOT/apacheds-core-constants-2.0.0-M17-SNAPSHOT.jar
[INFO] Writing OBR metadata
[INFO] 
[INFO] --- maven-deploy-plugin:2.7:deploy (default-deploy) @ apacheds-core-constants ---
Downloading: https://repository.apache.org/content/repositories/snapshots/org/apache/directory/server/apacheds-core-constants/2.0.0-M17-SNAPSHOT/maven-metadata.xml
Downloaded: https://repository.apache.org/content/repositories/snapshots/org/apache/directory/server/apacheds-core-constants/2.0.0-M17-SNAPSHOT/maven-metadata.xml (812 B at 1.3 KB/sec)
Uploading: https://repository.apache.org/content/repositories/snapshots/org/apache/directory/server/apacheds-core-constants/2.0.0-M17-SNAPSHOT/apacheds-core-constants-2.0.0-M17-20140310.040245-3.jar
Uploaded: https://repository.apache.org/content/repositories/snapshots/org/apache/directory/server/apacheds-core-constants/2.0.0-M17-SNAPSHOT/apacheds-core-constants-2.0.0-M17-20140310.040245-3.jar (10 KB at 30.3 KB/sec)
Uploading: https://repository.apache.org/content/repositories/snapshots/org/apache/directory/server/apacheds-core-constants/2.0.0-M17-SNAPSHOT/apacheds-core-constants-2.0.0-M17-20140310.040245-3.pom
Uploaded: https://repository.apache.org/content/repositories/snapshots/org/apache/directory/server/apacheds-core-constants/2.0.0-M17-SNAPSHOT/apacheds-core-constants-2.0.0-M17-20140310.040245-3.pom (3 KB at 6.9 KB/sec)
Downloading: https://repository.apache.org/content/repositories/snapshots/org/apache/directory/server/apacheds-core-constants/maven-metadata.xml
Downloaded: https://repository.apache.org/content/repositories/snapshots/org/apache/directory/server/apacheds-core-constants/maven-metadata.xml (506 B at 1.3 KB/sec)
Uploading: https://repository.apache.org/content/repositories/snapshots/org/apache/directory/server/apacheds-core-constants/2.0.0-M17-SNAPSHOT/maven-metadata.xml
Uploaded: https://repository.apache.org/content/repositories/snapshots/org/apache/directory/server/apacheds-core-constants/2.0.0-M17-SNAPSHOT/maven-metadata.xml (812 B at 2.6 KB/sec)
Uploading: https://repository.apache.org/content/repositories/snapshots/org/apache/directory/server/apacheds-core-constants/maven-metadata.xml
Uploaded: https://repository.apache.org/content/repositories/snapshots/org/apache/directory/server/apacheds-core-constants/maven-metadata.xml (506 B at 1.2 KB/sec)
[INFO] 
[INFO] --- maven-bundle-plugin:2.3.7:deploy (default-deploy) @ apacheds-core-constants ---
[INFO] Remote OBR update disabled (enable with -DremoteOBR)
[JENKINS] Archiving disabled
[INFO]                                                                         
[INFO] ------------------------------------------------------------------------
[INFO] Building ApacheDS Core API 2.0.0-M17-SNAPSHOT
[INFO] ------------------------------------------------------------------------
Downloading: http://repo.maven.apache.org/maven2/org/apache/directory/api/api-i18n/1.0.0-M21/api-i18n-1.0.0-M21.pom
[WARNING] The POM for org.apache.directory.api:api-i18n:jar:1.0.0-M21 is missing, no dependency information available
Downloading: http://repo.maven.apache.org/maven2/org/apache/directory/api/api-asn1-api/1.0.0-M21/api-asn1-api-1.0.0-M21.pom
[WARNING] The POM for org.apache.directory.api:api-asn1-api:jar:1.0.0-M21 is missing, no dependency information available
Downloading: http://repo.maven.apache.org/maven2/org/apache/directory/api/api-ldap-client-api/1.0.0-M21/api-ldap-client-api-1.0.0-M21.pom
[WARNING] The POM for org.apache.directory.api:api-ldap-client-api:jar:1.0.0-M21 is missing, no dependency information available
Downloading: http://repo.maven.apache.org/maven2/org/apache/directory/api/api-ldap-codec-core/1.0.0-M21/api-ldap-codec-core-1.0.0-M21.pom
[WARNING] The POM for org.apache.directory.api:api-ldap-codec-core:jar:1.0.0-M21 is missing, no dependency information available
Downloading: http://repo.maven.apache.org/maven2/org/apache/directory/api/api-ldap-extras-aci/1.0.0-M21/api-ldap-extras-aci-1.0.0-M21.pom
[WARNING] The POM for org.apache.directory.api:api-ldap-extras-aci:jar:1.0.0-M21 is missing, no dependency information available
Downloading: http://repo.maven.apache.org/maven2/org/apache/directory/api/api-ldap-extras-util/1.0.0-M21/api-ldap-extras-util-1.0.0-M21.pom
[WARNING] The POM for org.apache.directory.api:api-ldap-extras-util:jar:1.0.0-M21 is missing, no dependency information available
Downloading: http://repo.maven.apache.org/maven2/org/apache/directory/api/api-ldap-model/1.0.0-M21/api-ldap-model-1.0.0-M21.pom
[WARNING] The POM for org.apache.directory.api:api-ldap-model:jar:1.0.0-M21 is missing, no dependency information available
Downloading: http://repo.maven.apache.org/maven2/org/apache/directory/api/api-ldap-schema-data/1.0.0-M21/api-ldap-schema-data-1.0.0-M21.pom
[WARNING] The POM for org.apache.directory.api:api-ldap-schema-data:jar:1.0.0-M21 is missing, no dependency information available
Downloading: http://repo.maven.apache.org/maven2/org/apache/directory/api/api-util/1.0.0-M21/api-util-1.0.0-M21.pom
[WARNING] The POM for org.apache.directory.api:api-util:jar:1.0.0-M21 is missing, no dependency information available
Downloading: http://repo.maven.apache.org/maven2/org/apache/directory/api/api-i18n/1.0.0-M21/api-i18n-1.0.0-M21.jar
Downloading: http://repo.maven.apache.org/maven2/org/apache/directory/api/api-asn1-api/1.0.0-M21/api-asn1-api-1.0.0-M21.jar
Downloading: http://repo.maven.apache.org/maven2/org/apache/directory/api/api-ldap-client-api/1.0.0-M21/api-ldap-client-api-1.0.0-M21.jar
Downloading: http://repo.maven.apache.org/maven2/org/apache/directory/api/api-ldap-codec-core/1.0.0-M21/api-ldap-codec-core-1.0.0-M21.jar
Downloading: http://repo.maven.apache.org/maven2/org/apache/directory/api/api-ldap-extras-aci/1.0.0-M21/api-ldap-extras-aci-1.0.0-M21.jar
Downloading: http://repo.maven.apache.org/maven2/org/apache/directory/api/api-ldap-extras-util/1.0.0-M21/api-ldap-extras-util-1.0.0-M21.jar
Downloading: http://repo.maven.apache.org/maven2/org/apache/directory/api/api-ldap-model/1.0.0-M21/api-ldap-model-1.0.0-M21.jar
Downloading: http://repo.maven.apache.org/maven2/org/apache/directory/api/api-util/1.0.0-M21/api-util-1.0.0-M21.jar
Downloading: http://repo.maven.apache.org/maven2/org/apache/directory/api/api-ldap-schema-data/1.0.0-M21/api-ldap-schema-data-1.0.0-M21.jar
[JENKINS] Archiving disabled
[INFO] ------------------------------------------------------------------------
[INFO] Reactor Summary:
[INFO] 
[INFO] ApacheDS .......................................... SUCCESS [26.224s]
[INFO] ApacheDS I18n ..................................... SUCCESS [15.100s]
[INFO] ApacheDS Core Constants ........................... SUCCESS [10.455s]
[INFO] ApacheDS Core API ................................. FAILURE [1.362s]
[INFO] ApacheDS Core Shared .............................. SKIPPED
[INFO] ApacheDS Interceptors ............................. SKIPPED
[INFO] ApacheDS AdministrativePoint Interceptor .......... SKIPPED
[INFO] ApacheDS Authentication Interceptor ............... SKIPPED
[INFO] ApacheDS Authorization Interceptor ................ SKIPPED
[INFO] ApacheDS ChangeLog Interceptor .................... SKIPPED
[INFO] ApacheDS Collective Attribute Interceptor ......... SKIPPED
[INFO] ApacheDS Event Interceptor ........................ SKIPPED
[INFO] ApacheDS Exception Interceptor .................... SKIPPED
[INFO] ApacheDS Journal Interceptor ...................... SKIPPED
[INFO] ApacheDS Normalization Interceptor ................ SKIPPED
[INFO] ApacheDS Operational Attribute Interceptor ........ SKIPPED
[INFO] ApacheDS Referral Interceptor ..................... SKIPPED
[INFO] ApacheDS Schema Interceptor ....................... SKIPPED
[INFO] ApacheDS Subtree Interceptor ...................... SKIPPED
[INFO] ApacheDS Triggers Interceptor ..................... SKIPPED
[INFO] ApacheDS Core ..................................... SKIPPED
[INFO] ApacheDS Core AVL ................................. SKIPPED
[INFO] ApacheDS Generalized (X) DBM Partition ............ SKIPPED
[INFO] ApacheDS LDIF Partition ........................... SKIPPED
[INFO] ApacheDS JDBM Partition ........................... SKIPPED
[INFO] ApacheDS Mavibot Partition ........................ SKIPPED
[INFO] ApacheDS Core Annotations ......................... SKIPPED
[INFO] ApacheDS Core JNDI ................................ SKIPPED
[INFO] ApacheDS Protocol Kerberos Codec .................. SKIPPED
[INFO] ApacheDS Interceptors for Kerberos ................ SKIPPED
[INFO] ApacheDS Protocol Dhcp ............................ SKIPPED
[INFO] ApacheDS Protocol Shared .......................... SKIPPED
[INFO] ApacheDS Protocol Dns ............................. SKIPPED
[INFO] ApacheDS Protocol Kerberos ........................ SKIPPED
[INFO] ApacheDS Protocol Ldap ............................ SKIPPED
[INFO] ApacheDS Protocol Ntp ............................. SKIPPED
[INFO] Apacheds Server Annotations ....................... SKIPPED
[INFO] ApacheDS Server Config ............................ SKIPPED
[INFO] ApacheDS Server JNDI .............................. SKIPPED
[INFO] ApacheDS Test Framework ........................... SKIPPED
[INFO] ApacheDS All ...................................... SKIPPED
[INFO] ApacheDS Logger Interceptor ....................... SKIPPED
[INFO] ApacheDS Password Hashing Interceptor ............. SKIPPED
[INFO] ApacheDS Core Integration ......................... SKIPPED
[INFO] ApacheDS Protocol Kerberos Test ................... SKIPPED
[INFO] ApacheDS Server Integration ....................... SKIPPED
[INFO] ApacheDS DirectoryService-WebApp bridge ........... SKIPPED
[INFO] ApacheDS Jetty HTTP Server Integration ............ SKIPPED
[INFO] ApacheDS Service Builder .......................... SKIPPED
[INFO] Apache Directory LDAP Client API test ............. SKIPPED
[INFO] kerberos-client ................................... SKIPPED
[INFO] ApacheDS Service .................................. SKIPPED
[INFO] ApacheDS Wrapper .................................. SKIPPED
[INFO] ApacheDS Installers Maven Plugin .................. SKIPPED
[INFO] ApacheDS Installers ............................... SKIPPED
[INFO] ------------------------------------------------------------------------
[INFO] BUILD FAILURE
[INFO] ------------------------------------------------------------------------
[INFO] Total time: 1:23.893s
[INFO] Finished at: Mon Mar 10 04:02:51 UTC 2014
[INFO] Final Memory: 38M/347M
[INFO] ------------------------------------------------------------------------
[JENKINS] Archiving disabled
[JENKINS] Archiving disabled
[JENKINS] Archiving disabled
[JENKINS] Archiving disabled
[JENKINS] Archiving disabled
[JENKINS] Archiving disabled
[JENKINS] Archiving disabled
[JENKINS] Archiving disabled
[JENKINS] Archiving disabled
[JENKINS] Archiving disabled
[JENKINS] Archiving disabled
[JENKINS] Archiving disabled
[JENKINS] Archiving disabled
[JENKINS] Archiving disabled
[JENKINS] Archiving disabled
[JENKINS] Archiving disabled
[JENKINS] Archiving disabled
[JENKINS] Archiving disabled
[JENKINS] Archiving disabled
[JENKINS] Archiving disabled
[JENKINS] Archiving disabled
[JENKINS] Archiving disabled
[JENKINS] Archiving disabled
[JENKINS] Archiving disabled
[JENKINS] Archiving disabled
[JENKINS] Archiving disabled
[JENKINS] Archiving disabled
[JENKINS] Archiving disabled
[JENKINS] Archiving disabled
[JENKINS] Archiving disabled
[JENKINS] Archiving disabled
[JENKINS] Archiving disabled
[JENKINS] Archiving disabled
[JENKINS] Archiving disabled
[JENKINS] Archiving disabled
[JENKINS] Archiving disabled
[JENKINS] Archiving disabled
[JENKINS] Archiving disabled
[JENKINS] Archiving disabled
[JENKINS] Archiving disabled
[JENKINS] Archiving disabled
[JENKINS] Archiving disabled
[JENKINS] Archiving disabled
[JENKINS] Archiving disabled
[JENKINS] Archiving disabled
[JENKINS] Archiving disabled
[JENKINS] Archiving disabled
[JENKINS] Archiving disabled
[JENKINS] Archiving disabled
[JENKINS] Archiving disabled
[JENKINS] Archiving disabled
[JENKINS] Archiving disabled
[JENKINS] Archiving disabled
[JENKINS] Archiving disabled
[JENKINS] Archiving disabled
Waiting for Jenkins to finish collecting data[ERROR] Failed to execute goal on project apacheds-core-api: Could not resolve dependencies for project org.apache.directory.server:apacheds-core-api:bundle:2.0.0-M17-SNAPSHOT: The following artifacts could not be resolved: org.apache.directory.api:api-i18n:jar:1.0.0-M21, org.apache.directory.api:api-asn1-api:jar:1.0.0-M21, org.apache.directory.api:api-ldap-client-api:jar:1.0.0-M21, org.apache.directory.api:api-ldap-codec-core:jar:1.0.0-M21, org.apache.directory.api:api-ldap-extras-aci:jar:1.0.0-M21, org.apache.directory.api:api-ldap-extras-util:jar:1.0.0-M21, org.apache.directory.api:api-ldap-model:jar:1.0.0-M21, org.apache.directory.api:api-ldap-schema-data:jar:1.0.0-M21, org.apache.directory.api:api-util:jar:1.0.0-M21: Could not find artifact org.apache.directory.api:api-i18n:jar:1.0.0-M21 in central (http://repo.maven.apache.org/maven2) -> [Help 1]
[ERROR] 
[ERROR] To see the full stack trace of the errors, re-run Maven with the -e switch.
[ERROR] Re-run Maven using the -X switch to enable full debug logging.
[ERROR] 
[ERROR] For more information about the errors and possible solutions, please read the following articles:
[ERROR] [Help 1] http://cwiki.apache.org/confluence/display/MAVEN/DependencyResolutionException
[ERROR] 
[ERROR] After correcting the problems, you can resume the build with the command
[ERROR]   mvn <goals> -rf :apacheds-core-api

channel stopped

Jenkins build is back to stable : dir-apacheds-ubuntu-deploy #1291

Posted by Apache Jenkins Server <je...@builds.apache.org>.
See <https://builds.apache.org/job/dir-apacheds-ubuntu-deploy/1291/changes>


Jenkins build is still unstable: dir-apacheds-ubuntu-deploy #1290

Posted by Apache Jenkins Server <je...@builds.apache.org>.
See <https://builds.apache.org/job/dir-apacheds-ubuntu-deploy/1290/>


Jenkins build is still unstable: dir-apacheds-ubuntu-deploy #1289

Posted by Apache Jenkins Server <je...@builds.apache.org>.
See <https://builds.apache.org/job/dir-apacheds-ubuntu-deploy/1289/>


Jenkins build is unstable: dir-apacheds-ubuntu-deploy #1288

Posted by Apache Jenkins Server <je...@builds.apache.org>.
See <https://builds.apache.org/job/dir-apacheds-ubuntu-deploy/1288/>


Build failed in Jenkins: dir-apacheds-ubuntu-deploy #1287

Posted by Apache Jenkins Server <je...@builds.apache.org>.
See <https://builds.apache.org/job/dir-apacheds-ubuntu-deploy/1287/>

------------------------------------------
[...truncated 152 lines...]
[INFO] Installing <https://builds.apache.org/job/dir-apacheds-ubuntu-deploy/ws/trunk/i18n/pom.xml> to /home/jenkins/jenkins-slave/maven-repositories/0/org/apache/directory/server/apacheds-i18n/2.0.0-M17-SNAPSHOT/apacheds-i18n-2.0.0-M17-SNAPSHOT.pom
[INFO] 
[INFO] --- maven-bundle-plugin:2.3.7:install (default-install) @ apacheds-i18n ---
[INFO] Installing org/apache/directory/server/apacheds-i18n/2.0.0-M17-SNAPSHOT/apacheds-i18n-2.0.0-M17-SNAPSHOT.jar
[INFO] Writing OBR metadata
[INFO] 
[INFO] --- maven-deploy-plugin:2.7:deploy (default-deploy) @ apacheds-i18n ---
Downloading: https://repository.apache.org/content/repositories/snapshots/org/apache/directory/server/apacheds-i18n/2.0.0-M17-SNAPSHOT/maven-metadata.xml
Downloaded: https://repository.apache.org/content/repositories/snapshots/org/apache/directory/server/apacheds-i18n/2.0.0-M17-SNAPSHOT/maven-metadata.xml (802 B at 0.6 KB/sec)
Uploading: https://repository.apache.org/content/repositories/snapshots/org/apache/directory/server/apacheds-i18n/2.0.0-M17-SNAPSHOT/apacheds-i18n-2.0.0-M17-20140312.041125-5.jar
Uploaded: https://repository.apache.org/content/repositories/snapshots/org/apache/directory/server/apacheds-i18n/2.0.0-M17-SNAPSHOT/apacheds-i18n-2.0.0-M17-20140312.041125-5.jar (44 KB at 131.8 KB/sec)
Uploading: https://repository.apache.org/content/repositories/snapshots/org/apache/directory/server/apacheds-i18n/2.0.0-M17-SNAPSHOT/apacheds-i18n-2.0.0-M17-20140312.041125-5.pom
Uploaded: https://repository.apache.org/content/repositories/snapshots/org/apache/directory/server/apacheds-i18n/2.0.0-M17-SNAPSHOT/apacheds-i18n-2.0.0-M17-20140312.041125-5.pom (3 KB at 7.0 KB/sec)
Downloading: https://repository.apache.org/content/repositories/snapshots/org/apache/directory/server/apacheds-i18n/maven-metadata.xml
Downloaded: https://repository.apache.org/content/repositories/snapshots/org/apache/directory/server/apacheds-i18n/maven-metadata.xml (496 B at 2.4 KB/sec)
Uploading: https://repository.apache.org/content/repositories/snapshots/org/apache/directory/server/apacheds-i18n/2.0.0-M17-SNAPSHOT/maven-metadata.xml
Uploaded: https://repository.apache.org/content/repositories/snapshots/org/apache/directory/server/apacheds-i18n/2.0.0-M17-SNAPSHOT/maven-metadata.xml (802 B at 1.2 KB/sec)
Uploading: https://repository.apache.org/content/repositories/snapshots/org/apache/directory/server/apacheds-i18n/maven-metadata.xml
Uploaded: https://repository.apache.org/content/repositories/snapshots/org/apache/directory/server/apacheds-i18n/maven-metadata.xml (496 B at 0.2 KB/sec)
[INFO] 
[INFO] --- maven-bundle-plugin:2.3.7:deploy (default-deploy) @ apacheds-i18n ---
[INFO] Remote OBR update disabled (enable with -DremoteOBR)
[JENKINS] Archiving disabled
[INFO]                                                                         
[INFO] ------------------------------------------------------------------------
[INFO] Building ApacheDS Core Constants 2.0.0-M17-SNAPSHOT
[INFO] ------------------------------------------------------------------------
[INFO] 
[INFO] --- maven-clean-plugin:2.4.1:clean (default-clean) @ apacheds-core-constants ---
[INFO] Deleting <https://builds.apache.org/job/dir-apacheds-ubuntu-deploy/ws/trunk/core-constants/target>
[INFO] 
[INFO] --- maven-remote-resources-plugin:1.2.1:process (default) @ apacheds-core-constants ---
[INFO] 
[INFO] --- maven-resources-plugin:2.6:resources (default-resources) @ apacheds-core-constants ---
[INFO] Using 'UTF-8' encoding to copy filtered resources.
[INFO] Copying 0 resource
[INFO] Copying 3 resources
[INFO] 
[INFO] --- maven-compiler-plugin:3.1:compile (default-compile) @ apacheds-core-constants ---
[INFO] Changes detected - recompiling the module!
[INFO] Compiling 4 source files to <https://builds.apache.org/job/dir-apacheds-ubuntu-deploy/ws/trunk/core-constants/target/classes>
[INFO] 
[INFO] --- maven-resources-plugin:2.6:testResources (default-testResources) @ apacheds-core-constants ---
[INFO] Using 'UTF-8' encoding to copy filtered resources.
[INFO] skip non existing resourceDirectory <https://builds.apache.org/job/dir-apacheds-ubuntu-deploy/ws/trunk/core-constants/src/test/resources>
[INFO] Copying 3 resources
[INFO] 
[INFO] --- maven-compiler-plugin:3.1:testCompile (default-testCompile) @ apacheds-core-constants ---
[INFO] No sources to compile
[INFO] 
[INFO] --- maven-surefire-plugin:2.15:test (default-test) @ apacheds-core-constants ---
[JENKINS] Recording test results[INFO] 
[INFO] --- maven-bundle-plugin:2.3.7:bundle (default-bundle) @ apacheds-core-constants ---

[INFO] 
[INFO] --- maven-site-plugin:3.3:attach-descriptor (attach-descriptor) @ apacheds-core-constants ---
[INFO] 
[INFO] --- tools-maven-plugin:1.4:verify-legal-files (verify-legal-files) @ apacheds-core-constants ---
[INFO] Checking legal files in: apacheds-core-constants-2.0.0-M17-SNAPSHOT.jar
[INFO] 
[INFO] --- maven-install-plugin:2.4:install (default-install) @ apacheds-core-constants ---
[INFO] Installing <https://builds.apache.org/job/dir-apacheds-ubuntu-deploy/ws/trunk/core-constants/target/apacheds-core-constants-2.0.0-M17-SNAPSHOT.jar> to /home/jenkins/jenkins-slave/maven-repositories/0/org/apache/directory/server/apacheds-core-constants/2.0.0-M17-SNAPSHOT/apacheds-core-constants-2.0.0-M17-SNAPSHOT.jar
[INFO] Installing <https://builds.apache.org/job/dir-apacheds-ubuntu-deploy/ws/trunk/core-constants/pom.xml> to /home/jenkins/jenkins-slave/maven-repositories/0/org/apache/directory/server/apacheds-core-constants/2.0.0-M17-SNAPSHOT/apacheds-core-constants-2.0.0-M17-SNAPSHOT.pom
[INFO] 
[INFO] --- maven-bundle-plugin:2.3.7:install (default-install) @ apacheds-core-constants ---
[INFO] Installing org/apache/directory/server/apacheds-core-constants/2.0.0-M17-SNAPSHOT/apacheds-core-constants-2.0.0-M17-SNAPSHOT.jar
[INFO] Writing OBR metadata
[INFO] 
[INFO] --- maven-deploy-plugin:2.7:deploy (default-deploy) @ apacheds-core-constants ---
Downloading: https://repository.apache.org/content/repositories/snapshots/org/apache/directory/server/apacheds-core-constants/2.0.0-M17-SNAPSHOT/maven-metadata.xml
Downloaded: https://repository.apache.org/content/repositories/snapshots/org/apache/directory/server/apacheds-core-constants/2.0.0-M17-SNAPSHOT/maven-metadata.xml (812 B at 2.5 KB/sec)
Uploading: https://repository.apache.org/content/repositories/snapshots/org/apache/directory/server/apacheds-core-constants/2.0.0-M17-SNAPSHOT/apacheds-core-constants-2.0.0-M17-20140312.041137-5.jar
Uploaded: https://repository.apache.org/content/repositories/snapshots/org/apache/directory/server/apacheds-core-constants/2.0.0-M17-SNAPSHOT/apacheds-core-constants-2.0.0-M17-20140312.041137-5.jar (10 KB at 30.3 KB/sec)
Uploading: https://repository.apache.org/content/repositories/snapshots/org/apache/directory/server/apacheds-core-constants/2.0.0-M17-SNAPSHOT/apacheds-core-constants-2.0.0-M17-20140312.041137-5.pom
Uploaded: https://repository.apache.org/content/repositories/snapshots/org/apache/directory/server/apacheds-core-constants/2.0.0-M17-SNAPSHOT/apacheds-core-constants-2.0.0-M17-20140312.041137-5.pom (3 KB at 6.3 KB/sec)
Downloading: https://repository.apache.org/content/repositories/snapshots/org/apache/directory/server/apacheds-core-constants/maven-metadata.xml
Downloaded: https://repository.apache.org/content/repositories/snapshots/org/apache/directory/server/apacheds-core-constants/maven-metadata.xml (506 B at 2.0 KB/sec)
Uploading: https://repository.apache.org/content/repositories/snapshots/org/apache/directory/server/apacheds-core-constants/2.0.0-M17-SNAPSHOT/maven-metadata.xml
Uploaded: https://repository.apache.org/content/repositories/snapshots/org/apache/directory/server/apacheds-core-constants/2.0.0-M17-SNAPSHOT/maven-metadata.xml (812 B at 1.8 KB/sec)
Uploading: https://repository.apache.org/content/repositories/snapshots/org/apache/directory/server/apacheds-core-constants/maven-metadata.xml
Uploaded: https://repository.apache.org/content/repositories/snapshots/org/apache/directory/server/apacheds-core-constants/maven-metadata.xml (506 B at 1.2 KB/sec)
[INFO] 
[INFO] --- maven-bundle-plugin:2.3.7:deploy (default-deploy) @ apacheds-core-constants ---
[INFO] Remote OBR update disabled (enable with -DremoteOBR)
[JENKINS] Archiving disabled
[INFO]                                                                         
[INFO] ------------------------------------------------------------------------
[INFO] Building ApacheDS Core API 2.0.0-M17-SNAPSHOT
[INFO] ------------------------------------------------------------------------
Downloading: http://repo.maven.apache.org/maven2/org/apache/directory/api/api-i18n/1.0.0-M21/api-i18n-1.0.0-M21.pom
[WARNING] The POM for org.apache.directory.api:api-i18n:jar:1.0.0-M21 is missing, no dependency information available
Downloading: http://repo.maven.apache.org/maven2/org/apache/directory/api/api-asn1-api/1.0.0-M21/api-asn1-api-1.0.0-M21.pom
[WARNING] The POM for org.apache.directory.api:api-asn1-api:jar:1.0.0-M21 is missing, no dependency information available
Downloading: http://repo.maven.apache.org/maven2/org/apache/directory/api/api-ldap-client-api/1.0.0-M21/api-ldap-client-api-1.0.0-M21.pom
[WARNING] The POM for org.apache.directory.api:api-ldap-client-api:jar:1.0.0-M21 is missing, no dependency information available
Downloading: http://repo.maven.apache.org/maven2/org/apache/directory/api/api-ldap-codec-core/1.0.0-M21/api-ldap-codec-core-1.0.0-M21.pom
[WARNING] The POM for org.apache.directory.api:api-ldap-codec-core:jar:1.0.0-M21 is missing, no dependency information available
Downloading: http://repo.maven.apache.org/maven2/org/apache/directory/api/api-ldap-extras-aci/1.0.0-M21/api-ldap-extras-aci-1.0.0-M21.pom
[WARNING] The POM for org.apache.directory.api:api-ldap-extras-aci:jar:1.0.0-M21 is missing, no dependency information available
Downloading: http://repo.maven.apache.org/maven2/org/apache/directory/api/api-ldap-extras-util/1.0.0-M21/api-ldap-extras-util-1.0.0-M21.pom
[WARNING] The POM for org.apache.directory.api:api-ldap-extras-util:jar:1.0.0-M21 is missing, no dependency information available
Downloading: http://repo.maven.apache.org/maven2/org/apache/directory/api/api-ldap-model/1.0.0-M21/api-ldap-model-1.0.0-M21.pom
[WARNING] The POM for org.apache.directory.api:api-ldap-model:jar:1.0.0-M21 is missing, no dependency information available
Downloading: http://repo.maven.apache.org/maven2/org/apache/directory/api/api-ldap-schema-data/1.0.0-M21/api-ldap-schema-data-1.0.0-M21.pom
[WARNING] The POM for org.apache.directory.api:api-ldap-schema-data:jar:1.0.0-M21 is missing, no dependency information available
Downloading: http://repo.maven.apache.org/maven2/org/apache/directory/api/api-util/1.0.0-M21/api-util-1.0.0-M21.pom
[WARNING] The POM for org.apache.directory.api:api-util:jar:1.0.0-M21 is missing, no dependency information available
Downloading: http://repo.maven.apache.org/maven2/org/apache/directory/api/api-i18n/1.0.0-M21/api-i18n-1.0.0-M21.jar
Downloading: http://repo.maven.apache.org/maven2/org/apache/directory/api/api-asn1-api/1.0.0-M21/api-asn1-api-1.0.0-M21.jar
Downloading: http://repo.maven.apache.org/maven2/org/apache/directory/api/api-ldap-extras-aci/1.0.0-M21/api-ldap-extras-aci-1.0.0-M21.jar
Downloading: http://repo.maven.apache.org/maven2/org/apache/directory/api/api-ldap-codec-core/1.0.0-M21/api-ldap-codec-core-1.0.0-M21.jar
Downloading: http://repo.maven.apache.org/maven2/org/apache/directory/api/api-ldap-client-api/1.0.0-M21/api-ldap-client-api-1.0.0-M21.jar
Downloading: http://repo.maven.apache.org/maven2/org/apache/directory/api/api-ldap-extras-util/1.0.0-M21/api-ldap-extras-util-1.0.0-M21.jar
Downloading: http://repo.maven.apache.org/maven2/org/apache/directory/api/api-ldap-model/1.0.0-M21/api-ldap-model-1.0.0-M21.jar
Downloading: http://repo.maven.apache.org/maven2/org/apache/directory/api/api-ldap-schema-data/1.0.0-M21/api-ldap-schema-data-1.0.0-M21.jar
Downloading: http://repo.maven.apache.org/maven2/org/apache/directory/api/api-util/1.0.0-M21/api-util-1.0.0-M21.jar
[JENKINS] Archiving disabled
[INFO] ------------------------------------------------------------------------
[INFO] Reactor Summary:
[INFO] 
[INFO] ApacheDS .......................................... SUCCESS [28.559s]
[INFO] ApacheDS I18n ..................................... SUCCESS [15.283s]
[INFO] ApacheDS Core Constants ........................... SUCCESS [7.726s]
[INFO] ApacheDS Core API ................................. FAILURE [5.259s]
[INFO] ApacheDS Core Shared .............................. SKIPPED
[INFO] ApacheDS Interceptors ............................. SKIPPED
[INFO] ApacheDS AdministrativePoint Interceptor .......... SKIPPED
[INFO] ApacheDS Authentication Interceptor ............... SKIPPED
[INFO] ApacheDS Authorization Interceptor ................ SKIPPED
[INFO] ApacheDS ChangeLog Interceptor .................... SKIPPED
[INFO] ApacheDS Collective Attribute Interceptor ......... SKIPPED
[INFO] ApacheDS Event Interceptor ........................ SKIPPED
[INFO] ApacheDS Exception Interceptor .................... SKIPPED
[INFO] ApacheDS Journal Interceptor ...................... SKIPPED
[INFO] ApacheDS Normalization Interceptor ................ SKIPPED
[INFO] ApacheDS Operational Attribute Interceptor ........ SKIPPED
[INFO] ApacheDS Referral Interceptor ..................... SKIPPED
[INFO] ApacheDS Schema Interceptor ....................... SKIPPED
[INFO] ApacheDS Subtree Interceptor ...................... SKIPPED
[INFO] ApacheDS Triggers Interceptor ..................... SKIPPED
[INFO] ApacheDS Core ..................................... SKIPPED
[INFO] ApacheDS Core AVL ................................. SKIPPED
[INFO] ApacheDS Generalized (X) DBM Partition ............ SKIPPED
[INFO] ApacheDS LDIF Partition ........................... SKIPPED
[INFO] ApacheDS JDBM Partition ........................... SKIPPED
[INFO] ApacheDS Mavibot Partition ........................ SKIPPED
[INFO] ApacheDS Core Annotations ......................... SKIPPED
[INFO] ApacheDS Core JNDI ................................ SKIPPED
[INFO] ApacheDS Protocol Kerberos Codec .................. SKIPPED
[INFO] ApacheDS Interceptors for Kerberos ................ SKIPPED
[INFO] ApacheDS Protocol Dhcp ............................ SKIPPED
[INFO] ApacheDS Protocol Shared .......................... SKIPPED
[INFO] ApacheDS Protocol Dns ............................. SKIPPED
[INFO] ApacheDS Protocol Kerberos ........................ SKIPPED
[INFO] ApacheDS Protocol Ldap ............................ SKIPPED
[INFO] ApacheDS Protocol Ntp ............................. SKIPPED
[INFO] Apacheds Server Annotations ....................... SKIPPED
[INFO] ApacheDS Server Config ............................ SKIPPED
[INFO] ApacheDS Server JNDI .............................. SKIPPED
[INFO] ApacheDS Test Framework ........................... SKIPPED
[INFO] ApacheDS All ...................................... SKIPPED
[INFO] ApacheDS Logger Interceptor ....................... SKIPPED
[INFO] ApacheDS Password Hashing Interceptor ............. SKIPPED
[INFO] ApacheDS Core Integration ......................... SKIPPED
[INFO] ApacheDS Protocol Kerberos Test ................... SKIPPED
[INFO] ApacheDS Server Integration ....................... SKIPPED
[INFO] ApacheDS DirectoryService-WebApp bridge ........... SKIPPED
[INFO] ApacheDS Jetty HTTP Server Integration ............ SKIPPED
[INFO] ApacheDS Service Builder .......................... SKIPPED
[INFO] Apache Directory LDAP Client API test ............. SKIPPED
[INFO] kerberos-client ................................... SKIPPED
[INFO] ApacheDS Service .................................. SKIPPED
[INFO] ApacheDS Wrapper .................................. SKIPPED
[INFO] ApacheDS Installers Maven Plugin .................. SKIPPED
[INFO] ApacheDS Installers ............................... SKIPPED
[INFO] ------------------------------------------------------------------------
[INFO] BUILD FAILURE
[INFO] ------------------------------------------------------------------------
[INFO] Total time: 1:11.549s
[INFO] Finished at: Wed Mar 12 04:11:47 UTC 2014
[INFO] Final Memory: 38M/233M
[INFO] ------------------------------------------------------------------------
[JENKINS] Archiving disabled
[JENKINS] Archiving disabled
[JENKINS] Archiving disabled
[JENKINS] Archiving disabled
[JENKINS] Archiving disabled
[JENKINS] Archiving disabled
[JENKINS] Archiving disabled
[JENKINS] Archiving disabled
[JENKINS] Archiving disabled
[JENKINS] Archiving disabled
[JENKINS] Archiving disabled
[JENKINS] Archiving disabled
[JENKINS] Archiving disabled
[JENKINS] Archiving disabled
[JENKINS] Archiving disabled
[JENKINS] Archiving disabled
[JENKINS] Archiving disabled
[JENKINS] Archiving disabled
[JENKINS] Archiving disabled
[JENKINS] Archiving disabled
[JENKINS] Archiving disabled
[JENKINS] Archiving disabled
[JENKINS] Archiving disabled
[JENKINS] Archiving disabled
[JENKINS] Archiving disabled
[JENKINS] Archiving disabled
[JENKINS] Archiving disabled
[JENKINS] Archiving disabled
[JENKINS] Archiving disabled
[JENKINS] Archiving disabled
[JENKINS] Archiving disabled
[JENKINS] Archiving disabled
[JENKINS] Archiving disabled
[JENKINS] Archiving disabled
[JENKINS] Archiving disabled
[JENKINS] Archiving disabled
[JENKINS] Archiving disabled
[JENKINS] Archiving disabled
[JENKINS] Archiving disabled
[JENKINS] Archiving disabled
[JENKINS] Archiving disabled
[JENKINS] Archiving disabled
[JENKINS] Archiving disabled
[JENKINS] Archiving disabled
[JENKINS] Archiving disabled
[JENKINS] Archiving disabled
[JENKINS] Archiving disabled
[JENKINS] Archiving disabled
[JENKINS] Archiving disabled
[JENKINS] Archiving disabled
[JENKINS] Archiving disabled
[JENKINS] Archiving disabled
[JENKINS] Archiving disabled
[JENKINS] Archiving disabled
[JENKINS] Archiving disabled
Waiting for Jenkins to finish collecting data[ERROR] Failed to execute goal on project apacheds-core-api: Could not resolve dependencies for project org.apache.directory.server:apacheds-core-api:bundle:2.0.0-M17-SNAPSHOT: The following artifacts could not be resolved: org.apache.directory.api:api-i18n:jar:1.0.0-M21, org.apache.directory.api:api-asn1-api:jar:1.0.0-M21, org.apache.directory.api:api-ldap-client-api:jar:1.0.0-M21, org.apache.directory.api:api-ldap-codec-core:jar:1.0.0-M21, org.apache.directory.api:api-ldap-extras-aci:jar:1.0.0-M21, org.apache.directory.api:api-ldap-extras-util:jar:1.0.0-M21, org.apache.directory.api:api-ldap-model:jar:1.0.0-M21, org.apache.directory.api:api-ldap-schema-data:jar:1.0.0-M21, org.apache.directory.api:api-util:jar:1.0.0-M21: Could not find artifact org.apache.directory.api:api-i18n:jar:1.0.0-M21 in central (http://repo.maven.apache.org/maven2) -> [Help 1]
[ERROR] 
[ERROR] To see the full stack trace of the errors, re-run Maven with the -e switch.
[ERROR] Re-run Maven using the -X switch to enable full debug logging.
[ERROR] 
[ERROR] For more information about the errors and possible solutions, please read the following articles:
[ERROR] [Help 1] http://cwiki.apache.org/confluence/display/MAVEN/DependencyResolutionException
[ERROR] 
[ERROR] After correcting the problems, you can resume the build with the command
[ERROR]   mvn <goals> -rf :apacheds-core-api

channel stopped

Build failed in Jenkins: dir-apacheds-ubuntu-deploy #1286

Posted by Apache Jenkins Server <je...@builds.apache.org>.
See <https://builds.apache.org/job/dir-apacheds-ubuntu-deploy/1286/changes>

Changes:

[elecharny] [maven-release-plugin] prepare for next development iteration

[elecharny] [maven-release-plugin] prepare release 2.0.0-M16

[elecharny] Fixed a potential error related to the local setting of /etc/hosts

[elecharny] Rollbacked the release to M16-SNAPSHOT

[kayyagari] o ignore contextCSN while modifying entries (DIRSERVER-1963)
o removed an unused import

[kayyagari] do not activate disabled replication consumers (DIRSERVER-1962)

------------------------------------------
[...truncated 155 lines...]
[INFO] Installing <https://builds.apache.org/job/dir-apacheds-ubuntu-deploy/ws/trunk/i18n/pom.xml> to /home/jenkins/jenkins-slave/maven-repositories/1/org/apache/directory/server/apacheds-i18n/2.0.0-M17-SNAPSHOT/apacheds-i18n-2.0.0-M17-SNAPSHOT.pom
[INFO] 
[INFO] --- maven-bundle-plugin:2.3.7:install (default-install) @ apacheds-i18n ---
[INFO] Installing org/apache/directory/server/apacheds-i18n/2.0.0-M17-SNAPSHOT/apacheds-i18n-2.0.0-M17-SNAPSHOT.jar
[INFO] Writing OBR metadata
[INFO] 
[INFO] --- maven-deploy-plugin:2.7:deploy (default-deploy) @ apacheds-i18n ---
Downloading: https://repository.apache.org/content/repositories/snapshots/org/apache/directory/server/apacheds-i18n/2.0.0-M17-SNAPSHOT/maven-metadata.xml
Downloaded: https://repository.apache.org/content/repositories/snapshots/org/apache/directory/server/apacheds-i18n/2.0.0-M17-SNAPSHOT/maven-metadata.xml (802 B at 2.0 KB/sec)
Uploading: https://repository.apache.org/content/repositories/snapshots/org/apache/directory/server/apacheds-i18n/2.0.0-M17-SNAPSHOT/apacheds-i18n-2.0.0-M17-20140311.040414-4.jar
Uploaded: https://repository.apache.org/content/repositories/snapshots/org/apache/directory/server/apacheds-i18n/2.0.0-M17-SNAPSHOT/apacheds-i18n-2.0.0-M17-20140311.040414-4.jar (44 KB at 133.8 KB/sec)
Uploading: https://repository.apache.org/content/repositories/snapshots/org/apache/directory/server/apacheds-i18n/2.0.0-M17-SNAPSHOT/apacheds-i18n-2.0.0-M17-20140311.040414-4.pom
Uploaded: https://repository.apache.org/content/repositories/snapshots/org/apache/directory/server/apacheds-i18n/2.0.0-M17-SNAPSHOT/apacheds-i18n-2.0.0-M17-20140311.040414-4.pom (3 KB at 6.8 KB/sec)
Downloading: https://repository.apache.org/content/repositories/snapshots/org/apache/directory/server/apacheds-i18n/maven-metadata.xml
Downloaded: https://repository.apache.org/content/repositories/snapshots/org/apache/directory/server/apacheds-i18n/maven-metadata.xml (496 B at 1.7 KB/sec)
Uploading: https://repository.apache.org/content/repositories/snapshots/org/apache/directory/server/apacheds-i18n/2.0.0-M17-SNAPSHOT/maven-metadata.xml
Uploaded: https://repository.apache.org/content/repositories/snapshots/org/apache/directory/server/apacheds-i18n/2.0.0-M17-SNAPSHOT/maven-metadata.xml (802 B at 2.8 KB/sec)
Uploading: https://repository.apache.org/content/repositories/snapshots/org/apache/directory/server/apacheds-i18n/maven-metadata.xml
Uploaded: https://repository.apache.org/content/repositories/snapshots/org/apache/directory/server/apacheds-i18n/maven-metadata.xml (496 B at 1.4 KB/sec)
[INFO] 
[INFO] --- maven-bundle-plugin:2.3.7:deploy (default-deploy) @ apacheds-i18n ---
[INFO] Remote OBR update disabled (enable with -DremoteOBR)
[JENKINS] Archiving disabled
[INFO]                                                                         
[INFO] ------------------------------------------------------------------------
[INFO] Building ApacheDS Core Constants 2.0.0-M17-SNAPSHOT
[INFO] ------------------------------------------------------------------------
[INFO] 
[INFO] --- maven-clean-plugin:2.4.1:clean (default-clean) @ apacheds-core-constants ---
[INFO] Deleting <https://builds.apache.org/job/dir-apacheds-ubuntu-deploy/ws/trunk/core-constants/target>
[INFO] 
[INFO] --- maven-remote-resources-plugin:1.2.1:process (default) @ apacheds-core-constants ---
[INFO] 
[INFO] --- maven-resources-plugin:2.6:resources (default-resources) @ apacheds-core-constants ---
[INFO] Using 'UTF-8' encoding to copy filtered resources.
[INFO] Copying 0 resource
[INFO] Copying 3 resources
[INFO] 
[INFO] --- maven-compiler-plugin:3.1:compile (default-compile) @ apacheds-core-constants ---
[INFO] Changes detected - recompiling the module!
[INFO] Compiling 4 source files to <https://builds.apache.org/job/dir-apacheds-ubuntu-deploy/ws/trunk/core-constants/target/classes>
[INFO] 
[INFO] --- maven-resources-plugin:2.6:testResources (default-testResources) @ apacheds-core-constants ---
[INFO] Using 'UTF-8' encoding to copy filtered resources.
[INFO] skip non existing resourceDirectory <https://builds.apache.org/job/dir-apacheds-ubuntu-deploy/ws/trunk/core-constants/src/test/resources>
[INFO] Copying 3 resources
[INFO] 
[INFO] --- maven-compiler-plugin:3.1:testCompile (default-testCompile) @ apacheds-core-constants ---
[INFO] No sources to compile
[INFO] 
[INFO] --- maven-surefire-plugin:2.15:test (default-test) @ apacheds-core-constants ---
[JENKINS] Recording test results[INFO] 
[INFO] --- maven-bundle-plugin:2.3.7:bundle (default-bundle) @ apacheds-core-constants ---

[INFO] 
[INFO] --- maven-site-plugin:3.3:attach-descriptor (attach-descriptor) @ apacheds-core-constants ---
[INFO] 
[INFO] --- tools-maven-plugin:1.4:verify-legal-files (verify-legal-files) @ apacheds-core-constants ---
[INFO] Checking legal files in: apacheds-core-constants-2.0.0-M17-SNAPSHOT.jar
[INFO] 
[INFO] --- maven-install-plugin:2.4:install (default-install) @ apacheds-core-constants ---
[INFO] Installing <https://builds.apache.org/job/dir-apacheds-ubuntu-deploy/ws/trunk/core-constants/target/apacheds-core-constants-2.0.0-M17-SNAPSHOT.jar> to /home/jenkins/jenkins-slave/maven-repositories/1/org/apache/directory/server/apacheds-core-constants/2.0.0-M17-SNAPSHOT/apacheds-core-constants-2.0.0-M17-SNAPSHOT.jar
[INFO] Installing <https://builds.apache.org/job/dir-apacheds-ubuntu-deploy/ws/trunk/core-constants/pom.xml> to /home/jenkins/jenkins-slave/maven-repositories/1/org/apache/directory/server/apacheds-core-constants/2.0.0-M17-SNAPSHOT/apacheds-core-constants-2.0.0-M17-SNAPSHOT.pom
[INFO] 
[INFO] --- maven-bundle-plugin:2.3.7:install (default-install) @ apacheds-core-constants ---
[INFO] Installing org/apache/directory/server/apacheds-core-constants/2.0.0-M17-SNAPSHOT/apacheds-core-constants-2.0.0-M17-SNAPSHOT.jar
[INFO] Writing OBR metadata
[INFO] 
[INFO] --- maven-deploy-plugin:2.7:deploy (default-deploy) @ apacheds-core-constants ---
Downloading: https://repository.apache.org/content/repositories/snapshots/org/apache/directory/server/apacheds-core-constants/2.0.0-M17-SNAPSHOT/maven-metadata.xml
Downloaded: https://repository.apache.org/content/repositories/snapshots/org/apache/directory/server/apacheds-core-constants/2.0.0-M17-SNAPSHOT/maven-metadata.xml (812 B at 2.1 KB/sec)
Uploading: https://repository.apache.org/content/repositories/snapshots/org/apache/directory/server/apacheds-core-constants/2.0.0-M17-SNAPSHOT/apacheds-core-constants-2.0.0-M17-20140311.040424-4.jar
Uploaded: https://repository.apache.org/content/repositories/snapshots/org/apache/directory/server/apacheds-core-constants/2.0.0-M17-SNAPSHOT/apacheds-core-constants-2.0.0-M17-20140311.040424-4.jar (10 KB at 3.1 KB/sec)
Uploading: https://repository.apache.org/content/repositories/snapshots/org/apache/directory/server/apacheds-core-constants/2.0.0-M17-SNAPSHOT/apacheds-core-constants-2.0.0-M17-20140311.040424-4.pom
Uploaded: https://repository.apache.org/content/repositories/snapshots/org/apache/directory/server/apacheds-core-constants/2.0.0-M17-SNAPSHOT/apacheds-core-constants-2.0.0-M17-20140311.040424-4.pom (3 KB at 7.1 KB/sec)
Downloading: https://repository.apache.org/content/repositories/snapshots/org/apache/directory/server/apacheds-core-constants/maven-metadata.xml
Downloaded: https://repository.apache.org/content/repositories/snapshots/org/apache/directory/server/apacheds-core-constants/maven-metadata.xml (506 B at 0.5 KB/sec)
Uploading: https://repository.apache.org/content/repositories/snapshots/org/apache/directory/server/apacheds-core-constants/2.0.0-M17-SNAPSHOT/maven-metadata.xml
Uploaded: https://repository.apache.org/content/repositories/snapshots/org/apache/directory/server/apacheds-core-constants/2.0.0-M17-SNAPSHOT/maven-metadata.xml (812 B at 2.3 KB/sec)
Uploading: https://repository.apache.org/content/repositories/snapshots/org/apache/directory/server/apacheds-core-constants/maven-metadata.xml
Uploaded: https://repository.apache.org/content/repositories/snapshots/org/apache/directory/server/apacheds-core-constants/maven-metadata.xml (506 B at 1.2 KB/sec)
[INFO] 
[INFO] --- maven-bundle-plugin:2.3.7:deploy (default-deploy) @ apacheds-core-constants ---
[INFO] Remote OBR update disabled (enable with -DremoteOBR)
[JENKINS] Archiving disabled
[INFO]                                                                         
[INFO] ------------------------------------------------------------------------
[INFO] Building ApacheDS Core API 2.0.0-M17-SNAPSHOT
[INFO] ------------------------------------------------------------------------
Downloading: http://repo.maven.apache.org/maven2/org/apache/directory/api/api-i18n/1.0.0-M21/api-i18n-1.0.0-M21.pom
[WARNING] The POM for org.apache.directory.api:api-i18n:jar:1.0.0-M21 is missing, no dependency information available
Downloading: http://repo.maven.apache.org/maven2/org/apache/directory/api/api-asn1-api/1.0.0-M21/api-asn1-api-1.0.0-M21.pom
[WARNING] The POM for org.apache.directory.api:api-asn1-api:jar:1.0.0-M21 is missing, no dependency information available
Downloading: http://repo.maven.apache.org/maven2/org/apache/directory/api/api-ldap-client-api/1.0.0-M21/api-ldap-client-api-1.0.0-M21.pom
[WARNING] The POM for org.apache.directory.api:api-ldap-client-api:jar:1.0.0-M21 is missing, no dependency information available
Downloading: http://repo.maven.apache.org/maven2/org/apache/directory/api/api-ldap-codec-core/1.0.0-M21/api-ldap-codec-core-1.0.0-M21.pom
[WARNING] The POM for org.apache.directory.api:api-ldap-codec-core:jar:1.0.0-M21 is missing, no dependency information available
Downloading: http://repo.maven.apache.org/maven2/org/apache/directory/api/api-ldap-extras-aci/1.0.0-M21/api-ldap-extras-aci-1.0.0-M21.pom
[WARNING] The POM for org.apache.directory.api:api-ldap-extras-aci:jar:1.0.0-M21 is missing, no dependency information available
Downloading: http://repo.maven.apache.org/maven2/org/apache/directory/api/api-ldap-extras-util/1.0.0-M21/api-ldap-extras-util-1.0.0-M21.pom
[WARNING] The POM for org.apache.directory.api:api-ldap-extras-util:jar:1.0.0-M21 is missing, no dependency information available
Downloading: http://repo.maven.apache.org/maven2/org/apache/directory/api/api-ldap-model/1.0.0-M21/api-ldap-model-1.0.0-M21.pom
[WARNING] The POM for org.apache.directory.api:api-ldap-model:jar:1.0.0-M21 is missing, no dependency information available
Downloading: http://repo.maven.apache.org/maven2/org/apache/directory/api/api-ldap-schema-data/1.0.0-M21/api-ldap-schema-data-1.0.0-M21.pom
[WARNING] The POM for org.apache.directory.api:api-ldap-schema-data:jar:1.0.0-M21 is missing, no dependency information available
Downloading: http://repo.maven.apache.org/maven2/org/apache/directory/api/api-util/1.0.0-M21/api-util-1.0.0-M21.pom
[WARNING] The POM for org.apache.directory.api:api-util:jar:1.0.0-M21 is missing, no dependency information available
Downloading: http://repo.maven.apache.org/maven2/org/apache/directory/api/api-i18n/1.0.0-M21/api-i18n-1.0.0-M21.jar
Downloading: http://repo.maven.apache.org/maven2/org/apache/directory/api/api-asn1-api/1.0.0-M21/api-asn1-api-1.0.0-M21.jar
Downloading: http://repo.maven.apache.org/maven2/org/apache/directory/api/api-ldap-codec-core/1.0.0-M21/api-ldap-codec-core-1.0.0-M21.jar
Downloading: http://repo.maven.apache.org/maven2/org/apache/directory/api/api-ldap-extras-aci/1.0.0-M21/api-ldap-extras-aci-1.0.0-M21.jar
Downloading: http://repo.maven.apache.org/maven2/org/apache/directory/api/api-ldap-client-api/1.0.0-M21/api-ldap-client-api-1.0.0-M21.jar
Downloading: http://repo.maven.apache.org/maven2/org/apache/directory/api/api-ldap-extras-util/1.0.0-M21/api-ldap-extras-util-1.0.0-M21.jar
Downloading: http://repo.maven.apache.org/maven2/org/apache/directory/api/api-ldap-model/1.0.0-M21/api-ldap-model-1.0.0-M21.jar
Downloading: http://repo.maven.apache.org/maven2/org/apache/directory/api/api-ldap-schema-data/1.0.0-M21/api-ldap-schema-data-1.0.0-M21.jar
Downloading: http://repo.maven.apache.org/maven2/org/apache/directory/api/api-util/1.0.0-M21/api-util-1.0.0-M21.jar
[JENKINS] Archiving disabled
[INFO] ------------------------------------------------------------------------
[INFO] Reactor Summary:
[INFO] 
[INFO] ApacheDS .......................................... SUCCESS [29.171s]
[INFO] ApacheDS I18n ..................................... SUCCESS [15.036s]
[INFO] ApacheDS Core Constants ........................... SUCCESS [12.744s]
[INFO] ApacheDS Core API ................................. FAILURE [2.124s]
[INFO] ApacheDS Core Shared .............................. SKIPPED
[INFO] ApacheDS Interceptors ............................. SKIPPED
[INFO] ApacheDS AdministrativePoint Interceptor .......... SKIPPED
[INFO] ApacheDS Authentication Interceptor ............... SKIPPED
[INFO] ApacheDS Authorization Interceptor ................ SKIPPED
[INFO] ApacheDS ChangeLog Interceptor .................... SKIPPED
[INFO] ApacheDS Collective Attribute Interceptor ......... SKIPPED
[INFO] ApacheDS Event Interceptor ........................ SKIPPED
[INFO] ApacheDS Exception Interceptor .................... SKIPPED
[INFO] ApacheDS Journal Interceptor ...................... SKIPPED
[INFO] ApacheDS Normalization Interceptor ................ SKIPPED
[INFO] ApacheDS Operational Attribute Interceptor ........ SKIPPED
[INFO] ApacheDS Referral Interceptor ..................... SKIPPED
[INFO] ApacheDS Schema Interceptor ....................... SKIPPED
[INFO] ApacheDS Subtree Interceptor ...................... SKIPPED
[INFO] ApacheDS Triggers Interceptor ..................... SKIPPED
[INFO] ApacheDS Core ..................................... SKIPPED
[INFO] ApacheDS Core AVL ................................. SKIPPED
[INFO] ApacheDS Generalized (X) DBM Partition ............ SKIPPED
[INFO] ApacheDS LDIF Partition ........................... SKIPPED
[INFO] ApacheDS JDBM Partition ........................... SKIPPED
[INFO] ApacheDS Mavibot Partition ........................ SKIPPED
[INFO] ApacheDS Core Annotations ......................... SKIPPED
[INFO] ApacheDS Core JNDI ................................ SKIPPED
[INFO] ApacheDS Protocol Kerberos Codec .................. SKIPPED
[INFO] ApacheDS Interceptors for Kerberos ................ SKIPPED
[INFO] ApacheDS Protocol Dhcp ............................ SKIPPED
[INFO] ApacheDS Protocol Shared .......................... SKIPPED
[INFO] ApacheDS Protocol Dns ............................. SKIPPED
[INFO] ApacheDS Protocol Kerberos ........................ SKIPPED
[INFO] ApacheDS Protocol Ldap ............................ SKIPPED
[INFO] ApacheDS Protocol Ntp ............................. SKIPPED
[INFO] Apacheds Server Annotations ....................... SKIPPED
[INFO] ApacheDS Server Config ............................ SKIPPED
[INFO] ApacheDS Server JNDI .............................. SKIPPED
[INFO] ApacheDS Test Framework ........................... SKIPPED
[INFO] ApacheDS All ...................................... SKIPPED
[INFO] ApacheDS Logger Interceptor ....................... SKIPPED
[INFO] ApacheDS Password Hashing Interceptor ............. SKIPPED
[INFO] ApacheDS Core Integration ......................... SKIPPED
[INFO] ApacheDS Protocol Kerberos Test ................... SKIPPED
[INFO] ApacheDS Server Integration ....................... SKIPPED
[INFO] ApacheDS DirectoryService-WebApp bridge ........... SKIPPED
[INFO] ApacheDS Jetty HTTP Server Integration ............ SKIPPED
[INFO] ApacheDS Service Builder .......................... SKIPPED
[INFO] Apache Directory LDAP Client API test ............. SKIPPED
[INFO] kerberos-client ................................... SKIPPED
[INFO] ApacheDS Service .................................. SKIPPED
[INFO] ApacheDS Wrapper .................................. SKIPPED
[INFO] ApacheDS Installers Maven Plugin .................. SKIPPED
[INFO] ApacheDS Installers ............................... SKIPPED
[INFO] ------------------------------------------------------------------------
[INFO] BUILD FAILURE
[INFO] ------------------------------------------------------------------------
[INFO] Total time: 2:06.053s
[INFO] Finished at: Tue Mar 11 04:04:35 UTC 2014
[INFO] Final Memory: 38M/278M
[INFO] ------------------------------------------------------------------------
[JENKINS] Archiving disabled
[JENKINS] Archiving disabled
[JENKINS] Archiving disabled
[JENKINS] Archiving disabled
[JENKINS] Archiving disabled
[JENKINS] Archiving disabled
[JENKINS] Archiving disabled
[JENKINS] Archiving disabled
[JENKINS] Archiving disabled
[JENKINS] Archiving disabled
[JENKINS] Archiving disabled
[JENKINS] Archiving disabled
[JENKINS] Archiving disabled
[JENKINS] Archiving disabled
[JENKINS] Archiving disabled
[JENKINS] Archiving disabled
[JENKINS] Archiving disabled
[JENKINS] Archiving disabled
[JENKINS] Archiving disabled
[JENKINS] Archiving disabled
[JENKINS] Archiving disabled
[JENKINS] Archiving disabled
[JENKINS] Archiving disabled
[JENKINS] Archiving disabled
[JENKINS] Archiving disabled
[JENKINS] Archiving disabled
[JENKINS] Archiving disabled
[JENKINS] Archiving disabled
[JENKINS] Archiving disabled
[JENKINS] Archiving disabled
[JENKINS] Archiving disabled
[JENKINS] Archiving disabled
[JENKINS] Archiving disabled
[JENKINS] Archiving disabled
[JENKINS] Archiving disabled
[JENKINS] Archiving disabled
[JENKINS] Archiving disabled
[JENKINS] Archiving disabled
[JENKINS] Archiving disabled
[JENKINS] Archiving disabled
[JENKINS] Archiving disabled
[JENKINS] Archiving disabled
[JENKINS] Archiving disabled
[JENKINS] Archiving disabled
[JENKINS] Archiving disabled
[JENKINS] Archiving disabled
[JENKINS] Archiving disabled
[JENKINS] Archiving disabled
[JENKINS] Archiving disabled
[JENKINS] Archiving disabled
[JENKINS] Archiving disabled
[JENKINS] Archiving disabled
[JENKINS] Archiving disabled
[JENKINS] Archiving disabled
[JENKINS] Archiving disabled
Waiting for Jenkins to finish collecting data[ERROR] Failed to execute goal on project apacheds-core-api: Could not resolve dependencies for project org.apache.directory.server:apacheds-core-api:bundle:2.0.0-M17-SNAPSHOT: The following artifacts could not be resolved: org.apache.directory.api:api-i18n:jar:1.0.0-M21, org.apache.directory.api:api-asn1-api:jar:1.0.0-M21, org.apache.directory.api:api-ldap-client-api:jar:1.0.0-M21, org.apache.directory.api:api-ldap-codec-core:jar:1.0.0-M21, org.apache.directory.api:api-ldap-extras-aci:jar:1.0.0-M21, org.apache.directory.api:api-ldap-extras-util:jar:1.0.0-M21, org.apache.directory.api:api-ldap-model:jar:1.0.0-M21, org.apache.directory.api:api-ldap-schema-data:jar:1.0.0-M21, org.apache.directory.api:api-util:jar:1.0.0-M21: Could not find artifact org.apache.directory.api:api-i18n:jar:1.0.0-M21 in central (http://repo.maven.apache.org/maven2) -> [Help 1]
[ERROR] 
[ERROR] To see the full stack trace of the errors, re-run Maven with the -e switch.
[ERROR] Re-run Maven using the -X switch to enable full debug logging.
[ERROR] 
[ERROR] For more information about the errors and possible solutions, please read the following articles:
[ERROR] [Help 1] http://cwiki.apache.org/confluence/display/MAVEN/DependencyResolutionException
[ERROR] 
[ERROR] After correcting the problems, you can resume the build with the command
[ERROR]   mvn <goals> -rf :apacheds-core-api

channel stopped