You are viewing a plain text version of this content. The canonical link for it is here.
Posted to dev@atlas.apache.org by Apache Jenkins Server <je...@builds.apache.org> on 2017/03/06 08:35:51 UTC

Build failed in Jenkins: apache-atlas-nightly #673

See <https://builds.apache.org/job/apache-atlas-nightly/673/display/redirect?page=changes>

Changes:

[madhan] ATLAS-1637: Deprecate V1 APIs and related classes

[madhan] ATLAS-1640: fix - entity update UI does not shows empty value for

------------------------------------------
[...truncated 531.95 KB...]
127.0.0.1 - - [06/Mar/2017:08:29:42 +0000] "POST /api/atlas/entities HTTP/1.1" 201 - "-" "Java/1.7.0_80"
127.0.0.1 - - [06/Mar/2017:08:29:42 +0000] "POST /api/atlas/entities HTTP/1.1" 201 - "-" "Java/1.7.0_80"
127.0.0.1 - - [06/Mar/2017:08:29:42 +0000] "POST /api/atlas/entities HTTP/1.1" 201 - "-" "Java/1.7.0_80"
127.0.0.1 - - [06/Mar/2017:08:29:42 +0000] "POST /api/atlas/entities HTTP/1.1" 201 - "-" "Java/1.7.0_80"
127.0.0.1 - - [06/Mar/2017:08:29:42 +0000] "GET /api/atlas/types/tableType HTTP/1.1" 200 - "-" "Java/1.7.0_80"
127.0.0.1 - - [06/Mar/2017:08:29:42 +0000] "GET /api/atlas/types/serdeType HTTP/1.1" 200 - "-" "Java/1.7.0_80"
127.0.0.1 - - [06/Mar/2017:08:29:42 +0000] "GET /api/atlas/types/classification HTTP/1.1" 200 - "-" "Java/1.7.0_80"
127.0.0.1 - - [06/Mar/2017:08:29:42 +0000] "GET /api/atlas/types/hive_db_v1 HTTP/1.1" 200 - "-" "Java/1.7.0_80"
127.0.0.1 - - [06/Mar/2017:08:29:42 +0000] "POST /api/atlas/entities HTTP/1.1" 201 - "-" "Java/1.7.0_80"
127.0.0.1 - - [06/Mar/2017:08:29:42 +0000] "POST /api/atlas/entities HTTP/1.1" 201 - "-" "Java/1.7.0_80"
127.0.0.1 - - [06/Mar/2017:08:29:42 +0000] "POST /api/atlas/entities HTTP/1.1" 201 - "-" "Java/1.7.0_80"
127.0.0.1 - - [06/Mar/2017:08:29:42 +0000] "POST /api/atlas/entities HTTP/1.1" 201 - "-" "Java/1.7.0_80"
127.0.0.1 - - [06/Mar/2017:08:29:42 +0000] "POST /api/atlas/entities HTTP/1.1" 201 - "-" "Java/1.7.0_80"
127.0.0.1 - - [06/Mar/2017:08:29:42 +0000] "POST /api/atlas/entities HTTP/1.1" 201 - "-" "Java/1.7.0_80"
127.0.0.1 - - [06/Mar/2017:08:29:42 +0000] "POST /api/atlas/entities HTTP/1.1" 201 - "-" "Java/1.7.0_80"
127.0.0.1 - - [06/Mar/2017:08:29:42 +0000] "POST /api/atlas/entities HTTP/1.1" 201 - "-" "Java/1.7.0_80"
127.0.0.1 - - [06/Mar/2017:08:29:42 +0000] "GET /api/atlas/lineage/hive/table/sales_fact_monthly_mvAPzfd3rB7P/inputs/graph HTTP/1.1" 200 - "-" "Java/1.7.0_80"
127.0.0.1 - - [06/Mar/2017:08:29:45 +0000] "GET /api/atlas/entities?type=hive_table_v1&property=qualifiedName&value=sales_fact_monthly_mvAPzfd3rB7P HTTP/1.1" 200 - "-" "Java/1.7.0_80"
127.0.0.1 - - [06/Mar/2017:08:29:45 +0000] "GET /api/atlas/lineage/b70fc151-0573-456f-9f50-9474c10e8ab9/inputs/graph HTTP/1.1" 200 - "-" "Java/1.7.0_80"
127.0.0.1 - - [06/Mar/2017:08:29:46 +0000] "GET /api/atlas/lineage/hive/table/sales_facttpTq3EMWq9/outputs/graph HTTP/1.1" 200 - "-" "Java/1.7.0_80"
127.0.0.1 - - [06/Mar/2017:08:29:48 +0000] "GET /api/atlas/entities?type=hive_table_v1&property=qualifiedName&value=sales_facttpTq3EMWq9 HTTP/1.1" 200 - "-" "Java/1.7.0_80"
127.0.0.1 - - [06/Mar/2017:08:29:48 +0000] "GET /api/atlas/lineage/f4c40025-eaf9-48d2-94ae-4b075776da18/outputs/graph HTTP/1.1" 200 - "-" "Java/1.7.0_80"
127.0.0.1 - - [06/Mar/2017:08:29:49 +0000] "GET /api/atlas/lineage/hive/table/sales_facttpTq3EMWq9/schema HTTP/1.1" 200 - "-" "Java/1.7.0_80"
127.0.0.1 - - [06/Mar/2017:08:29:50 +0000] "GET /api/atlas/lineage/hive/table/SalesCnHOHzRknc/schema HTTP/1.1" 404 - "-" "Java/1.7.0_80"
127.0.0.1 - - [06/Mar/2017:08:29:50 +0000] "GET /api/atlas/entities?type=hive_table_v1&property=qualifiedName&value=sales_facttpTq3EMWq9 HTTP/1.1" 200 - "-" "Java/1.7.0_80"
127.0.0.1 - - [06/Mar/2017:08:29:50 +0000] "GET /api/atlas/lineage/f4c40025-eaf9-48d2-94ae-4b075776da18/schema HTTP/1.1" 200 - "-" "Java/1.7.0_80"
127.0.0.1 - - [06/Mar/2017:08:29:51 +0000] "GET /api/atlas/lineage/hive/table/blah/schema HTTP/1.1" 404 - "-" "Java/1.7.0_80"
127.0.0.1 - - [06/Mar/2017:08:29:51 +0000] "GET /api/atlas/entities?type=hive_table_v1&property=qualifiedName&value=sales_fact_monthly_mvDS422t4Xl3 HTTP/1.1" 200 - "-" "Java/1.7.0_80"
127.0.0.1 - - [06/Mar/2017:08:29:51 +0000] "GET /api/atlas/v2/lineage/3d5aeafb-cb1a-4c3a-8390-5fd3d797acc2?direction=INPUT&depth=5 HTTP/1.1" 200 - "-" "Java/1.7.0_80"
127.0.0.1 - - [06/Mar/2017:08:29:52 +0000] "GET /api/atlas/entities?type=hive_table_v1&property=qualifiedName&value=sales_fact_monthly_mvDS422t4Xl3 HTTP/1.1" 200 - "-" "Java/1.7.0_80"
127.0.0.1 - - [06/Mar/2017:08:29:52 +0000] "GET /api/atlas/v2/lineage/3d5aeafb-cb1a-4c3a-8390-5fd3d797acc2?direction=BOTH&depth=5 HTTP/1.1" 200 - "-" "Java/1.7.0_80"
127.0.0.1 - - [06/Mar/2017:08:29:54 +0000] "GET /api/atlas/entities?type=hive_table_v1&property=qualifiedName&value=sales_factEgKI3UA0TS HTTP/1.1" 200 - "-" "Java/1.7.0_80"
127.0.0.1 - - [06/Mar/2017:08:29:54 +0000] "GET /api/atlas/v2/lineage/ebe3cb1a-57e3-48ec-b10f-7a832a311421?direction=OUTPUT&depth=5 HTTP/1.1" 200 - "-" "Java/1.7.0_80"
Tests run: 11, Failures: 0, Errors: 0, Skipped: 0, Time elapsed: 16.92 sec - in org.apache.atlas.web.resources.EntityLineageJerseyResourceIT
Running org.apache.atlas.CredentialProviderUtilityIT
Tests run: 4, Failures: 0, Errors: 0, Skipped: 0, Time elapsed: 1.608 sec - in org.apache.atlas.CredentialProviderUtilityIT
Running org.apache.atlas.notification.EntityNotificationIT
127.0.0.1 - - [06/Mar/2017:08:30:00 +0000] "GET /api/atlas/types/tableType HTTP/1.1" 200 - "-" "Java/1.7.0_80"
127.0.0.1 - - [06/Mar/2017:08:30:01 +0000] "GET /api/atlas/types/serdeType HTTP/1.1" 200 - "-" "Java/1.7.0_80"
127.0.0.1 - - [06/Mar/2017:08:30:01 +0000] "GET /api/atlas/types/classification HTTP/1.1" 200 - "-" "Java/1.7.0_80"
127.0.0.1 - - [06/Mar/2017:08:30:01 +0000] "GET /api/atlas/types/hive_db_v1 HTTP/1.1" 200 - "-" "Java/1.7.0_80"
127.0.0.1 - - [06/Mar/2017:08:30:02 +0000] "POST /api/atlas/entities HTTP/1.1" 201 - "-" "Java/1.7.0_80"
127.0.0.1 - - [06/Mar/2017:08:30:03 +0000] "POST /api/atlas/entities HTTP/1.1" 201 - "-" "Java/1.7.0_80"
127.0.0.1 - - [06/Mar/2017:08:30:04 +0000] "POST /api/atlas/types HTTP/1.1" 201 - "-" "Java/1.7.0_80"
127.0.0.1 - - [06/Mar/2017:08:30:04 +0000] "POST /api/atlas/types HTTP/1.1" 201 - "-" "Java/1.7.0_80"
127.0.0.1 - - [06/Mar/2017:08:30:04 +0000] "POST /api/atlas/types HTTP/1.1" 201 - "-" "Java/1.7.0_80"
127.0.0.1 - - [06/Mar/2017:08:30:04 +0000] "POST /api/atlas/entities/1b36038c-b075-4a3d-a377-35d0ea9758b4/traits HTTP/1.1" 201 - "-" "Java/1.7.0_80"
127.0.0.1 - - [06/Mar/2017:08:30:04 +0000] "POST /api/atlas/types HTTP/1.1" 201 - "-" "Java/1.7.0_80"
127.0.0.1 - - [06/Mar/2017:08:30:04 +0000] "POST /api/atlas/entities/1b36038c-b075-4a3d-a377-35d0ea9758b4/traits HTTP/1.1" 201 - "-" "Java/1.7.0_80"
127.0.0.1 - - [06/Mar/2017:08:30:04 +0000] "DELETE /api/atlas/entities/1b36038c-b075-4a3d-a377-35d0ea9758b4/traits/Traityk51nupLEy HTTP/1.1" 200 - "-" "Java/1.7.0_80"
127.0.0.1 - - [06/Mar/2017:08:30:04 +0000] "POST /api/atlas/entities/1b36038c-b075-4a3d-a377-35d0ea9758b4?property=description HTTP/1.1" 200 - "-" "Java/1.7.0_80"
127.0.0.1 - - [06/Mar/2017:08:30:04 +0000] "POST /api/atlas/entities HTTP/1.1" 201 - "-" "Java/1.7.0_80"
127.0.0.1 - - [06/Mar/2017:08:30:04 +0000] "POST /api/atlas/entities HTTP/1.1" 201 - "-" "Java/1.7.0_80"
127.0.0.1 - - [06/Mar/2017:08:30:05 +0000] "DELETE /api/atlas/entities?type=hive_table&property=qualifiedName&value=table-JGGamnMb1M HTTP/1.1" 200 - "-" "Java/1.7.0_80"
Tests run: 5, Failures: 0, Errors: 0, Skipped: 0, Time elapsed: 6.487 sec - in org.apache.atlas.notification.EntityNotificationIT
Running org.apache.atlas.notification.NotificationHookConsumerIT
127.0.0.1 - - [06/Mar/2017:08:30:08 +0000] "GET /api/atlas/types/tableType HTTP/1.1" 200 - "-" "Java/1.7.0_80"
127.0.0.1 - - [06/Mar/2017:08:30:08 +0000] "GET /api/atlas/types/serdeType HTTP/1.1" 200 - "-" "Java/1.7.0_80"
127.0.0.1 - - [06/Mar/2017:08:30:08 +0000] "GET /api/atlas/types/classification HTTP/1.1" 200 - "-" "Java/1.7.0_80"
127.0.0.1 - - [06/Mar/2017:08:30:08 +0000] "GET /api/atlas/types/hive_db_v1 HTTP/1.1" 200 - "-" "Java/1.7.0_80"
127.0.0.1 - - [06/Mar/2017:08:30:09 +0000] "GET /api/atlas/discovery/search/dsl?query=hive_db+where+qualifiedName%3D'dbphTbBKzE9U'&limit=10&offset=0 HTTP/1.1" 200 - "-" "Java/1.7.0_80"
127.0.0.1 - - [06/Mar/2017:08:30:10 +0000] "GET /api/atlas/entities?type=hive_db&property=qualifiedName&value=dbphTbBKzE9U HTTP/1.1" 200 - "-" "Java/1.7.0_80"
127.0.0.1 - - [06/Mar/2017:08:30:10 +0000] "GET /api/atlas/entities/a676418e-05e7-4e57-b80b-c5f13bacd449/audit?count=1 HTTP/1.1" 200 - "-" "Java/1.7.0_80"
127.0.0.1 - - [06/Mar/2017:08:30:10 +0000] "POST /api/atlas/entities HTTP/1.1" 201 - "-" "Java/1.7.0_80"
127.0.0.1 - - [06/Mar/2017:08:30:10 +0000] "GET /api/atlas/entities/0d7d64a3-d45a-495d-9833-46120f8126f2 HTTP/1.1" 200 - "-" "Java/1.7.0_80"
127.0.0.1 - - [06/Mar/2017:08:30:10 +0000] "GET /api/atlas/discovery/search/dsl?query=hive_db+where+name%3D'dbI4ZCLWltiQ'&limit=10&offset=0 HTTP/1.1" 200 - "-" "Java/1.7.0_80"
127.0.0.1 - - [06/Mar/2017:08:30:11 +0000] "GET /api/atlas/discovery/search/dsl?query=hive_db+where+name%3D'dbI4ZCLWltiQ'&limit=10&offset=0 HTTP/1.1" 200 - "-" "Java/1.7.0_80"
127.0.0.1 - - [06/Mar/2017:08:30:12 +0000] "POST /api/atlas/entities HTTP/1.1" 201 - "-" "Java/1.7.0_80"
127.0.0.1 - - [06/Mar/2017:08:30:12 +0000] "GET /api/atlas/discovery/search/dsl?query=hive_db+where+qualifiedName%3D'dbSbcJ2GeqHp'&limit=10&offset=0 HTTP/1.1" 200 - "-" "Java/1.7.0_80"
127.0.0.1 - - [06/Mar/2017:08:30:13 +0000] "GET /api/atlas/entities?type=hive_db&property=qualifiedName&value=dbSbcJ2GeqHp HTTP/1.1" 200 - "-" "Java/1.7.0_80"
127.0.0.1 - - [06/Mar/2017:08:30:13 +0000] "POST /api/atlas/entities HTTP/1.1" 201 - "-" "Java/1.7.0_80"
127.0.0.1 - - [06/Mar/2017:08:30:13 +0000] "GET /api/atlas/entities?type=hive_db&property=qualifiedName&value=dbgBEkfvW90K HTTP/1.1" 500 - "-" "Java/1.7.0_80"
127.0.0.1 - - [06/Mar/2017:08:30:13 +0000] "POST /api/atlas/entities HTTP/1.1" 201 - "-" "Java/1.7.0_80"
127.0.0.1 - - [06/Mar/2017:08:30:13 +0000] "GET /api/atlas/discovery/search/dsl?query=hive_db+where+qualifiedName%3D'dbPqXCu26dNk'&limit=10&offset=0 HTTP/1.1" 200 - "-" "Java/1.7.0_80"
127.0.0.1 - - [06/Mar/2017:08:30:14 +0000] "GET /api/atlas/discovery/search/dsl?query=hive_db+where+qualifiedName%3D'dbJphaBo8y1z'&limit=10&offset=0 HTTP/1.1" 200 - "-" "Java/1.7.0_80"
Tests run: 6, Failures: 1, Errors: 0, Skipped: 0, Time elapsed: 9.822 sec <<< FAILURE! - in org.apache.atlas.notification.NotificationHookConsumerIT
testUpdateEntityPartial(org.apache.atlas.notification.NotificationHookConsumerIT)  Time elapsed: 0.58 sec  <<< FAILURE!
org.apache.atlas.AtlasServiceException: Metadata service API org.apache.atlas.AtlasBaseClient$APIInfo@580a4f3e failed with status 500 (Internal Server Error) Response Body ({"error":"Could not execute operation due to backend exception"})
	at org.apache.atlas.notification.NotificationHookConsumerIT.testUpdateEntityPartial(NotificationHookConsumerIT.java:130)


Results :

Failed tests: 
  NotificationHookConsumerIT.testUpdateEntityPartial:130->BaseResourceIT.waitFor:641 » AtlasService

Tests run: 133, Failures: 1, Errors: 0, Skipped: 0

[INFO] 
[INFO] --- jetty-maven-plugin:9.2.12.v20150709:stop (stop-jetty) @ atlas-webapp ---
[INFO] Waiting 10 seconds for jetty to stop
[INFO] Stopped ServerConnector@3d75fe7c{HTTP/1.1}{0.0.0.0:31000}
[INFO] Closing Spring root WebApplicationContext
[INFO] Shutting down log4j
[INFO] Stopped o.e.j.m.p.JettyWebAppContext@3ac14860{/,<https://builds.apache.org/job/apache-atlas-nightly/ws/webapp/target/atlas-webapp-0.8-incubating-SNAPSHOT/,UNAVAILABLE}{/home/jenkins/jenkins-slave/workspace/apache-atlas-nightly/webapp/target/atlas-webapp-0.8-incubating-SNAPSHOT.war}>
[INFO] Server reports itself as stopped
[INFO] 
[INFO] --- maven-source-plugin:2.4:jar-no-fork (attach-sources) @ atlas-webapp ---
[INFO] Building jar: <https://builds.apache.org/job/apache-atlas-nightly/ws/webapp/target/atlas-webapp-0.8-incubating-SNAPSHOT-sources.jar>
log4j:WARN No appenders could be found for logger (org.apache.zookeeper.ClientCnxn).
log4j:WARN Please initialize the log4j system properly.
log4j:WARN See http://logging.apache.org/log4j/1.2/faq.html#noconfig for more info.
[INFO] 
[INFO] --- maven-source-plugin:2.4:test-jar-no-fork (attach-sources) @ atlas-webapp ---
[INFO] Building jar: <https://builds.apache.org/job/apache-atlas-nightly/ws/webapp/target/atlas-webapp-0.8-incubating-SNAPSHOT-test-sources.jar>
[INFO] 
[INFO] --- maven-failsafe-plugin:2.19.1:verify (verify) @ atlas-webapp ---
[INFO] ------------------------------------------------------------------------
[INFO] Reactor Summary:
[INFO] 
[INFO] Apache Atlas Server Build Tools .................... SUCCESS [  0.845 s]
[INFO] apache-atlas ....................................... SUCCESS [  6.817 s]
[INFO] Apache Atlas Integration ........................... SUCCESS [ 57.952 s]
[INFO] Apache Atlas Common ................................ SUCCESS [ 18.877 s]
[INFO] Apache Atlas Typesystem ............................ SUCCESS [01:32 min]
[INFO] Apache Atlas Client ................................ SUCCESS [ 20.804 s]
[INFO] Apache Atlas Server API ............................ SUCCESS [ 11.913 s]
[INFO] Apache Atlas Notification .......................... SUCCESS [ 41.401 s]
[INFO] Apache Atlas Graph Database Projects ............... SUCCESS [  0.637 s]
[INFO] Apache Atlas Graph Database API .................... SUCCESS [  7.904 s]
[INFO] Graph Database Common Code ......................... SUCCESS [  8.096 s]
[INFO] Apache Atlas Titan 1.0.0 GraphDB Impl .............. SUCCESS [ 32.894 s]
[INFO] Shaded version of Apache hbase client .............. SUCCESS [  8.814 s]
[INFO] Apache Atlas Titan 0.5.4 Graph DB Impl ............. SUCCESS [01:44 min]
[INFO] Apache Atlas Graph Database Implementation Dependencies SUCCESS [  0.708 s]
[INFO] Shaded version of Apache hbase server .............. SUCCESS [ 23.817 s]
[INFO] Apache Atlas Repository ............................ SUCCESS [15:57 min]
[INFO] Apache Atlas Authorization ......................... SUCCESS [ 15.670 s]
[INFO] Apache Atlas Business Catalog ...................... SUCCESS [ 34.905 s]
[INFO] Apache Atlas UI .................................... SUCCESS [ 58.687 s]
[INFO] Apache Atlas Web Application ....................... FAILURE [08:59 min]
[INFO] Apache Atlas Documentation ......................... SKIPPED
[INFO] Apache Atlas FileSystem Model ...................... SKIPPED
[INFO] Apache Atlas Plugin Classloader .................... SKIPPED
[INFO] Apache Atlas Hive Bridge Shim ...................... SKIPPED
[INFO] Apache Atlas Hive Bridge ........................... SKIPPED
[INFO] Apache Atlas Falcon Bridge Shim .................... SKIPPED
[INFO] Apache Atlas Falcon Bridge ......................... SKIPPED
[INFO] Apache Atlas Sqoop Bridge Shim ..................... SKIPPED
[INFO] Apache Atlas Sqoop Bridge .......................... SKIPPED
[INFO] Apache Atlas Storm Bridge Shim ..................... SKIPPED
[INFO] Apache Atlas Storm Bridge .......................... SKIPPED
[INFO] Apache Atlas Distribution .......................... SKIPPED
[INFO] ------------------------------------------------------------------------
[INFO] BUILD FAILURE
[INFO] ------------------------------------------------------------------------
[INFO] Total time: 34:07 min
[INFO] Finished at: 2017-03-06T08:30:21+00:00
[INFO] Final Memory: 358M/2001M
[INFO] ------------------------------------------------------------------------
[ERROR] Failed to execute goal org.apache.maven.plugins:maven-failsafe-plugin:2.19.1:verify (verify) on project atlas-webapp: There are test failures.
[ERROR] 
[ERROR] Please refer to <https://builds.apache.org/job/apache-atlas-nightly/ws/webapp/target/failsafe-reports> for the individual test results.
[ERROR] -> [Help 1]
[ERROR] 
[ERROR] To see the full stack trace of the errors, re-run Maven with the -e switch.
[ERROR] Re-run Maven using the -X switch to enable full debug logging.
[ERROR] 
[ERROR] For more information about the errors and possible solutions, please read the following articles:
[ERROR] [Help 1] http://cwiki.apache.org/confluence/display/MAVEN/MojoFailureException
[ERROR] 
[ERROR] After correcting the problems, you can resume the build with the command
[ERROR]   mvn <goals> -rf :atlas-webapp
Build step 'Execute shell' marked build as failure
[CHECKSTYLE] Collecting checkstyle analysis files...
[CHECKSTYLE] Finding all files that match the pattern **/target/checkstyle-result.xml
[CHECKSTYLE] Parsing 31 files in <https://builds.apache.org/job/apache-atlas-nightly/ws/>
[CHECKSTYLE] Successfully parsed file <https://builds.apache.org/job/apache-atlas-nightly/ws/addons/falcon-bridge-shim/target/checkstyle-result.xml> with 29 unique warnings and 0 duplicates.
[CHECKSTYLE] Successfully parsed file <https://builds.apache.org/job/apache-atlas-nightly/ws/addons/falcon-bridge/target/checkstyle-result.xml> with 420 unique warnings and 0 duplicates.
[CHECKSTYLE] Successfully parsed file <https://builds.apache.org/job/apache-atlas-nightly/ws/addons/hdfs-model/target/checkstyle-result.xml> with 420 unique warnings and 0 duplicates.
[CHECKSTYLE] Successfully parsed file <https://builds.apache.org/job/apache-atlas-nightly/ws/addons/hive-bridge-shim/target/checkstyle-result.xml> with 435 unique warnings and 0 duplicates.
[CHECKSTYLE] Successfully parsed file <https://builds.apache.org/job/apache-atlas-nightly/ws/addons/sqoop-bridge-shim/target/checkstyle-result.xml> with 451 unique warnings and 0 duplicates.
[CHECKSTYLE] Successfully parsed file <https://builds.apache.org/job/apache-atlas-nightly/ws/addons/sqoop-bridge/target/checkstyle-result.xml> with 576 unique warnings and 0 duplicates.
[CHECKSTYLE] Successfully parsed file <https://builds.apache.org/job/apache-atlas-nightly/ws/addons/storm-bridge-shim/target/checkstyle-result.xml> with 597 unique warnings and 0 duplicates.
[CHECKSTYLE] Successfully parsed file <https://builds.apache.org/job/apache-atlas-nightly/ws/addons/storm-bridge/target/checkstyle-result.xml> with 866 unique warnings and 0 duplicates.
[CHECKSTYLE] Successfully parsed file <https://builds.apache.org/job/apache-atlas-nightly/ws/authorization/target/checkstyle-result.xml> with 1319 unique warnings and 0 duplicates.
[CHECKSTYLE] Successfully parsed file <https://builds.apache.org/job/apache-atlas-nightly/ws/catalog/target/checkstyle-result.xml> with 3453 unique warnings and 0 duplicates.
[CHECKSTYLE] Successfully parsed file <https://builds.apache.org/job/apache-atlas-nightly/ws/client/target/checkstyle-result.xml> with 5063 unique warnings and 0 duplicates.
[CHECKSTYLE] Successfully parsed file <https://builds.apache.org/job/apache-atlas-nightly/ws/common/target/checkstyle-result.xml> with 6245 unique warnings and 0 duplicates.
[CHECKSTYLE] Successfully parsed file <https://builds.apache.org/job/apache-atlas-nightly/ws/dashboardv2/target/checkstyle-result.xml> with 6245 unique warnings and 0 duplicates.
[CHECKSTYLE] Successfully parsed file <https://builds.apache.org/job/apache-atlas-nightly/ws/distro/target/checkstyle-result.xml> with 6245 unique warnings and 0 duplicates.
[CHECKSTYLE] Successfully parsed file <https://builds.apache.org/job/apache-atlas-nightly/ws/docs/target/checkstyle-result.xml> with 6245 unique warnings and 0 duplicates.
[CHECKSTYLE] Successfully parsed file <https://builds.apache.org/job/apache-atlas-nightly/ws/graphdb/api/target/checkstyle-result.xml> with 6490 unique warnings and 0 duplicates.
[CHECKSTYLE] Successfully parsed file <https://builds.apache.org/job/apache-atlas-nightly/ws/graphdb/common/target/checkstyle-result.xml> with 6639 unique warnings and 0 duplicates.
[CHECKSTYLE] Successfully parsed file <https://builds.apache.org/job/apache-atlas-nightly/ws/graphdb/graphdb-impls/target/checkstyle-result.xml> with 6639 unique warnings and 0 duplicates.
[CHECKSTYLE] Successfully parsed file <https://builds.apache.org/job/apache-atlas-nightly/ws/graphdb/target/checkstyle-result.xml> with 6639 unique warnings and 0 duplicates.
[CHECKSTYLE] Successfully parsed file <https://builds.apache.org/job/apache-atlas-nightly/ws/graphdb/titan0/target/checkstyle-result.xml> with 8859 unique warnings and 0 duplicates.
[CHECKSTYLE] Successfully parsed file <https://builds.apache.org/job/apache-atlas-nightly/ws/graphdb/titan1/target/checkstyle-result.xml> with 9764 unique warnings and 0 duplicates.
[CHECKSTYLE] Successfully parsed file <https://builds.apache.org/job/apache-atlas-nightly/ws/intg/target/checkstyle-result.xml> with 15663 unique warnings and 0 duplicates.
[CHECKSTYLE] Successfully parsed file <https://builds.apache.org/job/apache-atlas-nightly/ws/notification/target/checkstyle-result.xml> with 16828 unique warnings and 0 duplicates.
[CHECKSTYLE] Successfully parsed file <https://builds.apache.org/job/apache-atlas-nightly/ws/plugin-classloader/target/checkstyle-result.xml> with 16936 unique warnings and 0 duplicates.
[CHECKSTYLE] Successfully parsed file <https://builds.apache.org/job/apache-atlas-nightly/ws/repository/target/checkstyle-result.xml> with 31568 unique warnings and 0 duplicates.
[CHECKSTYLE] Successfully parsed file <https://builds.apache.org/job/apache-atlas-nightly/ws/server-api/target/checkstyle-result.xml> with 31965 unique warnings and 0 duplicates.
[CHECKSTYLE] Successfully parsed file <https://builds.apache.org/job/apache-atlas-nightly/ws/shaded/hbase-client-shaded/target/checkstyle-result.xml> with 31965 unique warnings and 0 duplicates.
[CHECKSTYLE] Successfully parsed file <https://builds.apache.org/job/apache-atlas-nightly/ws/shaded/hbase-server-shaded/target/checkstyle-result.xml> with 31965 unique warnings and 0 duplicates.
[CHECKSTYLE] Successfully parsed file <https://builds.apache.org/job/apache-atlas-nightly/ws/target/checkstyle-result.xml> with 31965 unique warnings and 0 duplicates.
[CHECKSTYLE] Successfully parsed file <https://builds.apache.org/job/apache-atlas-nightly/ws/titan/target/checkstyle-result.xml> with 32427 unique warnings and 0 duplicates.
[CHECKSTYLE] Successfully parsed file <https://builds.apache.org/job/apache-atlas-nightly/ws/typesystem/target/checkstyle-result.xml> with 36646 unique warnings and 0 duplicates.
[CHECKSTYLE] Computing warning deltas based on reference build #535
[FINDBUGS] Collecting findbugs analysis files...
[FINDBUGS] Finding all files that match the pattern **/target/findbugs.xml
[FINDBUGS] Parsing 21 files in <https://builds.apache.org/job/apache-atlas-nightly/ws/>
[FINDBUGS] Successfully parsed file <https://builds.apache.org/job/apache-atlas-nightly/ws/addons/falcon-bridge-shim/target/findbugs.xml> with 0 unique warnings and 0 duplicates.
[FINDBUGS] Successfully parsed file <https://builds.apache.org/job/apache-atlas-nightly/ws/addons/falcon-bridge/target/findbugs.xml> with 0 unique warnings and 0 duplicates.
[FINDBUGS] Successfully parsed file <https://builds.apache.org/job/apache-atlas-nightly/ws/addons/hive-bridge-shim/target/findbugs.xml> with 0 unique warnings and 0 duplicates.
[FINDBUGS] Successfully parsed file <https://builds.apache.org/job/apache-atlas-nightly/ws/addons/sqoop-bridge-shim/target/findbugs.xml> with 0 unique warnings and 0 duplicates.
[FINDBUGS] Successfully parsed file <https://builds.apache.org/job/apache-atlas-nightly/ws/addons/sqoop-bridge/target/findbugs.xml> with 0 unique warnings and 0 duplicates.
[FINDBUGS] Successfully parsed file <https://builds.apache.org/job/apache-atlas-nightly/ws/addons/storm-bridge-shim/target/findbugs.xml> with 0 unique warnings and 0 duplicates.
[FINDBUGS] Successfully parsed file <https://builds.apache.org/job/apache-atlas-nightly/ws/addons/storm-bridge/target/findbugs.xml> with 0 unique warnings and 0 duplicates.
[FINDBUGS] Successfully parsed file <https://builds.apache.org/job/apache-atlas-nightly/ws/authorization/target/findbugs.xml> with 0 unique warnings and 0 duplicates.
[FINDBUGS] Successfully parsed file <https://builds.apache.org/job/apache-atlas-nightly/ws/catalog/target/findbugs.xml> with 0 unique warnings and 0 duplicates.
[FINDBUGS] Successfully parsed file <https://builds.apache.org/job/apache-atlas-nightly/ws/client/target/findbugs.xml> with 0 unique warnings and 0 duplicates.
[FINDBUGS] Successfully parsed file <https://builds.apache.org/job/apache-atlas-nightly/ws/common/target/findbugs.xml> with 0 unique warnings and 0 duplicates.
[FINDBUGS] Successfully parsed file <https://builds.apache.org/job/apache-atlas-nightly/ws/graphdb/api/target/findbugs.xml> with 0 unique warnings and 0 duplicates.
[FINDBUGS] Successfully parsed file <https://builds.apache.org/job/apache-atlas-nightly/ws/graphdb/common/target/findbugs.xml> with 0 unique warnings and 0 duplicates.
[FINDBUGS] Successfully parsed file <https://builds.apache.org/job/apache-atlas-nightly/ws/graphdb/titan0/target/findbugs.xml> with 0 unique warnings and 0 duplicates.
[FINDBUGS] Successfully parsed file <https://builds.apache.org/job/apache-atlas-nightly/ws/intg/target/findbugs.xml> with 0 unique warnings and 0 duplicates.
[FINDBUGS] Successfully parsed file <https://builds.apache.org/job/apache-atlas-nightly/ws/notification/target/findbugs.xml> with 0 unique warnings and 0 duplicates.
[FINDBUGS] Successfully parsed file <https://builds.apache.org/job/apache-atlas-nightly/ws/plugin-classloader/target/findbugs.xml> with 0 unique warnings and 0 duplicates.
[FINDBUGS] Successfully parsed file <https://builds.apache.org/job/apache-atlas-nightly/ws/repository/target/findbugs.xml> with 0 unique warnings and 0 duplicates.
[FINDBUGS] Successfully parsed file <https://builds.apache.org/job/apache-atlas-nightly/ws/server-api/target/findbugs.xml> with 0 unique warnings and 0 duplicates.
[FINDBUGS] Successfully parsed file <https://builds.apache.org/job/apache-atlas-nightly/ws/titan/target/findbugs.xml> with 0 unique warnings and 0 duplicates.
[FINDBUGS] Successfully parsed file <https://builds.apache.org/job/apache-atlas-nightly/ws/typesystem/target/findbugs.xml> with 0 unique warnings and 0 duplicates.
[FINDBUGS] Computing warning deltas based on reference build #535
Archiving artifacts
Compressed 573.65 MB of artifacts by 63.3% relative to #535
TestNG Reports Processing: START
Looking for TestNG results report in workspace using pattern: **/target/surefire-reports/testng-results.xml,**/target/failsafe-reports/testng-results.xml
testng-results.xml was last modified before this build started. Ignoring it.
testng-results.xml was last modified before this build started. Ignoring it.
testng-results.xml was last modified before this build started. Ignoring it.
testng-results.xml was last modified before this build started. Ignoring it.
testng-results.xml was last modified before this build started. Ignoring it.
testng-results.xml was last modified before this build started. Ignoring it.
testng-results.xml was last modified before this build started. Ignoring it.
Saving reports...
Processing '/x1/jenkins/jenkins-home/jobs/apache-atlas-nightly/builds/673/testng/testng-results-1.xml'
Processing '/x1/jenkins/jenkins-home/jobs/apache-atlas-nightly/builds/673/testng/testng-results-10.xml'
Processing '/x1/jenkins/jenkins-home/jobs/apache-atlas-nightly/builds/673/testng/testng-results-2.xml'
Processing '/x1/jenkins/jenkins-home/jobs/apache-atlas-nightly/builds/673/testng/testng-results-3.xml'
Processing '/x1/jenkins/jenkins-home/jobs/apache-atlas-nightly/builds/673/testng/testng-results-4.xml'
Processing '/x1/jenkins/jenkins-home/jobs/apache-atlas-nightly/builds/673/testng/testng-results-5.xml'
Processing '/x1/jenkins/jenkins-home/jobs/apache-atlas-nightly/builds/673/testng/testng-results-6.xml'
Processing '/x1/jenkins/jenkins-home/jobs/apache-atlas-nightly/builds/673/testng/testng-results-7.xml'
Processing '/x1/jenkins/jenkins-home/jobs/apache-atlas-nightly/builds/673/testng/testng-results-8.xml'
Processing '/x1/jenkins/jenkins-home/jobs/apache-atlas-nightly/builds/673/testng/testng-results-9.xml'
Processing '/x1/jenkins/jenkins-home/jobs/apache-atlas-nightly/builds/673/testng/testng-results.xml'
1.785714% of tests failed, which exceeded threshold of 0%. Marking build as UNSTABLE
TestNG Reports Processing: FINISH

Jenkins build is back to normal : apache-atlas-nightly #679

Posted by Apache Jenkins Server <je...@builds.apache.org>.
See <https://builds.apache.org/job/apache-atlas-nightly/679/display/redirect?page=changes>


Build failed in Jenkins: apache-atlas-nightly #678

Posted by Apache Jenkins Server <je...@builds.apache.org>.
See <https://builds.apache.org/job/apache-atlas-nightly/678/display/redirect?page=changes>

Changes:

[madhan] ATLAS-1651: changed version in master to 0.9-incubating-SNAPSHOT

------------------------------------------
[...truncated 535.55 KB...]
127.0.0.1 - - [07/Mar/2017:10:10:27 +0000] "GET /api/atlas/v2/lineage/442df315-0159-426b-9273-d4e0dfc3f216?direction=BOTH&depth=5 HTTP/1.1" 200 - "-" "Java/1.7.0_80"
127.0.0.1 - - [07/Mar/2017:10:10:29 +0000] "GET /api/atlas/entities?type=hive_table_v1&property=qualifiedName&value=sales_factw041QPVYVn HTTP/1.1" 200 - "-" "Java/1.7.0_80"
127.0.0.1 - - [07/Mar/2017:10:10:29 +0000] "GET /api/atlas/v2/lineage/2beb7721-f7d2-40dd-a448-796c3771b517?direction=OUTPUT&depth=5 HTTP/1.1" 200 - "-" "Java/1.7.0_80"
Tests run: 11, Failures: 0, Errors: 0, Skipped: 0, Time elapsed: 17.012 sec - in org.apache.atlas.web.resources.EntityLineageJerseyResourceIT
Running org.apache.atlas.CredentialProviderUtilityIT
Tests run: 4, Failures: 0, Errors: 0, Skipped: 0, Time elapsed: 1.642 sec - in org.apache.atlas.CredentialProviderUtilityIT
Running org.apache.atlas.notification.EntityNotificationIT
127.0.0.1 - - [07/Mar/2017:10:10:36 +0000] "GET /api/atlas/types/tableType HTTP/1.1" 200 - "-" "Java/1.7.0_80"
127.0.0.1 - - [07/Mar/2017:10:10:36 +0000] "GET /api/atlas/types/serdeType HTTP/1.1" 200 - "-" "Java/1.7.0_80"
127.0.0.1 - - [07/Mar/2017:10:10:36 +0000] "GET /api/atlas/types/classification HTTP/1.1" 200 - "-" "Java/1.7.0_80"
127.0.0.1 - - [07/Mar/2017:10:10:36 +0000] "GET /api/atlas/types/hive_db_v1 HTTP/1.1" 200 - "-" "Java/1.7.0_80"
127.0.0.1 - - [07/Mar/2017:10:10:37 +0000] "POST /api/atlas/entities HTTP/1.1" 201 - "-" "Java/1.7.0_80"
127.0.0.1 - - [07/Mar/2017:10:10:38 +0000] "POST /api/atlas/entities HTTP/1.1" 201 - "-" "Java/1.7.0_80"
127.0.0.1 - - [07/Mar/2017:10:10:39 +0000] "POST /api/atlas/types HTTP/1.1" 201 - "-" "Java/1.7.0_80"
127.0.0.1 - - [07/Mar/2017:10:10:39 +0000] "POST /api/atlas/types HTTP/1.1" 201 - "-" "Java/1.7.0_80"
127.0.0.1 - - [07/Mar/2017:10:10:39 +0000] "POST /api/atlas/types HTTP/1.1" 201 - "-" "Java/1.7.0_80"
127.0.0.1 - - [07/Mar/2017:10:10:39 +0000] "POST /api/atlas/entities/48530cb8-d0de-43aa-8399-e7d8c49c039b/traits HTTP/1.1" 201 - "-" "Java/1.7.0_80"
127.0.0.1 - - [07/Mar/2017:10:10:39 +0000] "POST /api/atlas/types HTTP/1.1" 201 - "-" "Java/1.7.0_80"
127.0.0.1 - - [07/Mar/2017:10:10:39 +0000] "POST /api/atlas/entities/48530cb8-d0de-43aa-8399-e7d8c49c039b/traits HTTP/1.1" 201 - "-" "Java/1.7.0_80"
127.0.0.1 - - [07/Mar/2017:10:10:39 +0000] "DELETE /api/atlas/entities/48530cb8-d0de-43aa-8399-e7d8c49c039b/traits/TraitJilrKNAvFs HTTP/1.1" 200 - "-" "Java/1.7.0_80"
127.0.0.1 - - [07/Mar/2017:10:10:39 +0000] "POST /api/atlas/entities/48530cb8-d0de-43aa-8399-e7d8c49c039b?property=description HTTP/1.1" 200 - "-" "Java/1.7.0_80"
127.0.0.1 - - [07/Mar/2017:10:10:39 +0000] "POST /api/atlas/entities HTTP/1.1" 201 - "-" "Java/1.7.0_80"
127.0.0.1 - - [07/Mar/2017:10:10:39 +0000] "POST /api/atlas/entities HTTP/1.1" 201 - "-" "Java/1.7.0_80"
127.0.0.1 - - [07/Mar/2017:10:10:40 +0000] "DELETE /api/atlas/entities?type=hive_table&property=qualifiedName&value=table-LNqWdo2zw1 HTTP/1.1" 200 - "-" "Java/1.7.0_80"
Tests run: 5, Failures: 0, Errors: 0, Skipped: 0, Time elapsed: 6.324 sec - in org.apache.atlas.notification.EntityNotificationIT
Running org.apache.atlas.notification.NotificationHookConsumerIT
127.0.0.1 - - [07/Mar/2017:10:10:43 +0000] "GET /api/atlas/types/tableType HTTP/1.1" 200 - "-" "Java/1.7.0_80"
127.0.0.1 - - [07/Mar/2017:10:10:43 +0000] "GET /api/atlas/types/serdeType HTTP/1.1" 200 - "-" "Java/1.7.0_80"
127.0.0.1 - - [07/Mar/2017:10:10:43 +0000] "GET /api/atlas/types/classification HTTP/1.1" 200 - "-" "Java/1.7.0_80"
127.0.0.1 - - [07/Mar/2017:10:10:43 +0000] "GET /api/atlas/types/hive_db_v1 HTTP/1.1" 200 - "-" "Java/1.7.0_80"
127.0.0.1 - - [07/Mar/2017:10:10:44 +0000] "GET /api/atlas/discovery/search/dsl?query=hive_db+where+qualifiedName%3D'dbX2ykm95UXH'&limit=10&offset=0 HTTP/1.1" 200 - "-" "Java/1.7.0_80"
127.0.0.1 - - [07/Mar/2017:10:10:45 +0000] "GET /api/atlas/entities?type=hive_db&property=qualifiedName&value=dbX2ykm95UXH HTTP/1.1" 200 - "-" "Java/1.7.0_80"
127.0.0.1 - - [07/Mar/2017:10:10:45 +0000] "GET /api/atlas/entities/d0ceaa2f-256e-4153-888d-a18f73510ce2/audit?count=1 HTTP/1.1" 200 - "-" "Java/1.7.0_80"
127.0.0.1 - - [07/Mar/2017:10:10:45 +0000] "POST /api/atlas/entities HTTP/1.1" 201 - "-" "Java/1.7.0_80"
127.0.0.1 - - [07/Mar/2017:10:10:45 +0000] "GET /api/atlas/entities/c9390616-b348-40d2-a670-5ff84786ed2b HTTP/1.1" 200 - "-" "Java/1.7.0_80"
127.0.0.1 - - [07/Mar/2017:10:10:45 +0000] "GET /api/atlas/entities/c9390616-b348-40d2-a670-5ff84786ed2b HTTP/1.1" 200 - "-" "Java/1.7.0_80"
127.0.0.1 - - [07/Mar/2017:10:10:45 +0000] "GET /api/atlas/discovery/search/dsl?query=hive_db+where+name%3D'dbsfyGJtZPmG'&limit=10&offset=0 HTTP/1.1" 200 - "-" "Java/1.7.0_80"
127.0.0.1 - - [07/Mar/2017:10:10:46 +0000] "GET /api/atlas/discovery/search/dsl?query=hive_db+where+name%3D'dbsfyGJtZPmG'&limit=10&offset=0 HTTP/1.1" 200 - "-" "Java/1.7.0_80"
127.0.0.1 - - [07/Mar/2017:10:10:47 +0000] "POST /api/atlas/entities HTTP/1.1" 201 - "-" "Java/1.7.0_80"
127.0.0.1 - - [07/Mar/2017:10:10:47 +0000] "GET /api/atlas/discovery/search/dsl?query=hive_db+where+qualifiedName%3D'dbVUirPPnag3'&limit=10&offset=0 HTTP/1.1" 200 - "-" "Java/1.7.0_80"
127.0.0.1 - - [07/Mar/2017:10:10:48 +0000] "GET /api/atlas/entities?type=hive_db&property=qualifiedName&value=dbVUirPPnag3 HTTP/1.1" 200 - "-" "Java/1.7.0_80"
127.0.0.1 - - [07/Mar/2017:10:10:48 +0000] "POST /api/atlas/entities HTTP/1.1" 201 - "-" "Java/1.7.0_80"
127.0.0.1 - - [07/Mar/2017:10:10:48 +0000] "GET /api/atlas/entities?type=hive_db&property=qualifiedName&value=dbo5BjnihV4R HTTP/1.1" 500 - "-" "Java/1.7.0_80"
127.0.0.1 - - [07/Mar/2017:10:10:48 +0000] "POST /api/atlas/entities HTTP/1.1" 201 - "-" "Java/1.7.0_80"
127.0.0.1 - - [07/Mar/2017:10:10:48 +0000] "GET /api/atlas/discovery/search/dsl?query=hive_db+where+qualifiedName%3D'dbd6eeYImIMt'&limit=10&offset=0 HTTP/1.1" 200 - "-" "Java/1.7.0_80"
127.0.0.1 - - [07/Mar/2017:10:10:49 +0000] "GET /api/atlas/discovery/search/dsl?query=hive_db+where+qualifiedName%3D'dbmf6mOidRV3'&limit=10&offset=0 HTTP/1.1" 200 - "-" "Java/1.7.0_80"
Tests run: 6, Failures: 1, Errors: 0, Skipped: 0, Time elapsed: 9.803 sec <<< FAILURE! - in org.apache.atlas.notification.NotificationHookConsumerIT
testUpdateEntityPartial(org.apache.atlas.notification.NotificationHookConsumerIT)  Time elapsed: 0.582 sec  <<< FAILURE!
org.apache.atlas.AtlasServiceException: Metadata service API org.apache.atlas.AtlasBaseClient$APIInfo@5955c4d1 failed with status 500 (Internal Server Error) Response Body ({"error":"Could not execute operation due to backend exception"})
	at org.apache.atlas.notification.NotificationHookConsumerIT.testUpdateEntityPartial(NotificationHookConsumerIT.java:130)


Results :

Failed tests: 
  NotificationHookConsumerIT.testUpdateEntityPartial:130->BaseResourceIT.waitFor:641 » AtlasService
  EntityJerseyResourceIT.testPartialUpdate:741 expected:<2> but was:<1>

Tests run: 133, Failures: 2, Errors: 0, Skipped: 0

[INFO] 
[INFO] --- jetty-maven-plugin:9.2.12.v20150709:stop (stop-jetty) @ atlas-webapp ---
[INFO] Waiting 10 seconds for jetty to stop
[INFO] Stopped ServerConnector@2eb53921{HTTP/1.1}{0.0.0.0:31000}
[INFO] Closing Spring root WebApplicationContext
[ERROR] 
java.net.SocketTimeoutException: Read timed out
	at java.net.SocketInputStream.socketRead0(Native Method)
	at java.net.SocketInputStream.read(SocketInputStream.java:152)
	at java.net.SocketInputStream.read(SocketInputStream.java:122)
	at sun.nio.cs.StreamDecoder.readBytes(StreamDecoder.java:283)
	at sun.nio.cs.StreamDecoder.implRead(StreamDecoder.java:325)
	at sun.nio.cs.StreamDecoder.read(StreamDecoder.java:177)
	at java.io.InputStreamReader.read(InputStreamReader.java:184)
	at java.io.BufferedReader.fill(BufferedReader.java:154)
	at java.io.BufferedReader.readLine(BufferedReader.java:317)
	at java.io.LineNumberReader.readLine(LineNumberReader.java:199)
	at org.eclipse.jetty.maven.plugin.JettyStopMojo.execute(JettyStopMojo.java:100)
	at org.apache.maven.plugin.DefaultBuildPluginManager.executeMojo(DefaultBuildPluginManager.java:134)
	at org.apache.maven.lifecycle.internal.MojoExecutor.execute(MojoExecutor.java:207)
	at org.apache.maven.lifecycle.internal.MojoExecutor.execute(MojoExecutor.java:153)
	at org.apache.maven.lifecycle.internal.MojoExecutor.execute(MojoExecutor.java:145)
	at org.apache.maven.lifecycle.internal.LifecycleModuleBuilder.buildProject(LifecycleModuleBuilder.java:116)
	at org.apache.maven.lifecycle.internal.LifecycleModuleBuilder.buildProject(LifecycleModuleBuilder.java:80)
	at org.apache.maven.lifecycle.internal.builder.singlethreaded.SingleThreadedBuilder.build(SingleThreadedBuilder.java:51)
	at org.apache.maven.lifecycle.internal.LifecycleStarter.execute(LifecycleStarter.java:128)
	at org.apache.maven.DefaultMaven.doExecute(DefaultMaven.java:307)
	at org.apache.maven.DefaultMaven.doExecute(DefaultMaven.java:193)
	at org.apache.maven.DefaultMaven.execute(DefaultMaven.java:106)
	at org.apache.maven.cli.MavenCli.execute(MavenCli.java:863)
	at org.apache.maven.cli.MavenCli.doMain(MavenCli.java:288)
	at org.apache.maven.cli.MavenCli.main(MavenCli.java:199)
	at sun.reflect.NativeMethodAccessorImpl.invoke0(Native Method)
	at sun.reflect.NativeMethodAccessorImpl.invoke(NativeMethodAccessorImpl.java:57)
	at sun.reflect.DelegatingMethodAccessorImpl.invoke(DelegatingMethodAccessorImpl.java:43)
	at java.lang.reflect.Method.invoke(Method.java:606)
	at org.codehaus.plexus.classworlds.launcher.Launcher.launchEnhanced(Launcher.java:289)
	at org.codehaus.plexus.classworlds.launcher.Launcher.launch(Launcher.java:229)
	at org.codehaus.plexus.classworlds.launcher.Launcher.mainWithExitCode(Launcher.java:415)
	at org.codehaus.plexus.classworlds.launcher.Launcher.main(Launcher.java:356)
[INFO] 
[INFO] --- maven-source-plugin:2.4:jar-no-fork (attach-sources) @ atlas-webapp ---
[INFO] Building jar: <https://builds.apache.org/job/apache-atlas-nightly/ws/webapp/target/atlas-webapp-0.9-incubating-SNAPSHOT-sources.jar>
[INFO] 
[INFO] --- maven-source-plugin:2.4:test-jar-no-fork (attach-sources) @ atlas-webapp ---
[INFO] Building jar: <https://builds.apache.org/job/apache-atlas-nightly/ws/webapp/target/atlas-webapp-0.9-incubating-SNAPSHOT-test-sources.jar>
[INFO] 
[INFO] --- maven-failsafe-plugin:2.19.1:verify (verify) @ atlas-webapp ---
[INFO] ------------------------------------------------------------------------
[INFO] Reactor Summary:
[INFO] 
[INFO] Apache Atlas Server Build Tools .................... SUCCESS [  0.950 s]
[INFO] apache-atlas ....................................... SUCCESS [  7.830 s]
[INFO] Apache Atlas Integration ........................... SUCCESS [01:02 min]
[INFO] Apache Atlas Common ................................ SUCCESS [ 20.120 s]
[INFO] Apache Atlas Typesystem ............................ SUCCESS [01:34 min]
[INFO] Apache Atlas Client ................................ SUCCESS [ 21.497 s]
[INFO] Apache Atlas Server API ............................ SUCCESS [ 11.614 s]
[INFO] Apache Atlas Notification .......................... SUCCESS [ 43.319 s]
[INFO] Apache Atlas Graph Database Projects ............... SUCCESS [  0.655 s]
[INFO] Apache Atlas Graph Database API .................... SUCCESS [  7.728 s]
[INFO] Graph Database Common Code ......................... SUCCESS [  7.639 s]
[INFO] Apache Atlas Titan 1.0.0 GraphDB Impl .............. SUCCESS [ 32.351 s]
[INFO] Shaded version of Apache hbase client .............. SUCCESS [  8.887 s]
[INFO] Apache Atlas Titan 0.5.4 Graph DB Impl ............. SUCCESS [01:46 min]
[INFO] Apache Atlas Graph Database Implementation Dependencies SUCCESS [  0.744 s]
[INFO] Shaded version of Apache hbase server .............. SUCCESS [ 24.468 s]
[INFO] Apache Atlas Repository ............................ SUCCESS [16:24 min]
[INFO] Apache Atlas Authorization ......................... SUCCESS [ 15.885 s]
[INFO] Apache Atlas Business Catalog ...................... SUCCESS [ 35.120 s]
[INFO] Apache Atlas UI .................................... SUCCESS [01:35 min]
[INFO] Apache Atlas Web Application ....................... FAILURE [09:05 min]
[INFO] Apache Atlas Documentation ......................... SKIPPED
[INFO] Apache Atlas FileSystem Model ...................... SKIPPED
[INFO] Apache Atlas Plugin Classloader .................... SKIPPED
[INFO] Apache Atlas Hive Bridge Shim ...................... SKIPPED
[INFO] Apache Atlas Hive Bridge ........................... SKIPPED
[INFO] Apache Atlas Falcon Bridge Shim .................... SKIPPED
[INFO] Apache Atlas Falcon Bridge ......................... SKIPPED
[INFO] Apache Atlas Sqoop Bridge Shim ..................... SKIPPED
[INFO] Apache Atlas Sqoop Bridge .......................... SKIPPED
[INFO] Apache Atlas Storm Bridge Shim ..................... SKIPPED
[INFO] Apache Atlas Storm Bridge .......................... SKIPPED
[INFO] Apache Atlas Distribution .......................... SKIPPED
[INFO] ------------------------------------------------------------------------
[INFO] BUILD FAILURE
[INFO] ------------------------------------------------------------------------
[INFO] Total time: 35:29 min
[INFO] Finished at: 2017-03-07T10:11:01+00:00
[INFO] Final Memory: 374M/1992M
[INFO] ------------------------------------------------------------------------
[ERROR] Failed to execute goal org.apache.maven.plugins:maven-failsafe-plugin:2.19.1:verify (verify) on project atlas-webapp: There are test failures.
[ERROR] 
[ERROR] Please refer to <https://builds.apache.org/job/apache-atlas-nightly/ws/webapp/target/failsafe-reports> for the individual test results.
[ERROR] -> [Help 1]
[ERROR] 
[ERROR] To see the full stack trace of the errors, re-run Maven with the -e switch.
[ERROR] Re-run Maven using the -X switch to enable full debug logging.
[ERROR] 
[ERROR] For more information about the errors and possible solutions, please read the following articles:
[ERROR] [Help 1] http://cwiki.apache.org/confluence/display/MAVEN/MojoFailureException
[ERROR] 
[ERROR] After correcting the problems, you can resume the build with the command
[ERROR]   mvn <goals> -rf :atlas-webapp
Build step 'Execute shell' marked build as failure
[CHECKSTYLE] Collecting checkstyle analysis files...
[CHECKSTYLE] Finding all files that match the pattern **/target/checkstyle-result.xml
[CHECKSTYLE] Parsing 31 files in <https://builds.apache.org/job/apache-atlas-nightly/ws/>
[CHECKSTYLE] Successfully parsed file <https://builds.apache.org/job/apache-atlas-nightly/ws/addons/falcon-bridge-shim/target/checkstyle-result.xml> with 29 unique warnings and 0 duplicates.
[CHECKSTYLE] Successfully parsed file <https://builds.apache.org/job/apache-atlas-nightly/ws/addons/falcon-bridge/target/checkstyle-result.xml> with 420 unique warnings and 0 duplicates.
[CHECKSTYLE] Successfully parsed file <https://builds.apache.org/job/apache-atlas-nightly/ws/addons/hdfs-model/target/checkstyle-result.xml> with 420 unique warnings and 0 duplicates.
[CHECKSTYLE] Successfully parsed file <https://builds.apache.org/job/apache-atlas-nightly/ws/addons/hive-bridge-shim/target/checkstyle-result.xml> with 435 unique warnings and 0 duplicates.
[CHECKSTYLE] Successfully parsed file <https://builds.apache.org/job/apache-atlas-nightly/ws/addons/sqoop-bridge-shim/target/checkstyle-result.xml> with 451 unique warnings and 0 duplicates.
[CHECKSTYLE] Successfully parsed file <https://builds.apache.org/job/apache-atlas-nightly/ws/addons/sqoop-bridge/target/checkstyle-result.xml> with 576 unique warnings and 0 duplicates.
[CHECKSTYLE] Successfully parsed file <https://builds.apache.org/job/apache-atlas-nightly/ws/addons/storm-bridge-shim/target/checkstyle-result.xml> with 597 unique warnings and 0 duplicates.
[CHECKSTYLE] Successfully parsed file <https://builds.apache.org/job/apache-atlas-nightly/ws/addons/storm-bridge/target/checkstyle-result.xml> with 866 unique warnings and 0 duplicates.
[CHECKSTYLE] Successfully parsed file <https://builds.apache.org/job/apache-atlas-nightly/ws/authorization/target/checkstyle-result.xml> with 1319 unique warnings and 0 duplicates.
[CHECKSTYLE] Successfully parsed file <https://builds.apache.org/job/apache-atlas-nightly/ws/catalog/target/checkstyle-result.xml> with 3459 unique warnings and 0 duplicates.
[CHECKSTYLE] Successfully parsed file <https://builds.apache.org/job/apache-atlas-nightly/ws/client/target/checkstyle-result.xml> with 5069 unique warnings and 0 duplicates.
[CHECKSTYLE] Successfully parsed file <https://builds.apache.org/job/apache-atlas-nightly/ws/common/target/checkstyle-result.xml> with 6251 unique warnings and 0 duplicates.
[CHECKSTYLE] Successfully parsed file <https://builds.apache.org/job/apache-atlas-nightly/ws/dashboardv2/target/checkstyle-result.xml> with 6251 unique warnings and 0 duplicates.
[CHECKSTYLE] Successfully parsed file <https://builds.apache.org/job/apache-atlas-nightly/ws/distro/target/checkstyle-result.xml> with 6251 unique warnings and 0 duplicates.
[CHECKSTYLE] Successfully parsed file <https://builds.apache.org/job/apache-atlas-nightly/ws/docs/target/checkstyle-result.xml> with 6251 unique warnings and 0 duplicates.
[CHECKSTYLE] Successfully parsed file <https://builds.apache.org/job/apache-atlas-nightly/ws/graphdb/api/target/checkstyle-result.xml> with 6497 unique warnings and 0 duplicates.
[CHECKSTYLE] Successfully parsed file <https://builds.apache.org/job/apache-atlas-nightly/ws/graphdb/common/target/checkstyle-result.xml> with 6646 unique warnings and 0 duplicates.
[CHECKSTYLE] Successfully parsed file <https://builds.apache.org/job/apache-atlas-nightly/ws/graphdb/graphdb-impls/target/checkstyle-result.xml> with 6646 unique warnings and 0 duplicates.
[CHECKSTYLE] Successfully parsed file <https://builds.apache.org/job/apache-atlas-nightly/ws/graphdb/target/checkstyle-result.xml> with 6646 unique warnings and 0 duplicates.
[CHECKSTYLE] Successfully parsed file <https://builds.apache.org/job/apache-atlas-nightly/ws/graphdb/titan0/target/checkstyle-result.xml> with 8866 unique warnings and 0 duplicates.
[CHECKSTYLE] Successfully parsed file <https://builds.apache.org/job/apache-atlas-nightly/ws/graphdb/titan1/target/checkstyle-result.xml> with 9770 unique warnings and 0 duplicates.
[CHECKSTYLE] Successfully parsed file <https://builds.apache.org/job/apache-atlas-nightly/ws/intg/target/checkstyle-result.xml> with 15669 unique warnings and 0 duplicates.
[CHECKSTYLE] Successfully parsed file <https://builds.apache.org/job/apache-atlas-nightly/ws/notification/target/checkstyle-result.xml> with 16834 unique warnings and 0 duplicates.
[CHECKSTYLE] Successfully parsed file <https://builds.apache.org/job/apache-atlas-nightly/ws/plugin-classloader/target/checkstyle-result.xml> with 16942 unique warnings and 0 duplicates.
[CHECKSTYLE] Successfully parsed file <https://builds.apache.org/job/apache-atlas-nightly/ws/repository/target/checkstyle-result.xml> with 31611 unique warnings and 0 duplicates.
[CHECKSTYLE] Successfully parsed file <https://builds.apache.org/job/apache-atlas-nightly/ws/server-api/target/checkstyle-result.xml> with 32008 unique warnings and 0 duplicates.
[CHECKSTYLE] Successfully parsed file <https://builds.apache.org/job/apache-atlas-nightly/ws/shaded/hbase-client-shaded/target/checkstyle-result.xml> with 32008 unique warnings and 0 duplicates.
[CHECKSTYLE] Successfully parsed file <https://builds.apache.org/job/apache-atlas-nightly/ws/shaded/hbase-server-shaded/target/checkstyle-result.xml> with 32008 unique warnings and 0 duplicates.
[CHECKSTYLE] Successfully parsed file <https://builds.apache.org/job/apache-atlas-nightly/ws/target/checkstyle-result.xml> with 32008 unique warnings and 0 duplicates.
[CHECKSTYLE] Successfully parsed file <https://builds.apache.org/job/apache-atlas-nightly/ws/titan/target/checkstyle-result.xml> with 32470 unique warnings and 0 duplicates.
[CHECKSTYLE] Successfully parsed file <https://builds.apache.org/job/apache-atlas-nightly/ws/typesystem/target/checkstyle-result.xml> with 36689 unique warnings and 0 duplicates.
[CHECKSTYLE] Computing warning deltas based on reference build #535
[FINDBUGS] Collecting findbugs analysis files...
[FINDBUGS] Finding all files that match the pattern **/target/findbugs.xml
[FINDBUGS] Parsing 21 files in <https://builds.apache.org/job/apache-atlas-nightly/ws/>
[FINDBUGS] Successfully parsed file <https://builds.apache.org/job/apache-atlas-nightly/ws/addons/falcon-bridge-shim/target/findbugs.xml> with 0 unique warnings and 0 duplicates.
[FINDBUGS] Successfully parsed file <https://builds.apache.org/job/apache-atlas-nightly/ws/addons/falcon-bridge/target/findbugs.xml> with 0 unique warnings and 0 duplicates.
[FINDBUGS] Successfully parsed file <https://builds.apache.org/job/apache-atlas-nightly/ws/addons/hive-bridge-shim/target/findbugs.xml> with 0 unique warnings and 0 duplicates.
[FINDBUGS] Successfully parsed file <https://builds.apache.org/job/apache-atlas-nightly/ws/addons/sqoop-bridge-shim/target/findbugs.xml> with 0 unique warnings and 0 duplicates.
[FINDBUGS] Successfully parsed file <https://builds.apache.org/job/apache-atlas-nightly/ws/addons/sqoop-bridge/target/findbugs.xml> with 0 unique warnings and 0 duplicates.
[FINDBUGS] Successfully parsed file <https://builds.apache.org/job/apache-atlas-nightly/ws/addons/storm-bridge-shim/target/findbugs.xml> with 0 unique warnings and 0 duplicates.
[FINDBUGS] Successfully parsed file <https://builds.apache.org/job/apache-atlas-nightly/ws/addons/storm-bridge/target/findbugs.xml> with 0 unique warnings and 0 duplicates.
[FINDBUGS] Successfully parsed file <https://builds.apache.org/job/apache-atlas-nightly/ws/authorization/target/findbugs.xml> with 0 unique warnings and 0 duplicates.
[FINDBUGS] Successfully parsed file <https://builds.apache.org/job/apache-atlas-nightly/ws/catalog/target/findbugs.xml> with 0 unique warnings and 0 duplicates.
[FINDBUGS] Successfully parsed file <https://builds.apache.org/job/apache-atlas-nightly/ws/client/target/findbugs.xml> with 0 unique warnings and 0 duplicates.
[FINDBUGS] Successfully parsed file <https://builds.apache.org/job/apache-atlas-nightly/ws/common/target/findbugs.xml> with 0 unique warnings and 0 duplicates.
[FINDBUGS] Successfully parsed file <https://builds.apache.org/job/apache-atlas-nightly/ws/graphdb/api/target/findbugs.xml> with 0 unique warnings and 0 duplicates.
[FINDBUGS] Successfully parsed file <https://builds.apache.org/job/apache-atlas-nightly/ws/graphdb/common/target/findbugs.xml> with 0 unique warnings and 0 duplicates.
[FINDBUGS] Successfully parsed file <https://builds.apache.org/job/apache-atlas-nightly/ws/graphdb/titan0/target/findbugs.xml> with 0 unique warnings and 0 duplicates.
[FINDBUGS] Successfully parsed file <https://builds.apache.org/job/apache-atlas-nightly/ws/intg/target/findbugs.xml> with 0 unique warnings and 0 duplicates.
[FINDBUGS] Successfully parsed file <https://builds.apache.org/job/apache-atlas-nightly/ws/notification/target/findbugs.xml> with 0 unique warnings and 0 duplicates.
[FINDBUGS] Successfully parsed file <https://builds.apache.org/job/apache-atlas-nightly/ws/plugin-classloader/target/findbugs.xml> with 0 unique warnings and 0 duplicates.
[FINDBUGS] Successfully parsed file <https://builds.apache.org/job/apache-atlas-nightly/ws/repository/target/findbugs.xml> with 0 unique warnings and 0 duplicates.
[FINDBUGS] Successfully parsed file <https://builds.apache.org/job/apache-atlas-nightly/ws/server-api/target/findbugs.xml> with 0 unique warnings and 0 duplicates.
[FINDBUGS] Successfully parsed file <https://builds.apache.org/job/apache-atlas-nightly/ws/titan/target/findbugs.xml> with 0 unique warnings and 0 duplicates.
[FINDBUGS] Successfully parsed file <https://builds.apache.org/job/apache-atlas-nightly/ws/typesystem/target/findbugs.xml> with 0 unique warnings and 0 duplicates.
[FINDBUGS] Computing warning deltas based on reference build #535
Archiving artifacts
Compressed 570.31 MB of artifacts by 63.7% relative to #535
TestNG Reports Processing: START
Looking for TestNG results report in workspace using pattern: **/target/surefire-reports/testng-results.xml,**/target/failsafe-reports/testng-results.xml
testng-results.xml was last modified before this build started. Ignoring it.
testng-results.xml was last modified before this build started. Ignoring it.
testng-results.xml was last modified before this build started. Ignoring it.
testng-results.xml was last modified before this build started. Ignoring it.
testng-results.xml was last modified before this build started. Ignoring it.
testng-results.xml was last modified before this build started. Ignoring it.
Saving reports...
Processing '/x1/jenkins/jenkins-home/jobs/apache-atlas-nightly/builds/678/testng/testng-results-1.xml'
Processing '/x1/jenkins/jenkins-home/jobs/apache-atlas-nightly/builds/678/testng/testng-results-10.xml'
Processing '/x1/jenkins/jenkins-home/jobs/apache-atlas-nightly/builds/678/testng/testng-results-2.xml'
Processing '/x1/jenkins/jenkins-home/jobs/apache-atlas-nightly/builds/678/testng/testng-results-3.xml'
Processing '/x1/jenkins/jenkins-home/jobs/apache-atlas-nightly/builds/678/testng/testng-results-4.xml'
Processing '/x1/jenkins/jenkins-home/jobs/apache-atlas-nightly/builds/678/testng/testng-results-5.xml'
Processing '/x1/jenkins/jenkins-home/jobs/apache-atlas-nightly/builds/678/testng/testng-results-6.xml'
Processing '/x1/jenkins/jenkins-home/jobs/apache-atlas-nightly/builds/678/testng/testng-results-7.xml'
Processing '/x1/jenkins/jenkins-home/jobs/apache-atlas-nightly/builds/678/testng/testng-results-8.xml'
Processing '/x1/jenkins/jenkins-home/jobs/apache-atlas-nightly/builds/678/testng/testng-results-9.xml'
Processing '/x1/jenkins/jenkins-home/jobs/apache-atlas-nightly/builds/678/testng/testng-results.xml'
1.785714% of tests failed, which exceeded threshold of 0%. Marking build as UNSTABLE
TestNG Reports Processing: FINISH

Build failed in Jenkins: apache-atlas-nightly #677

Posted by Apache Jenkins Server <je...@builds.apache.org>.
See <https://builds.apache.org/job/apache-atlas-nightly/677/display/redirect?page=changes>

Changes:

[madhan] ATLAS-1644: Taxonomy API /api/atlas/v1/taxonomies is broken

[madhan] ATLAS-1649: Config fix for delete handler

------------------------------------------
[...truncated 531.48 KB...]
127.0.0.1 - - [07/Mar/2017:05:29:24 +0000] "POST /api/atlas/entities HTTP/1.1" 201 - "-" "Java/1.7.0_80"
127.0.0.1 - - [07/Mar/2017:05:29:24 +0000] "POST /api/atlas/entities HTTP/1.1" 201 - "-" "Java/1.7.0_80"
127.0.0.1 - - [07/Mar/2017:05:29:24 +0000] "POST /api/atlas/entities HTTP/1.1" 201 - "-" "Java/1.7.0_80"
127.0.0.1 - - [07/Mar/2017:05:29:24 +0000] "POST /api/atlas/entities HTTP/1.1" 201 - "-" "Java/1.7.0_80"
127.0.0.1 - - [07/Mar/2017:05:29:24 +0000] "POST /api/atlas/entities HTTP/1.1" 201 - "-" "Java/1.7.0_80"
127.0.0.1 - - [07/Mar/2017:05:29:24 +0000] "POST /api/atlas/entities HTTP/1.1" 201 - "-" "Java/1.7.0_80"
127.0.0.1 - - [07/Mar/2017:05:29:24 +0000] "POST /api/atlas/entities HTTP/1.1" 201 - "-" "Java/1.7.0_80"
127.0.0.1 - - [07/Mar/2017:05:29:24 +0000] "GET /api/atlas/types/tableType HTTP/1.1" 200 - "-" "Java/1.7.0_80"
127.0.0.1 - - [07/Mar/2017:05:29:24 +0000] "GET /api/atlas/types/serdeType HTTP/1.1" 200 - "-" "Java/1.7.0_80"
127.0.0.1 - - [07/Mar/2017:05:29:24 +0000] "GET /api/atlas/types/classification HTTP/1.1" 200 - "-" "Java/1.7.0_80"
127.0.0.1 - - [07/Mar/2017:05:29:24 +0000] "GET /api/atlas/types/hive_db_v1 HTTP/1.1" 200 - "-" "Java/1.7.0_80"
127.0.0.1 - - [07/Mar/2017:05:29:24 +0000] "POST /api/atlas/entities HTTP/1.1" 201 - "-" "Java/1.7.0_80"
127.0.0.1 - - [07/Mar/2017:05:29:25 +0000] "POST /api/atlas/entities HTTP/1.1" 201 - "-" "Java/1.7.0_80"
127.0.0.1 - - [07/Mar/2017:05:29:25 +0000] "POST /api/atlas/entities HTTP/1.1" 201 - "-" "Java/1.7.0_80"
127.0.0.1 - - [07/Mar/2017:05:29:25 +0000] "POST /api/atlas/entities HTTP/1.1" 201 - "-" "Java/1.7.0_80"
127.0.0.1 - - [07/Mar/2017:05:29:25 +0000] "POST /api/atlas/entities HTTP/1.1" 201 - "-" "Java/1.7.0_80"
127.0.0.1 - - [07/Mar/2017:05:29:25 +0000] "POST /api/atlas/entities HTTP/1.1" 201 - "-" "Java/1.7.0_80"
127.0.0.1 - - [07/Mar/2017:05:29:25 +0000] "POST /api/atlas/entities HTTP/1.1" 201 - "-" "Java/1.7.0_80"
127.0.0.1 - - [07/Mar/2017:05:29:25 +0000] "POST /api/atlas/entities HTTP/1.1" 201 - "-" "Java/1.7.0_80"
127.0.0.1 - - [07/Mar/2017:05:29:25 +0000] "GET /api/atlas/lineage/hive/table/sales_fact_monthly_mvaJDZbAkrep/inputs/graph HTTP/1.1" 200 - "-" "Java/1.7.0_80"
127.0.0.1 - - [07/Mar/2017:05:29:27 +0000] "GET /api/atlas/entities?type=hive_table_v1&property=qualifiedName&value=sales_fact_monthly_mvaJDZbAkrep HTTP/1.1" 200 - "-" "Java/1.7.0_80"
127.0.0.1 - - [07/Mar/2017:05:29:27 +0000] "GET /api/atlas/lineage/5612231c-4713-4675-a270-bb0f4d1ea7a7/inputs/graph HTTP/1.1" 200 - "-" "Java/1.7.0_80"
127.0.0.1 - - [07/Mar/2017:05:29:28 +0000] "GET /api/atlas/lineage/hive/table/sales_factOuq8mZaQPm/outputs/graph HTTP/1.1" 200 - "-" "Java/1.7.0_80"
127.0.0.1 - - [07/Mar/2017:05:29:31 +0000] "GET /api/atlas/entities?type=hive_table_v1&property=qualifiedName&value=sales_factOuq8mZaQPm HTTP/1.1" 200 - "-" "Java/1.7.0_80"
127.0.0.1 - - [07/Mar/2017:05:29:31 +0000] "GET /api/atlas/lineage/c961fbef-cb8e-4b66-97be-292c7744c928/outputs/graph HTTP/1.1" 200 - "-" "Java/1.7.0_80"
127.0.0.1 - - [07/Mar/2017:05:29:32 +0000] "GET /api/atlas/lineage/hive/table/sales_factOuq8mZaQPm/schema HTTP/1.1" 200 - "-" "Java/1.7.0_80"
127.0.0.1 - - [07/Mar/2017:05:29:33 +0000] "GET /api/atlas/lineage/hive/table/SalesRMDfESogjk/schema HTTP/1.1" 404 - "-" "Java/1.7.0_80"
127.0.0.1 - - [07/Mar/2017:05:29:33 +0000] "GET /api/atlas/entities?type=hive_table_v1&property=qualifiedName&value=sales_factOuq8mZaQPm HTTP/1.1" 200 - "-" "Java/1.7.0_80"
127.0.0.1 - - [07/Mar/2017:05:29:33 +0000] "GET /api/atlas/lineage/c961fbef-cb8e-4b66-97be-292c7744c928/schema HTTP/1.1" 200 - "-" "Java/1.7.0_80"
127.0.0.1 - - [07/Mar/2017:05:29:33 +0000] "GET /api/atlas/lineage/hive/table/blah/schema HTTP/1.1" 404 - "-" "Java/1.7.0_80"
127.0.0.1 - - [07/Mar/2017:05:29:33 +0000] "GET /api/atlas/entities?type=hive_table_v1&property=qualifiedName&value=sales_fact_monthly_mvxnPbYGUrOV HTTP/1.1" 200 - "-" "Java/1.7.0_80"
127.0.0.1 - - [07/Mar/2017:05:29:33 +0000] "GET /api/atlas/v2/lineage/9680fb26-6221-4052-be33-7cab4c5ccb8d?direction=INPUT&depth=5 HTTP/1.1" 200 - "-" "Java/1.7.0_80"
127.0.0.1 - - [07/Mar/2017:05:29:34 +0000] "GET /api/atlas/entities?type=hive_table_v1&property=qualifiedName&value=sales_fact_monthly_mvxnPbYGUrOV HTTP/1.1" 200 - "-" "Java/1.7.0_80"
127.0.0.1 - - [07/Mar/2017:05:29:35 +0000] "GET /api/atlas/v2/lineage/9680fb26-6221-4052-be33-7cab4c5ccb8d?direction=BOTH&depth=5 HTTP/1.1" 200 - "-" "Java/1.7.0_80"
127.0.0.1 - - [07/Mar/2017:05:29:37 +0000] "GET /api/atlas/entities?type=hive_table_v1&property=qualifiedName&value=sales_factSewzC2z93U HTTP/1.1" 200 - "-" "Java/1.7.0_80"
127.0.0.1 - - [07/Mar/2017:05:29:37 +0000] "GET /api/atlas/v2/lineage/264bcdc9-2271-4f12-9747-d80b5ca483fd?direction=OUTPUT&depth=5 HTTP/1.1" 200 - "-" "Java/1.7.0_80"
Tests run: 11, Failures: 0, Errors: 0, Skipped: 0, Time elapsed: 16.928 sec - in org.apache.atlas.web.resources.EntityLineageJerseyResourceIT
Running org.apache.atlas.CredentialProviderUtilityIT
Tests run: 4, Failures: 0, Errors: 0, Skipped: 0, Time elapsed: 1.634 sec - in org.apache.atlas.CredentialProviderUtilityIT
Running org.apache.atlas.notification.EntityNotificationIT
127.0.0.1 - - [07/Mar/2017:05:29:43 +0000] "GET /api/atlas/types/tableType HTTP/1.1" 200 - "-" "Java/1.7.0_80"
127.0.0.1 - - [07/Mar/2017:05:29:43 +0000] "GET /api/atlas/types/serdeType HTTP/1.1" 200 - "-" "Java/1.7.0_80"
127.0.0.1 - - [07/Mar/2017:05:29:43 +0000] "GET /api/atlas/types/classification HTTP/1.1" 200 - "-" "Java/1.7.0_80"
127.0.0.1 - - [07/Mar/2017:05:29:43 +0000] "GET /api/atlas/types/hive_db_v1 HTTP/1.1" 200 - "-" "Java/1.7.0_80"
127.0.0.1 - - [07/Mar/2017:05:29:44 +0000] "POST /api/atlas/entities HTTP/1.1" 201 - "-" "Java/1.7.0_80"
127.0.0.1 - - [07/Mar/2017:05:29:45 +0000] "POST /api/atlas/entities HTTP/1.1" 201 - "-" "Java/1.7.0_80"
127.0.0.1 - - [07/Mar/2017:05:29:46 +0000] "POST /api/atlas/types HTTP/1.1" 201 - "-" "Java/1.7.0_80"
127.0.0.1 - - [07/Mar/2017:05:29:46 +0000] "POST /api/atlas/types HTTP/1.1" 201 - "-" "Java/1.7.0_80"
127.0.0.1 - - [07/Mar/2017:05:29:46 +0000] "POST /api/atlas/types HTTP/1.1" 201 - "-" "Java/1.7.0_80"
127.0.0.1 - - [07/Mar/2017:05:29:47 +0000] "POST /api/atlas/entities/f76d3274-7348-40c0-9e14-512968fb8ecb/traits HTTP/1.1" 201 - "-" "Java/1.7.0_80"
127.0.0.1 - - [07/Mar/2017:05:29:47 +0000] "POST /api/atlas/types HTTP/1.1" 201 - "-" "Java/1.7.0_80"
127.0.0.1 - - [07/Mar/2017:05:29:47 +0000] "POST /api/atlas/entities/f76d3274-7348-40c0-9e14-512968fb8ecb/traits HTTP/1.1" 201 - "-" "Java/1.7.0_80"
127.0.0.1 - - [07/Mar/2017:05:29:47 +0000] "DELETE /api/atlas/entities/f76d3274-7348-40c0-9e14-512968fb8ecb/traits/TraitZyvtFan6q7 HTTP/1.1" 200 - "-" "Java/1.7.0_80"
127.0.0.1 - - [07/Mar/2017:05:29:47 +0000] "POST /api/atlas/entities/f76d3274-7348-40c0-9e14-512968fb8ecb?property=description HTTP/1.1" 200 - "-" "Java/1.7.0_80"
127.0.0.1 - - [07/Mar/2017:05:29:47 +0000] "POST /api/atlas/entities HTTP/1.1" 201 - "-" "Java/1.7.0_80"
127.0.0.1 - - [07/Mar/2017:05:29:47 +0000] "POST /api/atlas/entities HTTP/1.1" 201 - "-" "Java/1.7.0_80"
127.0.0.1 - - [07/Mar/2017:05:29:47 +0000] "DELETE /api/atlas/entities?type=hive_table&property=qualifiedName&value=table-rxbBjvyb0q HTTP/1.1" 200 - "-" "Java/1.7.0_80"
Tests run: 5, Failures: 0, Errors: 0, Skipped: 0, Time elapsed: 6.359 sec - in org.apache.atlas.notification.EntityNotificationIT
Running org.apache.atlas.notification.NotificationHookConsumerIT
127.0.0.1 - - [07/Mar/2017:05:29:50 +0000] "GET /api/atlas/types/tableType HTTP/1.1" 200 - "-" "Java/1.7.0_80"
127.0.0.1 - - [07/Mar/2017:05:29:50 +0000] "GET /api/atlas/types/serdeType HTTP/1.1" 200 - "-" "Java/1.7.0_80"
127.0.0.1 - - [07/Mar/2017:05:29:50 +0000] "GET /api/atlas/types/classification HTTP/1.1" 200 - "-" "Java/1.7.0_80"
127.0.0.1 - - [07/Mar/2017:05:29:50 +0000] "GET /api/atlas/types/hive_db_v1 HTTP/1.1" 200 - "-" "Java/1.7.0_80"
127.0.0.1 - - [07/Mar/2017:05:29:52 +0000] "GET /api/atlas/discovery/search/dsl?query=hive_db+where+qualifiedName%3D'dbRRwwg1RGv6'&limit=10&offset=0 HTTP/1.1" 200 - "-" "Java/1.7.0_80"
127.0.0.1 - - [07/Mar/2017:05:29:52 +0000] "GET /api/atlas/entities?type=hive_db&property=qualifiedName&value=dbRRwwg1RGv6 HTTP/1.1" 200 - "-" "Java/1.7.0_80"
127.0.0.1 - - [07/Mar/2017:05:29:52 +0000] "GET /api/atlas/entities/a1eb8d03-bd20-4feb-8b2b-fdc0d07dc0ca/audit?count=1 HTTP/1.1" 200 - "-" "Java/1.7.0_80"
127.0.0.1 - - [07/Mar/2017:05:29:52 +0000] "POST /api/atlas/entities HTTP/1.1" 201 - "-" "Java/1.7.0_80"
127.0.0.1 - - [07/Mar/2017:05:29:52 +0000] "GET /api/atlas/entities/0416a070-61e7-4996-aead-302c78d31664 HTTP/1.1" 200 - "-" "Java/1.7.0_80"
127.0.0.1 - - [07/Mar/2017:05:29:53 +0000] "GET /api/atlas/entities/0416a070-61e7-4996-aead-302c78d31664 HTTP/1.1" 200 - "-" "Java/1.7.0_80"
127.0.0.1 - - [07/Mar/2017:05:29:53 +0000] "GET /api/atlas/discovery/search/dsl?query=hive_db+where+name%3D'dboW5ciHWp6v'&limit=10&offset=0 HTTP/1.1" 200 - "-" "Java/1.7.0_80"
127.0.0.1 - - [07/Mar/2017:05:29:53 +0000] "GET /api/atlas/discovery/search/dsl?query=hive_db+where+name%3D'dboW5ciHWp6v'&limit=10&offset=0 HTTP/1.1" 200 - "-" "Java/1.7.0_80"
127.0.0.1 - - [07/Mar/2017:05:29:54 +0000] "POST /api/atlas/entities HTTP/1.1" 201 - "-" "Java/1.7.0_80"
127.0.0.1 - - [07/Mar/2017:05:29:54 +0000] "GET /api/atlas/discovery/search/dsl?query=hive_db+where+qualifiedName%3D'dbSv0EnSdNwZ'&limit=10&offset=0 HTTP/1.1" 200 - "-" "Java/1.7.0_80"
127.0.0.1 - - [07/Mar/2017:05:29:55 +0000] "GET /api/atlas/entities?type=hive_db&property=qualifiedName&value=dbSv0EnSdNwZ HTTP/1.1" 200 - "-" "Java/1.7.0_80"
127.0.0.1 - - [07/Mar/2017:05:29:55 +0000] "POST /api/atlas/entities HTTP/1.1" 201 - "-" "Java/1.7.0_80"
127.0.0.1 - - [07/Mar/2017:05:29:55 +0000] "GET /api/atlas/entities?type=hive_db&property=qualifiedName&value=dbY3P739ZiPN HTTP/1.1" 200 - "-" "Java/1.7.0_80"
127.0.0.1 - - [07/Mar/2017:05:29:55 +0000] "GET /api/atlas/entities?type=hive_db&property=qualifiedName&value=dbY3P739ZiPN HTTP/1.1" 200 - "-" "Java/1.7.0_80"
127.0.0.1 - - [07/Mar/2017:05:29:55 +0000] "GET /api/atlas/entities?type=hive_db&property=qualifiedName&value=dbY3P739ZiPN HTTP/1.1" 200 - "-" "Java/1.7.0_80"
127.0.0.1 - - [07/Mar/2017:05:29:55 +0000] "POST /api/atlas/entities HTTP/1.1" 201 - "-" "Java/1.7.0_80"
127.0.0.1 - - [07/Mar/2017:05:29:55 +0000] "GET /api/atlas/discovery/search/dsl?query=hive_db+where+qualifiedName%3D'dbuZYvMHt0Hu'&limit=10&offset=0 HTTP/1.1" 200 - "-" "Java/1.7.0_80"
127.0.0.1 - - [07/Mar/2017:05:29:56 +0000] "GET /api/atlas/discovery/search/dsl?query=hive_db+where+qualifiedName%3D'dbhwYTBQBHFe'&limit=10&offset=0 HTTP/1.1" 200 - "-" "Java/1.7.0_80"
Tests run: 6, Failures: 0, Errors: 0, Skipped: 0, Time elapsed: 9.385 sec - in org.apache.atlas.notification.NotificationHookConsumerIT

Results :

Failed tests: 
  EntityJerseyResourceIT.testPartialUpdate:741 expected:<2> but was:<1>

Tests run: 133, Failures: 1, Errors: 0, Skipped: 0

[INFO] 
[INFO] --- jetty-maven-plugin:9.2.12.v20150709:stop (stop-jetty) @ atlas-webapp ---
[INFO] Waiting 10 seconds for jetty to stop
[INFO] Stopped ServerConnector@5883ee8b{HTTP/1.1}{0.0.0.0:31000}
[INFO] Closing Spring root WebApplicationContext
[INFO] Shutting down log4j
[INFO] Stopped o.e.j.m.p.JettyWebAppContext@7a908bc7{/,<https://builds.apache.org/job/apache-atlas-nightly/ws/webapp/target/atlas-webapp-0.8-incubating-SNAPSHOT/,UNAVAILABLE}{/home/jenkins/jenkins-slave/workspace/apache-atlas-nightly/webapp/target/atlas-webapp-0.8-incubating-SNAPSHOT.war}>
[INFO] Server reports itself as stopped
[INFO] 
[INFO] --- maven-source-plugin:2.4:jar-no-fork (attach-sources) @ atlas-webapp ---
[INFO] Building jar: <https://builds.apache.org/job/apache-atlas-nightly/ws/webapp/target/atlas-webapp-0.8-incubating-SNAPSHOT-sources.jar>
[INFO] 
[INFO] --- maven-source-plugin:2.4:test-jar-no-fork (attach-sources) @ atlas-webapp ---
[INFO] Building jar: <https://builds.apache.org/job/apache-atlas-nightly/ws/webapp/target/atlas-webapp-0.8-incubating-SNAPSHOT-test-sources.jar>
[INFO] 
[INFO] --- maven-failsafe-plugin:2.19.1:verify (verify) @ atlas-webapp ---
[INFO] ------------------------------------------------------------------------
[INFO] Reactor Summary:
[INFO] 
[INFO] Apache Atlas Server Build Tools .................... SUCCESS [  0.938 s]
[INFO] apache-atlas ....................................... SUCCESS [  8.101 s]
[INFO] Apache Atlas Integration ........................... SUCCESS [01:03 min]
[INFO] Apache Atlas Common ................................ SUCCESS [ 23.022 s]
[INFO] Apache Atlas Typesystem ............................ SUCCESS [01:39 min]
[INFO] Apache Atlas Client ................................ SUCCESS [ 23.775 s]
[INFO] Apache Atlas Server API ............................ SUCCESS [ 12.478 s]
[INFO] Apache Atlas Notification .......................... SUCCESS [ 45.334 s]
[INFO] Apache Atlas Graph Database Projects ............... SUCCESS [  0.809 s]
[INFO] Apache Atlas Graph Database API .................... SUCCESS [  8.859 s]
[INFO] Graph Database Common Code ......................... SUCCESS [  8.420 s]
[INFO] Apache Atlas Titan 1.0.0 GraphDB Impl .............. SUCCESS [ 33.100 s]
[INFO] Shaded version of Apache hbase client .............. SUCCESS [  9.007 s]
[INFO] Apache Atlas Titan 0.5.4 Graph DB Impl ............. SUCCESS [01:48 min]
[INFO] Apache Atlas Graph Database Implementation Dependencies SUCCESS [  0.702 s]
[INFO] Shaded version of Apache hbase server .............. SUCCESS [ 24.122 s]
[INFO] Apache Atlas Repository ............................ SUCCESS [16:02 min]
[INFO] Apache Atlas Authorization ......................... SUCCESS [ 15.124 s]
[INFO] Apache Atlas Business Catalog ...................... SUCCESS [ 33.619 s]
[INFO] Apache Atlas UI .................................... SUCCESS [01:38 min]
[INFO] Apache Atlas Web Application ....................... FAILURE [09:06 min]
[INFO] Apache Atlas Documentation ......................... SKIPPED
[INFO] Apache Atlas FileSystem Model ...................... SKIPPED
[INFO] Apache Atlas Plugin Classloader .................... SKIPPED
[INFO] Apache Atlas Hive Bridge Shim ...................... SKIPPED
[INFO] Apache Atlas Hive Bridge ........................... SKIPPED
[INFO] Apache Atlas Falcon Bridge Shim .................... SKIPPED
[INFO] Apache Atlas Falcon Bridge ......................... SKIPPED
[INFO] Apache Atlas Sqoop Bridge Shim ..................... SKIPPED
[INFO] Apache Atlas Sqoop Bridge .......................... SKIPPED
[INFO] Apache Atlas Storm Bridge Shim ..................... SKIPPED
[INFO] Apache Atlas Storm Bridge .......................... SKIPPED
[INFO] Apache Atlas Distribution .......................... SKIPPED
[INFO] ------------------------------------------------------------------------
[INFO] BUILD FAILURE
[INFO] ------------------------------------------------------------------------
[INFO] Total time: 35:28 min
[INFO] Finished at: 2017-03-07T05:30:03+00:00
[INFO] Final Memory: 356M/1228M
[INFO] ------------------------------------------------------------------------
log4j:WARN No appenders could be found for logger (org.apache.zookeeper.ClientCnxn).
log4j:WARN Please initialize the log4j system properly.
log4j:WARN See http://logging.apache.org/log4j/1.2/faq.html#noconfig for more info.
[ERROR] Failed to execute goal org.apache.maven.plugins:maven-failsafe-plugin:2.19.1:verify (verify) on project atlas-webapp: There are test failures.
[ERROR] 
[ERROR] Please refer to <https://builds.apache.org/job/apache-atlas-nightly/ws/webapp/target/failsafe-reports> for the individual test results.
[ERROR] -> [Help 1]
[ERROR] 
[ERROR] To see the full stack trace of the errors, re-run Maven with the -e switch.
[ERROR] Re-run Maven using the -X switch to enable full debug logging.
[ERROR] 
[ERROR] For more information about the errors and possible solutions, please read the following articles:
[ERROR] [Help 1] http://cwiki.apache.org/confluence/display/MAVEN/MojoFailureException
[ERROR] 
[ERROR] After correcting the problems, you can resume the build with the command
[ERROR]   mvn <goals> -rf :atlas-webapp
Build step 'Execute shell' marked build as failure
[CHECKSTYLE] Collecting checkstyle analysis files...
[CHECKSTYLE] Finding all files that match the pattern **/target/checkstyle-result.xml
[CHECKSTYLE] Parsing 31 files in <https://builds.apache.org/job/apache-atlas-nightly/ws/>
[CHECKSTYLE] Successfully parsed file <https://builds.apache.org/job/apache-atlas-nightly/ws/addons/falcon-bridge-shim/target/checkstyle-result.xml> with 29 unique warnings and 0 duplicates.
[CHECKSTYLE] Successfully parsed file <https://builds.apache.org/job/apache-atlas-nightly/ws/addons/falcon-bridge/target/checkstyle-result.xml> with 420 unique warnings and 0 duplicates.
[CHECKSTYLE] Successfully parsed file <https://builds.apache.org/job/apache-atlas-nightly/ws/addons/hdfs-model/target/checkstyle-result.xml> with 420 unique warnings and 0 duplicates.
[CHECKSTYLE] Successfully parsed file <https://builds.apache.org/job/apache-atlas-nightly/ws/addons/hive-bridge-shim/target/checkstyle-result.xml> with 435 unique warnings and 0 duplicates.
[CHECKSTYLE] Successfully parsed file <https://builds.apache.org/job/apache-atlas-nightly/ws/addons/sqoop-bridge-shim/target/checkstyle-result.xml> with 451 unique warnings and 0 duplicates.
[CHECKSTYLE] Successfully parsed file <https://builds.apache.org/job/apache-atlas-nightly/ws/addons/sqoop-bridge/target/checkstyle-result.xml> with 576 unique warnings and 0 duplicates.
[CHECKSTYLE] Successfully parsed file <https://builds.apache.org/job/apache-atlas-nightly/ws/addons/storm-bridge-shim/target/checkstyle-result.xml> with 597 unique warnings and 0 duplicates.
[CHECKSTYLE] Successfully parsed file <https://builds.apache.org/job/apache-atlas-nightly/ws/addons/storm-bridge/target/checkstyle-result.xml> with 866 unique warnings and 0 duplicates.
[CHECKSTYLE] Successfully parsed file <https://builds.apache.org/job/apache-atlas-nightly/ws/authorization/target/checkstyle-result.xml> with 1319 unique warnings and 0 duplicates.
[CHECKSTYLE] Successfully parsed file <https://builds.apache.org/job/apache-atlas-nightly/ws/catalog/target/checkstyle-result.xml> with 3459 unique warnings and 0 duplicates.
[CHECKSTYLE] Successfully parsed file <https://builds.apache.org/job/apache-atlas-nightly/ws/client/target/checkstyle-result.xml> with 5069 unique warnings and 0 duplicates.
[CHECKSTYLE] Successfully parsed file <https://builds.apache.org/job/apache-atlas-nightly/ws/common/target/checkstyle-result.xml> with 6251 unique warnings and 0 duplicates.
[CHECKSTYLE] Successfully parsed file <https://builds.apache.org/job/apache-atlas-nightly/ws/dashboardv2/target/checkstyle-result.xml> with 6251 unique warnings and 0 duplicates.
[CHECKSTYLE] Successfully parsed file <https://builds.apache.org/job/apache-atlas-nightly/ws/distro/target/checkstyle-result.xml> with 6251 unique warnings and 0 duplicates.
[CHECKSTYLE] Successfully parsed file <https://builds.apache.org/job/apache-atlas-nightly/ws/docs/target/checkstyle-result.xml> with 6251 unique warnings and 0 duplicates.
[CHECKSTYLE] Successfully parsed file <https://builds.apache.org/job/apache-atlas-nightly/ws/graphdb/api/target/checkstyle-result.xml> with 6497 unique warnings and 0 duplicates.
[CHECKSTYLE] Successfully parsed file <https://builds.apache.org/job/apache-atlas-nightly/ws/graphdb/common/target/checkstyle-result.xml> with 6646 unique warnings and 0 duplicates.
[CHECKSTYLE] Successfully parsed file <https://builds.apache.org/job/apache-atlas-nightly/ws/graphdb/graphdb-impls/target/checkstyle-result.xml> with 6646 unique warnings and 0 duplicates.
[CHECKSTYLE] Successfully parsed file <https://builds.apache.org/job/apache-atlas-nightly/ws/graphdb/target/checkstyle-result.xml> with 6646 unique warnings and 0 duplicates.
[CHECKSTYLE] Successfully parsed file <https://builds.apache.org/job/apache-atlas-nightly/ws/graphdb/titan0/target/checkstyle-result.xml> with 8866 unique warnings and 0 duplicates.
[CHECKSTYLE] Successfully parsed file <https://builds.apache.org/job/apache-atlas-nightly/ws/graphdb/titan1/target/checkstyle-result.xml> with 9770 unique warnings and 0 duplicates.
[CHECKSTYLE] Successfully parsed file <https://builds.apache.org/job/apache-atlas-nightly/ws/intg/target/checkstyle-result.xml> with 15669 unique warnings and 0 duplicates.
[CHECKSTYLE] Successfully parsed file <https://builds.apache.org/job/apache-atlas-nightly/ws/notification/target/checkstyle-result.xml> with 16834 unique warnings and 0 duplicates.
[CHECKSTYLE] Successfully parsed file <https://builds.apache.org/job/apache-atlas-nightly/ws/plugin-classloader/target/checkstyle-result.xml> with 16942 unique warnings and 0 duplicates.
[CHECKSTYLE] Successfully parsed file <https://builds.apache.org/job/apache-atlas-nightly/ws/repository/target/checkstyle-result.xml> with 31611 unique warnings and 0 duplicates.
[CHECKSTYLE] Successfully parsed file <https://builds.apache.org/job/apache-atlas-nightly/ws/server-api/target/checkstyle-result.xml> with 32008 unique warnings and 0 duplicates.
[CHECKSTYLE] Successfully parsed file <https://builds.apache.org/job/apache-atlas-nightly/ws/shaded/hbase-client-shaded/target/checkstyle-result.xml> with 32008 unique warnings and 0 duplicates.
[CHECKSTYLE] Successfully parsed file <https://builds.apache.org/job/apache-atlas-nightly/ws/shaded/hbase-server-shaded/target/checkstyle-result.xml> with 32008 unique warnings and 0 duplicates.
[CHECKSTYLE] Successfully parsed file <https://builds.apache.org/job/apache-atlas-nightly/ws/target/checkstyle-result.xml> with 32008 unique warnings and 0 duplicates.
[CHECKSTYLE] Successfully parsed file <https://builds.apache.org/job/apache-atlas-nightly/ws/titan/target/checkstyle-result.xml> with 32470 unique warnings and 0 duplicates.
[CHECKSTYLE] Successfully parsed file <https://builds.apache.org/job/apache-atlas-nightly/ws/typesystem/target/checkstyle-result.xml> with 36689 unique warnings and 0 duplicates.
[CHECKSTYLE] Computing warning deltas based on reference build #535
[FINDBUGS] Collecting findbugs analysis files...
[FINDBUGS] Finding all files that match the pattern **/target/findbugs.xml
[FINDBUGS] Parsing 21 files in <https://builds.apache.org/job/apache-atlas-nightly/ws/>
[FINDBUGS] Successfully parsed file <https://builds.apache.org/job/apache-atlas-nightly/ws/addons/falcon-bridge-shim/target/findbugs.xml> with 0 unique warnings and 0 duplicates.
[FINDBUGS] Successfully parsed file <https://builds.apache.org/job/apache-atlas-nightly/ws/addons/falcon-bridge/target/findbugs.xml> with 0 unique warnings and 0 duplicates.
[FINDBUGS] Successfully parsed file <https://builds.apache.org/job/apache-atlas-nightly/ws/addons/hive-bridge-shim/target/findbugs.xml> with 0 unique warnings and 0 duplicates.
[FINDBUGS] Successfully parsed file <https://builds.apache.org/job/apache-atlas-nightly/ws/addons/sqoop-bridge-shim/target/findbugs.xml> with 0 unique warnings and 0 duplicates.
[FINDBUGS] Successfully parsed file <https://builds.apache.org/job/apache-atlas-nightly/ws/addons/sqoop-bridge/target/findbugs.xml> with 0 unique warnings and 0 duplicates.
[FINDBUGS] Successfully parsed file <https://builds.apache.org/job/apache-atlas-nightly/ws/addons/storm-bridge-shim/target/findbugs.xml> with 0 unique warnings and 0 duplicates.
[FINDBUGS] Successfully parsed file <https://builds.apache.org/job/apache-atlas-nightly/ws/addons/storm-bridge/target/findbugs.xml> with 0 unique warnings and 0 duplicates.
[FINDBUGS] Successfully parsed file <https://builds.apache.org/job/apache-atlas-nightly/ws/authorization/target/findbugs.xml> with 0 unique warnings and 0 duplicates.
[FINDBUGS] Successfully parsed file <https://builds.apache.org/job/apache-atlas-nightly/ws/catalog/target/findbugs.xml> with 0 unique warnings and 0 duplicates.
[FINDBUGS] Successfully parsed file <https://builds.apache.org/job/apache-atlas-nightly/ws/client/target/findbugs.xml> with 0 unique warnings and 0 duplicates.
[FINDBUGS] Successfully parsed file <https://builds.apache.org/job/apache-atlas-nightly/ws/common/target/findbugs.xml> with 0 unique warnings and 0 duplicates.
[FINDBUGS] Successfully parsed file <https://builds.apache.org/job/apache-atlas-nightly/ws/graphdb/api/target/findbugs.xml> with 0 unique warnings and 0 duplicates.
[FINDBUGS] Successfully parsed file <https://builds.apache.org/job/apache-atlas-nightly/ws/graphdb/common/target/findbugs.xml> with 0 unique warnings and 0 duplicates.
[FINDBUGS] Successfully parsed file <https://builds.apache.org/job/apache-atlas-nightly/ws/graphdb/titan0/target/findbugs.xml> with 0 unique warnings and 0 duplicates.
[FINDBUGS] Successfully parsed file <https://builds.apache.org/job/apache-atlas-nightly/ws/intg/target/findbugs.xml> with 0 unique warnings and 0 duplicates.
[FINDBUGS] Successfully parsed file <https://builds.apache.org/job/apache-atlas-nightly/ws/notification/target/findbugs.xml> with 0 unique warnings and 0 duplicates.
[FINDBUGS] Successfully parsed file <https://builds.apache.org/job/apache-atlas-nightly/ws/plugin-classloader/target/findbugs.xml> with 0 unique warnings and 0 duplicates.
[FINDBUGS] Successfully parsed file <https://builds.apache.org/job/apache-atlas-nightly/ws/repository/target/findbugs.xml> with 0 unique warnings and 0 duplicates.
[FINDBUGS] Successfully parsed file <https://builds.apache.org/job/apache-atlas-nightly/ws/server-api/target/findbugs.xml> with 0 unique warnings and 0 duplicates.
[FINDBUGS] Successfully parsed file <https://builds.apache.org/job/apache-atlas-nightly/ws/titan/target/findbugs.xml> with 0 unique warnings and 0 duplicates.
[FINDBUGS] Successfully parsed file <https://builds.apache.org/job/apache-atlas-nightly/ws/typesystem/target/findbugs.xml> with 0 unique warnings and 0 duplicates.
[FINDBUGS] Computing warning deltas based on reference build #535
Archiving artifacts
Compressed 570.24 MB of artifacts by 63.7% relative to #535
TestNG Reports Processing: START
Looking for TestNG results report in workspace using pattern: **/target/surefire-reports/testng-results.xml,**/target/failsafe-reports/testng-results.xml
testng-results.xml was last modified before this build started. Ignoring it.
testng-results.xml was last modified before this build started. Ignoring it.
testng-results.xml was last modified before this build started. Ignoring it.
testng-results.xml was last modified before this build started. Ignoring it.
testng-results.xml was last modified before this build started. Ignoring it.
testng-results.xml was last modified before this build started. Ignoring it.
Saving reports...
Processing '/x1/jenkins/jenkins-home/jobs/apache-atlas-nightly/builds/677/testng/testng-results-1.xml'
Processing '/x1/jenkins/jenkins-home/jobs/apache-atlas-nightly/builds/677/testng/testng-results-10.xml'
Processing '/x1/jenkins/jenkins-home/jobs/apache-atlas-nightly/builds/677/testng/testng-results-2.xml'
Processing '/x1/jenkins/jenkins-home/jobs/apache-atlas-nightly/builds/677/testng/testng-results-3.xml'
Processing '/x1/jenkins/jenkins-home/jobs/apache-atlas-nightly/builds/677/testng/testng-results-4.xml'
Processing '/x1/jenkins/jenkins-home/jobs/apache-atlas-nightly/builds/677/testng/testng-results-5.xml'
Processing '/x1/jenkins/jenkins-home/jobs/apache-atlas-nightly/builds/677/testng/testng-results-6.xml'
Processing '/x1/jenkins/jenkins-home/jobs/apache-atlas-nightly/builds/677/testng/testng-results-7.xml'
Processing '/x1/jenkins/jenkins-home/jobs/apache-atlas-nightly/builds/677/testng/testng-results-8.xml'
Processing '/x1/jenkins/jenkins-home/jobs/apache-atlas-nightly/builds/677/testng/testng-results-9.xml'
Processing '/x1/jenkins/jenkins-home/jobs/apache-atlas-nightly/builds/677/testng/testng-results.xml'
TestNG Reports Processing: FINISH

Build failed in Jenkins: apache-atlas-nightly #676

Posted by Apache Jenkins Server <je...@builds.apache.org>.
See <https://builds.apache.org/job/apache-atlas-nightly/676/display/redirect?page=changes>

Changes:

[madhan] ATLAS-1646: added validation of classification attributes

------------------------------------------
[...truncated 531.88 KB...]
127.0.0.1 - - [07/Mar/2017:03:31:54 +0000] "POST /api/atlas/entities HTTP/1.1" 201 - "-" "Java/1.7.0_80"
127.0.0.1 - - [07/Mar/2017:03:31:54 +0000] "POST /api/atlas/entities HTTP/1.1" 201 - "-" "Java/1.7.0_80"
127.0.0.1 - - [07/Mar/2017:03:31:54 +0000] "POST /api/atlas/entities HTTP/1.1" 201 - "-" "Java/1.7.0_80"
127.0.0.1 - - [07/Mar/2017:03:31:54 +0000] "GET /api/atlas/types/tableType HTTP/1.1" 200 - "-" "Java/1.7.0_80"
127.0.0.1 - - [07/Mar/2017:03:31:54 +0000] "GET /api/atlas/types/serdeType HTTP/1.1" 200 - "-" "Java/1.7.0_80"
127.0.0.1 - - [07/Mar/2017:03:31:54 +0000] "GET /api/atlas/types/classification HTTP/1.1" 200 - "-" "Java/1.7.0_80"
127.0.0.1 - - [07/Mar/2017:03:31:54 +0000] "GET /api/atlas/types/hive_db_v1 HTTP/1.1" 200 - "-" "Java/1.7.0_80"
127.0.0.1 - - [07/Mar/2017:03:31:54 +0000] "POST /api/atlas/entities HTTP/1.1" 201 - "-" "Java/1.7.0_80"
127.0.0.1 - - [07/Mar/2017:03:31:54 +0000] "POST /api/atlas/entities HTTP/1.1" 201 - "-" "Java/1.7.0_80"
127.0.0.1 - - [07/Mar/2017:03:31:54 +0000] "POST /api/atlas/entities HTTP/1.1" 201 - "-" "Java/1.7.0_80"
127.0.0.1 - - [07/Mar/2017:03:31:54 +0000] "POST /api/atlas/entities HTTP/1.1" 201 - "-" "Java/1.7.0_80"
127.0.0.1 - - [07/Mar/2017:03:31:54 +0000] "POST /api/atlas/entities HTTP/1.1" 201 - "-" "Java/1.7.0_80"
127.0.0.1 - - [07/Mar/2017:03:31:54 +0000] "POST /api/atlas/entities HTTP/1.1" 201 - "-" "Java/1.7.0_80"
127.0.0.1 - - [07/Mar/2017:03:31:54 +0000] "POST /api/atlas/entities HTTP/1.1" 201 - "-" "Java/1.7.0_80"
127.0.0.1 - - [07/Mar/2017:03:31:55 +0000] "POST /api/atlas/entities HTTP/1.1" 201 - "-" "Java/1.7.0_80"
127.0.0.1 - - [07/Mar/2017:03:31:55 +0000] "GET /api/atlas/lineage/hive/table/sales_fact_monthly_mvo8wLCaaLSp/inputs/graph HTTP/1.1" 200 - "-" "Java/1.7.0_80"
127.0.0.1 - - [07/Mar/2017:03:31:57 +0000] "GET /api/atlas/entities?type=hive_table_v1&property=qualifiedName&value=sales_fact_monthly_mvo8wLCaaLSp HTTP/1.1" 200 - "-" "Java/1.7.0_80"
127.0.0.1 - - [07/Mar/2017:03:31:57 +0000] "GET /api/atlas/lineage/c7d7951a-c36c-4460-907a-be7da40a8df3/inputs/graph HTTP/1.1" 200 - "-" "Java/1.7.0_80"
127.0.0.1 - - [07/Mar/2017:03:31:58 +0000] "GET /api/atlas/lineage/hive/table/sales_factDyRbG7gCgK/outputs/graph HTTP/1.1" 200 - "-" "Java/1.7.0_80"
127.0.0.1 - - [07/Mar/2017:03:32:00 +0000] "GET /api/atlas/entities?type=hive_table_v1&property=qualifiedName&value=sales_factDyRbG7gCgK HTTP/1.1" 200 - "-" "Java/1.7.0_80"
127.0.0.1 - - [07/Mar/2017:03:32:00 +0000] "GET /api/atlas/lineage/3fdbdc62-295d-4e3e-9959-b067f3c7ef00/outputs/graph HTTP/1.1" 200 - "-" "Java/1.7.0_80"
127.0.0.1 - - [07/Mar/2017:03:32:02 +0000] "GET /api/atlas/lineage/hive/table/sales_factDyRbG7gCgK/schema HTTP/1.1" 200 - "-" "Java/1.7.0_80"
127.0.0.1 - - [07/Mar/2017:03:32:02 +0000] "GET /api/atlas/lineage/hive/table/SalesWIXDRNfOjj/schema HTTP/1.1" 404 - "-" "Java/1.7.0_80"
127.0.0.1 - - [07/Mar/2017:03:32:02 +0000] "GET /api/atlas/entities?type=hive_table_v1&property=qualifiedName&value=sales_factDyRbG7gCgK HTTP/1.1" 200 - "-" "Java/1.7.0_80"
127.0.0.1 - - [07/Mar/2017:03:32:02 +0000] "GET /api/atlas/lineage/3fdbdc62-295d-4e3e-9959-b067f3c7ef00/schema HTTP/1.1" 200 - "-" "Java/1.7.0_80"
127.0.0.1 - - [07/Mar/2017:03:32:03 +0000] "GET /api/atlas/lineage/hive/table/blah/schema HTTP/1.1" 404 - "-" "Java/1.7.0_80"
127.0.0.1 - - [07/Mar/2017:03:32:03 +0000] "GET /api/atlas/entities?type=hive_table_v1&property=qualifiedName&value=sales_fact_monthly_mvqHhldoWb9I HTTP/1.1" 200 - "-" "Java/1.7.0_80"
127.0.0.1 - - [07/Mar/2017:03:32:03 +0000] "GET /api/atlas/v2/lineage/14a458a3-807d-4123-85c5-0f3355da9146?direction=INPUT&depth=5 HTTP/1.1" 200 - "-" "Java/1.7.0_80"
127.0.0.1 - - [07/Mar/2017:03:32:04 +0000] "GET /api/atlas/entities?type=hive_table_v1&property=qualifiedName&value=sales_fact_monthly_mvqHhldoWb9I HTTP/1.1" 200 - "-" "Java/1.7.0_80"
127.0.0.1 - - [07/Mar/2017:03:32:04 +0000] "GET /api/atlas/v2/lineage/14a458a3-807d-4123-85c5-0f3355da9146?direction=BOTH&depth=5 HTTP/1.1" 200 - "-" "Java/1.7.0_80"
127.0.0.1 - - [07/Mar/2017:03:32:07 +0000] "GET /api/atlas/entities?type=hive_table_v1&property=qualifiedName&value=sales_factsvlHzJxm3z HTTP/1.1" 200 - "-" "Java/1.7.0_80"
127.0.0.1 - - [07/Mar/2017:03:32:07 +0000] "GET /api/atlas/v2/lineage/aeedd320-7997-4b04-9e19-ce273613952b?direction=OUTPUT&depth=5 HTTP/1.1" 200 - "-" "Java/1.7.0_80"
Tests run: 11, Failures: 0, Errors: 0, Skipped: 0, Time elapsed: 17.505 sec - in org.apache.atlas.web.resources.EntityLineageJerseyResourceIT
Running org.apache.atlas.CredentialProviderUtilityIT
Tests run: 4, Failures: 0, Errors: 0, Skipped: 0, Time elapsed: 1.633 sec - in org.apache.atlas.CredentialProviderUtilityIT
Running org.apache.atlas.notification.EntityNotificationIT
127.0.0.1 - - [07/Mar/2017:03:32:13 +0000] "GET /api/atlas/types/tableType HTTP/1.1" 200 - "-" "Java/1.7.0_80"
127.0.0.1 - - [07/Mar/2017:03:32:13 +0000] "GET /api/atlas/types/serdeType HTTP/1.1" 200 - "-" "Java/1.7.0_80"
127.0.0.1 - - [07/Mar/2017:03:32:13 +0000] "GET /api/atlas/types/classification HTTP/1.1" 200 - "-" "Java/1.7.0_80"
127.0.0.1 - - [07/Mar/2017:03:32:13 +0000] "GET /api/atlas/types/hive_db_v1 HTTP/1.1" 200 - "-" "Java/1.7.0_80"
127.0.0.1 - - [07/Mar/2017:03:32:14 +0000] "POST /api/atlas/entities HTTP/1.1" 201 - "-" "Java/1.7.0_80"
127.0.0.1 - - [07/Mar/2017:03:32:15 +0000] "POST /api/atlas/entities HTTP/1.1" 201 - "-" "Java/1.7.0_80"
127.0.0.1 - - [07/Mar/2017:03:32:16 +0000] "POST /api/atlas/types HTTP/1.1" 201 - "-" "Java/1.7.0_80"
127.0.0.1 - - [07/Mar/2017:03:32:17 +0000] "POST /api/atlas/types HTTP/1.1" 201 - "-" "Java/1.7.0_80"
127.0.0.1 - - [07/Mar/2017:03:32:17 +0000] "POST /api/atlas/types HTTP/1.1" 201 - "-" "Java/1.7.0_80"
127.0.0.1 - - [07/Mar/2017:03:32:17 +0000] "POST /api/atlas/entities/8af8a961-9dc7-4ba9-8372-585c12aaf8a9/traits HTTP/1.1" 201 - "-" "Java/1.7.0_80"
127.0.0.1 - - [07/Mar/2017:03:32:17 +0000] "POST /api/atlas/types HTTP/1.1" 201 - "-" "Java/1.7.0_80"
127.0.0.1 - - [07/Mar/2017:03:32:17 +0000] "POST /api/atlas/entities/8af8a961-9dc7-4ba9-8372-585c12aaf8a9/traits HTTP/1.1" 201 - "-" "Java/1.7.0_80"
127.0.0.1 - - [07/Mar/2017:03:32:17 +0000] "DELETE /api/atlas/entities/8af8a961-9dc7-4ba9-8372-585c12aaf8a9/traits/TraitPCilylylAN HTTP/1.1" 200 - "-" "Java/1.7.0_80"
127.0.0.1 - - [07/Mar/2017:03:32:17 +0000] "POST /api/atlas/entities/8af8a961-9dc7-4ba9-8372-585c12aaf8a9?property=description HTTP/1.1" 200 - "-" "Java/1.7.0_80"
127.0.0.1 - - [07/Mar/2017:03:32:17 +0000] "POST /api/atlas/entities HTTP/1.1" 201 - "-" "Java/1.7.0_80"
127.0.0.1 - - [07/Mar/2017:03:32:17 +0000] "POST /api/atlas/entities HTTP/1.1" 201 - "-" "Java/1.7.0_80"
127.0.0.1 - - [07/Mar/2017:03:32:17 +0000] "DELETE /api/atlas/entities?type=hive_table&property=qualifiedName&value=table-Q8HmrE7iAn HTTP/1.1" 200 - "-" "Java/1.7.0_80"
Tests run: 5, Failures: 0, Errors: 0, Skipped: 0, Time elapsed: 6.409 sec - in org.apache.atlas.notification.EntityNotificationIT
Running org.apache.atlas.notification.NotificationHookConsumerIT
127.0.0.1 - - [07/Mar/2017:03:32:20 +0000] "GET /api/atlas/types/tableType HTTP/1.1" 200 - "-" "Java/1.7.0_80"
127.0.0.1 - - [07/Mar/2017:03:32:20 +0000] "GET /api/atlas/types/serdeType HTTP/1.1" 200 - "-" "Java/1.7.0_80"
127.0.0.1 - - [07/Mar/2017:03:32:21 +0000] "GET /api/atlas/types/classification HTTP/1.1" 200 - "-" "Java/1.7.0_80"
127.0.0.1 - - [07/Mar/2017:03:32:21 +0000] "GET /api/atlas/types/hive_db_v1 HTTP/1.1" 200 - "-" "Java/1.7.0_80"
127.0.0.1 - - [07/Mar/2017:03:32:22 +0000] "GET /api/atlas/discovery/search/dsl?query=hive_db+where+qualifiedName%3D'dbSzSPO1Rlu3'&limit=10&offset=0 HTTP/1.1" 200 - "-" "Java/1.7.0_80"
127.0.0.1 - - [07/Mar/2017:03:32:22 +0000] "GET /api/atlas/entities?type=hive_db&property=qualifiedName&value=dbSzSPO1Rlu3 HTTP/1.1" 200 - "-" "Java/1.7.0_80"
127.0.0.1 - - [07/Mar/2017:03:32:22 +0000] "GET /api/atlas/entities/af04f197-4098-44cf-8657-96d2bc719a90/audit?count=1 HTTP/1.1" 200 - "-" "Java/1.7.0_80"
127.0.0.1 - - [07/Mar/2017:03:32:22 +0000] "POST /api/atlas/entities HTTP/1.1" 201 - "-" "Java/1.7.0_80"
127.0.0.1 - - [07/Mar/2017:03:32:23 +0000] "GET /api/atlas/entities/7cf220ed-b0a9-49d7-ba37-608bcb33ec7d HTTP/1.1" 200 - "-" "Java/1.7.0_80"
127.0.0.1 - - [07/Mar/2017:03:32:23 +0000] "GET /api/atlas/entities/7cf220ed-b0a9-49d7-ba37-608bcb33ec7d HTTP/1.1" 200 - "-" "Java/1.7.0_80"
127.0.0.1 - - [07/Mar/2017:03:32:23 +0000] "GET /api/atlas/discovery/search/dsl?query=hive_db+where+name%3D'dbHkocWaNCeV'&limit=10&offset=0 HTTP/1.1" 200 - "-" "Java/1.7.0_80"
127.0.0.1 - - [07/Mar/2017:03:32:24 +0000] "GET /api/atlas/discovery/search/dsl?query=hive_db+where+name%3D'dbHkocWaNCeV'&limit=10&offset=0 HTTP/1.1" 200 - "-" "Java/1.7.0_80"
127.0.0.1 - - [07/Mar/2017:03:32:24 +0000] "POST /api/atlas/entities HTTP/1.1" 201 - "-" "Java/1.7.0_80"
127.0.0.1 - - [07/Mar/2017:03:32:24 +0000] "GET /api/atlas/discovery/search/dsl?query=hive_db+where+qualifiedName%3D'dbKVTsWJszKh'&limit=10&offset=0 HTTP/1.1" 200 - "-" "Java/1.7.0_80"
127.0.0.1 - - [07/Mar/2017:03:32:25 +0000] "GET /api/atlas/entities?type=hive_db&property=qualifiedName&value=dbKVTsWJszKh HTTP/1.1" 200 - "-" "Java/1.7.0_80"
127.0.0.1 - - [07/Mar/2017:03:32:25 +0000] "POST /api/atlas/entities HTTP/1.1" 201 - "-" "Java/1.7.0_80"
127.0.0.1 - - [07/Mar/2017:03:32:25 +0000] "GET /api/atlas/entities?type=hive_db&property=qualifiedName&value=dbm1m4YHWA3Y HTTP/1.1" 500 - "-" "Java/1.7.0_80"
127.0.0.1 - - [07/Mar/2017:03:32:26 +0000] "POST /api/atlas/entities HTTP/1.1" 201 - "-" "Java/1.7.0_80"
127.0.0.1 - - [07/Mar/2017:03:32:26 +0000] "GET /api/atlas/discovery/search/dsl?query=hive_db+where+qualifiedName%3D'dbtfDkP8F5tb'&limit=10&offset=0 HTTP/1.1" 200 - "-" "Java/1.7.0_80"
127.0.0.1 - - [07/Mar/2017:03:32:27 +0000] "GET /api/atlas/discovery/search/dsl?query=hive_db+where+qualifiedName%3D'dbSjUQswKn9x'&limit=10&offset=0 HTTP/1.1" 200 - "-" "Java/1.7.0_80"
Tests run: 6, Failures: 1, Errors: 0, Skipped: 0, Time elapsed: 9.788 sec <<< FAILURE! - in org.apache.atlas.notification.NotificationHookConsumerIT
testUpdateEntityPartial(org.apache.atlas.notification.NotificationHookConsumerIT)  Time elapsed: 0.586 sec  <<< FAILURE!
org.apache.atlas.AtlasServiceException: Metadata service API org.apache.atlas.AtlasBaseClient$APIInfo@72a79a66 failed with status 500 (Internal Server Error) Response Body ({"error":"Could not execute operation due to backend exception"})
	at org.apache.atlas.notification.NotificationHookConsumerIT.testUpdateEntityPartial(NotificationHookConsumerIT.java:130)


Results :

Failed tests: 
  NotificationHookConsumerIT.testUpdateEntityPartial:130->BaseResourceIT.waitFor:641 » AtlasService
  EntityJerseyResourceIT.testPartialUpdate:741 expected:<2> but was:<1>

Tests run: 133, Failures: 2, Errors: 0, Skipped: 0

[INFO] 
[INFO] --- jetty-maven-plugin:9.2.12.v20150709:stop (stop-jetty) @ atlas-webapp ---
[INFO] Waiting 10 seconds for jetty to stop
[INFO] Stopped ServerConnector@1a0c488d{HTTP/1.1}{0.0.0.0:31000}
[INFO] Closing Spring root WebApplicationContext
[INFO] Shutting down log4j
log4j:WARN No appenders could be found for logger (org.apache.zookeeper.ClientCnxn).
log4j:WARN Please initialize the log4j system properly.
log4j:WARN See http://logging.apache.org/log4j/1.2/faq.html#noconfig for more info.
[INFO] Stopped o.e.j.m.p.JettyWebAppContext@284fe82f{/,<https://builds.apache.org/job/apache-atlas-nightly/ws/webapp/target/atlas-webapp-0.8-incubating-SNAPSHOT/,UNAVAILABLE}{/home/jenkins/jenkins-slave/workspace/apache-atlas-nightly/webapp/target/atlas-webapp-0.8-incubating-SNAPSHOT.war}>
[INFO] Server reports itself as stopped
[INFO] 
[INFO] --- maven-source-plugin:2.4:jar-no-fork (attach-sources) @ atlas-webapp ---
[INFO] Building jar: <https://builds.apache.org/job/apache-atlas-nightly/ws/webapp/target/atlas-webapp-0.8-incubating-SNAPSHOT-sources.jar>
[INFO] 
[INFO] --- maven-source-plugin:2.4:test-jar-no-fork (attach-sources) @ atlas-webapp ---
[INFO] Building jar: <https://builds.apache.org/job/apache-atlas-nightly/ws/webapp/target/atlas-webapp-0.8-incubating-SNAPSHOT-test-sources.jar>
[INFO] 
[INFO] --- maven-failsafe-plugin:2.19.1:verify (verify) @ atlas-webapp ---
[INFO] ------------------------------------------------------------------------
[INFO] Reactor Summary:
[INFO] 
[INFO] Apache Atlas Server Build Tools .................... SUCCESS [  0.994 s]
[INFO] apache-atlas ....................................... SUCCESS [  8.001 s]
[INFO] Apache Atlas Integration ........................... SUCCESS [01:05 min]
[INFO] Apache Atlas Common ................................ SUCCESS [ 21.640 s]
[INFO] Apache Atlas Typesystem ............................ SUCCESS [01:39 min]
[INFO] Apache Atlas Client ................................ SUCCESS [ 22.526 s]
[INFO] Apache Atlas Server API ............................ SUCCESS [ 12.462 s]
[INFO] Apache Atlas Notification .......................... SUCCESS [ 45.190 s]
[INFO] Apache Atlas Graph Database Projects ............... SUCCESS [  0.622 s]
[INFO] Apache Atlas Graph Database API .................... SUCCESS [  8.792 s]
[INFO] Graph Database Common Code ......................... SUCCESS [  8.947 s]
[INFO] Apache Atlas Titan 1.0.0 GraphDB Impl .............. SUCCESS [ 32.815 s]
[INFO] Shaded version of Apache hbase client .............. SUCCESS [  9.035 s]
[INFO] Apache Atlas Titan 0.5.4 Graph DB Impl ............. SUCCESS [01:49 min]
[INFO] Apache Atlas Graph Database Implementation Dependencies SUCCESS [  0.674 s]
[INFO] Shaded version of Apache hbase server .............. SUCCESS [ 23.550 s]
[INFO] Apache Atlas Repository ............................ SUCCESS [16:04 min]
[INFO] Apache Atlas Authorization ......................... SUCCESS [ 15.319 s]
[INFO] Apache Atlas Business Catalog ...................... SUCCESS [ 33.869 s]
[INFO] Apache Atlas UI .................................... SUCCESS [01:42 min]
[INFO] Apache Atlas Web Application ....................... FAILURE [09:08 min]
[INFO] Apache Atlas Documentation ......................... SKIPPED
[INFO] Apache Atlas FileSystem Model ...................... SKIPPED
[INFO] Apache Atlas Plugin Classloader .................... SKIPPED
[INFO] Apache Atlas Hive Bridge Shim ...................... SKIPPED
[INFO] Apache Atlas Hive Bridge ........................... SKIPPED
[INFO] Apache Atlas Falcon Bridge Shim .................... SKIPPED
[INFO] Apache Atlas Falcon Bridge ......................... SKIPPED
[INFO] Apache Atlas Sqoop Bridge Shim ..................... SKIPPED
[INFO] Apache Atlas Sqoop Bridge .......................... SKIPPED
[INFO] Apache Atlas Storm Bridge Shim ..................... SKIPPED
[INFO] Apache Atlas Storm Bridge .......................... SKIPPED
[INFO] Apache Atlas Distribution .......................... SKIPPED
[INFO] ------------------------------------------------------------------------
[INFO] BUILD FAILURE
[INFO] ------------------------------------------------------------------------
[INFO] Total time: 35:36 min
[INFO] Finished at: 2017-03-07T03:32:34+00:00
[INFO] Final Memory: 357M/1996M
[INFO] ------------------------------------------------------------------------
[ERROR] Failed to execute goal org.apache.maven.plugins:maven-failsafe-plugin:2.19.1:verify (verify) on project atlas-webapp: There are test failures.
[ERROR] 
[ERROR] Please refer to <https://builds.apache.org/job/apache-atlas-nightly/ws/webapp/target/failsafe-reports> for the individual test results.
[ERROR] -> [Help 1]
[ERROR] 
[ERROR] To see the full stack trace of the errors, re-run Maven with the -e switch.
[ERROR] Re-run Maven using the -X switch to enable full debug logging.
[ERROR] 
[ERROR] For more information about the errors and possible solutions, please read the following articles:
[ERROR] [Help 1] http://cwiki.apache.org/confluence/display/MAVEN/MojoFailureException
[ERROR] 
[ERROR] After correcting the problems, you can resume the build with the command
[ERROR]   mvn <goals> -rf :atlas-webapp
Build step 'Execute shell' marked build as failure
[CHECKSTYLE] Collecting checkstyle analysis files...
[CHECKSTYLE] Finding all files that match the pattern **/target/checkstyle-result.xml
[CHECKSTYLE] Parsing 31 files in <https://builds.apache.org/job/apache-atlas-nightly/ws/>
[CHECKSTYLE] Successfully parsed file <https://builds.apache.org/job/apache-atlas-nightly/ws/addons/falcon-bridge-shim/target/checkstyle-result.xml> with 29 unique warnings and 0 duplicates.
[CHECKSTYLE] Successfully parsed file <https://builds.apache.org/job/apache-atlas-nightly/ws/addons/falcon-bridge/target/checkstyle-result.xml> with 420 unique warnings and 0 duplicates.
[CHECKSTYLE] Successfully parsed file <https://builds.apache.org/job/apache-atlas-nightly/ws/addons/hdfs-model/target/checkstyle-result.xml> with 420 unique warnings and 0 duplicates.
[CHECKSTYLE] Successfully parsed file <https://builds.apache.org/job/apache-atlas-nightly/ws/addons/hive-bridge-shim/target/checkstyle-result.xml> with 435 unique warnings and 0 duplicates.
[CHECKSTYLE] Successfully parsed file <https://builds.apache.org/job/apache-atlas-nightly/ws/addons/sqoop-bridge-shim/target/checkstyle-result.xml> with 451 unique warnings and 0 duplicates.
[CHECKSTYLE] Successfully parsed file <https://builds.apache.org/job/apache-atlas-nightly/ws/addons/sqoop-bridge/target/checkstyle-result.xml> with 576 unique warnings and 0 duplicates.
[CHECKSTYLE] Successfully parsed file <https://builds.apache.org/job/apache-atlas-nightly/ws/addons/storm-bridge-shim/target/checkstyle-result.xml> with 597 unique warnings and 0 duplicates.
[CHECKSTYLE] Successfully parsed file <https://builds.apache.org/job/apache-atlas-nightly/ws/addons/storm-bridge/target/checkstyle-result.xml> with 866 unique warnings and 0 duplicates.
[CHECKSTYLE] Successfully parsed file <https://builds.apache.org/job/apache-atlas-nightly/ws/authorization/target/checkstyle-result.xml> with 1319 unique warnings and 0 duplicates.
[CHECKSTYLE] Successfully parsed file <https://builds.apache.org/job/apache-atlas-nightly/ws/catalog/target/checkstyle-result.xml> with 3453 unique warnings and 0 duplicates.
[CHECKSTYLE] Successfully parsed file <https://builds.apache.org/job/apache-atlas-nightly/ws/client/target/checkstyle-result.xml> with 5063 unique warnings and 0 duplicates.
[CHECKSTYLE] Successfully parsed file <https://builds.apache.org/job/apache-atlas-nightly/ws/common/target/checkstyle-result.xml> with 6245 unique warnings and 0 duplicates.
[CHECKSTYLE] Successfully parsed file <https://builds.apache.org/job/apache-atlas-nightly/ws/dashboardv2/target/checkstyle-result.xml> with 6245 unique warnings and 0 duplicates.
[CHECKSTYLE] Successfully parsed file <https://builds.apache.org/job/apache-atlas-nightly/ws/distro/target/checkstyle-result.xml> with 6245 unique warnings and 0 duplicates.
[CHECKSTYLE] Successfully parsed file <https://builds.apache.org/job/apache-atlas-nightly/ws/docs/target/checkstyle-result.xml> with 6245 unique warnings and 0 duplicates.
[CHECKSTYLE] Successfully parsed file <https://builds.apache.org/job/apache-atlas-nightly/ws/graphdb/api/target/checkstyle-result.xml> with 6490 unique warnings and 0 duplicates.
[CHECKSTYLE] Successfully parsed file <https://builds.apache.org/job/apache-atlas-nightly/ws/graphdb/common/target/checkstyle-result.xml> with 6639 unique warnings and 0 duplicates.
[CHECKSTYLE] Successfully parsed file <https://builds.apache.org/job/apache-atlas-nightly/ws/graphdb/graphdb-impls/target/checkstyle-result.xml> with 6639 unique warnings and 0 duplicates.
[CHECKSTYLE] Successfully parsed file <https://builds.apache.org/job/apache-atlas-nightly/ws/graphdb/target/checkstyle-result.xml> with 6639 unique warnings and 0 duplicates.
[CHECKSTYLE] Successfully parsed file <https://builds.apache.org/job/apache-atlas-nightly/ws/graphdb/titan0/target/checkstyle-result.xml> with 8859 unique warnings and 0 duplicates.
[CHECKSTYLE] Successfully parsed file <https://builds.apache.org/job/apache-atlas-nightly/ws/graphdb/titan1/target/checkstyle-result.xml> with 9764 unique warnings and 0 duplicates.
[CHECKSTYLE] Successfully parsed file <https://builds.apache.org/job/apache-atlas-nightly/ws/intg/target/checkstyle-result.xml> with 15663 unique warnings and 0 duplicates.
[CHECKSTYLE] Successfully parsed file <https://builds.apache.org/job/apache-atlas-nightly/ws/notification/target/checkstyle-result.xml> with 16828 unique warnings and 0 duplicates.
[CHECKSTYLE] Successfully parsed file <https://builds.apache.org/job/apache-atlas-nightly/ws/plugin-classloader/target/checkstyle-result.xml> with 16936 unique warnings and 0 duplicates.
[CHECKSTYLE] Successfully parsed file <https://builds.apache.org/job/apache-atlas-nightly/ws/repository/target/checkstyle-result.xml> with 31603 unique warnings and 0 duplicates.
[CHECKSTYLE] Successfully parsed file <https://builds.apache.org/job/apache-atlas-nightly/ws/server-api/target/checkstyle-result.xml> with 32000 unique warnings and 0 duplicates.
[CHECKSTYLE] Successfully parsed file <https://builds.apache.org/job/apache-atlas-nightly/ws/shaded/hbase-client-shaded/target/checkstyle-result.xml> with 32000 unique warnings and 0 duplicates.
[CHECKSTYLE] Successfully parsed file <https://builds.apache.org/job/apache-atlas-nightly/ws/shaded/hbase-server-shaded/target/checkstyle-result.xml> with 32000 unique warnings and 0 duplicates.
[CHECKSTYLE] Successfully parsed file <https://builds.apache.org/job/apache-atlas-nightly/ws/target/checkstyle-result.xml> with 32000 unique warnings and 0 duplicates.
[CHECKSTYLE] Successfully parsed file <https://builds.apache.org/job/apache-atlas-nightly/ws/titan/target/checkstyle-result.xml> with 32462 unique warnings and 0 duplicates.
[CHECKSTYLE] Successfully parsed file <https://builds.apache.org/job/apache-atlas-nightly/ws/typesystem/target/checkstyle-result.xml> with 36681 unique warnings and 0 duplicates.
[CHECKSTYLE] Computing warning deltas based on reference build #535
[FINDBUGS] Collecting findbugs analysis files...
[FINDBUGS] Finding all files that match the pattern **/target/findbugs.xml
[FINDBUGS] Parsing 21 files in <https://builds.apache.org/job/apache-atlas-nightly/ws/>
[FINDBUGS] Successfully parsed file <https://builds.apache.org/job/apache-atlas-nightly/ws/addons/falcon-bridge-shim/target/findbugs.xml> with 0 unique warnings and 0 duplicates.
[FINDBUGS] Successfully parsed file <https://builds.apache.org/job/apache-atlas-nightly/ws/addons/falcon-bridge/target/findbugs.xml> with 0 unique warnings and 0 duplicates.
[FINDBUGS] Successfully parsed file <https://builds.apache.org/job/apache-atlas-nightly/ws/addons/hive-bridge-shim/target/findbugs.xml> with 0 unique warnings and 0 duplicates.
[FINDBUGS] Successfully parsed file <https://builds.apache.org/job/apache-atlas-nightly/ws/addons/sqoop-bridge-shim/target/findbugs.xml> with 0 unique warnings and 0 duplicates.
[FINDBUGS] Successfully parsed file <https://builds.apache.org/job/apache-atlas-nightly/ws/addons/sqoop-bridge/target/findbugs.xml> with 0 unique warnings and 0 duplicates.
[FINDBUGS] Successfully parsed file <https://builds.apache.org/job/apache-atlas-nightly/ws/addons/storm-bridge-shim/target/findbugs.xml> with 0 unique warnings and 0 duplicates.
[FINDBUGS] Successfully parsed file <https://builds.apache.org/job/apache-atlas-nightly/ws/addons/storm-bridge/target/findbugs.xml> with 0 unique warnings and 0 duplicates.
[FINDBUGS] Successfully parsed file <https://builds.apache.org/job/apache-atlas-nightly/ws/authorization/target/findbugs.xml> with 0 unique warnings and 0 duplicates.
[FINDBUGS] Successfully parsed file <https://builds.apache.org/job/apache-atlas-nightly/ws/catalog/target/findbugs.xml> with 0 unique warnings and 0 duplicates.
[FINDBUGS] Successfully parsed file <https://builds.apache.org/job/apache-atlas-nightly/ws/client/target/findbugs.xml> with 0 unique warnings and 0 duplicates.
[FINDBUGS] Successfully parsed file <https://builds.apache.org/job/apache-atlas-nightly/ws/common/target/findbugs.xml> with 0 unique warnings and 0 duplicates.
[FINDBUGS] Successfully parsed file <https://builds.apache.org/job/apache-atlas-nightly/ws/graphdb/api/target/findbugs.xml> with 0 unique warnings and 0 duplicates.
[FINDBUGS] Successfully parsed file <https://builds.apache.org/job/apache-atlas-nightly/ws/graphdb/common/target/findbugs.xml> with 0 unique warnings and 0 duplicates.
[FINDBUGS] Successfully parsed file <https://builds.apache.org/job/apache-atlas-nightly/ws/graphdb/titan0/target/findbugs.xml> with 0 unique warnings and 0 duplicates.
[FINDBUGS] Successfully parsed file <https://builds.apache.org/job/apache-atlas-nightly/ws/intg/target/findbugs.xml> with 0 unique warnings and 0 duplicates.
[FINDBUGS] Successfully parsed file <https://builds.apache.org/job/apache-atlas-nightly/ws/notification/target/findbugs.xml> with 0 unique warnings and 0 duplicates.
[FINDBUGS] Successfully parsed file <https://builds.apache.org/job/apache-atlas-nightly/ws/plugin-classloader/target/findbugs.xml> with 0 unique warnings and 0 duplicates.
[FINDBUGS] Successfully parsed file <https://builds.apache.org/job/apache-atlas-nightly/ws/repository/target/findbugs.xml> with 0 unique warnings and 0 duplicates.
[FINDBUGS] Successfully parsed file <https://builds.apache.org/job/apache-atlas-nightly/ws/server-api/target/findbugs.xml> with 0 unique warnings and 0 duplicates.
[FINDBUGS] Successfully parsed file <https://builds.apache.org/job/apache-atlas-nightly/ws/titan/target/findbugs.xml> with 0 unique warnings and 0 duplicates.
[FINDBUGS] Successfully parsed file <https://builds.apache.org/job/apache-atlas-nightly/ws/typesystem/target/findbugs.xml> with 0 unique warnings and 0 duplicates.
[FINDBUGS] Computing warning deltas based on reference build #535
Archiving artifacts
Compressed 570.31 MB of artifacts by 63.7% relative to #535
TestNG Reports Processing: START
Looking for TestNG results report in workspace using pattern: **/target/surefire-reports/testng-results.xml,**/target/failsafe-reports/testng-results.xml
testng-results.xml was last modified before this build started. Ignoring it.
testng-results.xml was last modified before this build started. Ignoring it.
testng-results.xml was last modified before this build started. Ignoring it.
testng-results.xml was last modified before this build started. Ignoring it.
testng-results.xml was last modified before this build started. Ignoring it.
testng-results.xml was last modified before this build started. Ignoring it.
Saving reports...
Processing '/x1/jenkins/jenkins-home/jobs/apache-atlas-nightly/builds/676/testng/testng-results-1.xml'
Processing '/x1/jenkins/jenkins-home/jobs/apache-atlas-nightly/builds/676/testng/testng-results-10.xml'
Processing '/x1/jenkins/jenkins-home/jobs/apache-atlas-nightly/builds/676/testng/testng-results-2.xml'
Processing '/x1/jenkins/jenkins-home/jobs/apache-atlas-nightly/builds/676/testng/testng-results-3.xml'
Processing '/x1/jenkins/jenkins-home/jobs/apache-atlas-nightly/builds/676/testng/testng-results-4.xml'
Processing '/x1/jenkins/jenkins-home/jobs/apache-atlas-nightly/builds/676/testng/testng-results-5.xml'
Processing '/x1/jenkins/jenkins-home/jobs/apache-atlas-nightly/builds/676/testng/testng-results-6.xml'
Processing '/x1/jenkins/jenkins-home/jobs/apache-atlas-nightly/builds/676/testng/testng-results-7.xml'
Processing '/x1/jenkins/jenkins-home/jobs/apache-atlas-nightly/builds/676/testng/testng-results-8.xml'
Processing '/x1/jenkins/jenkins-home/jobs/apache-atlas-nightly/builds/676/testng/testng-results-9.xml'
Processing '/x1/jenkins/jenkins-home/jobs/apache-atlas-nightly/builds/676/testng/testng-results.xml'
1.785714% of tests failed, which exceeded threshold of 0%. Marking build as UNSTABLE
TestNG Reports Processing: FINISH

Build failed in Jenkins: apache-atlas-nightly #675

Posted by Apache Jenkins Server <je...@builds.apache.org>.
See <https://builds.apache.org/job/apache-atlas-nightly/675/display/redirect?page=changes>

Changes:

[madhan] ATLAS-1636: fix incorrect reverseAttribute for hive_column.table

------------------------------------------
[...truncated 531.47 KB...]
127.0.0.1 - - [07/Mar/2017:02:32:10 +0000] "POST /api/atlas/entities HTTP/1.1" 201 - "-" "Java/1.7.0_80"
127.0.0.1 - - [07/Mar/2017:02:32:10 +0000] "POST /api/atlas/entities HTTP/1.1" 201 - "-" "Java/1.7.0_80"
127.0.0.1 - - [07/Mar/2017:02:32:10 +0000] "POST /api/atlas/entities HTTP/1.1" 201 - "-" "Java/1.7.0_80"
127.0.0.1 - - [07/Mar/2017:02:32:10 +0000] "POST /api/atlas/entities HTTP/1.1" 201 - "-" "Java/1.7.0_80"
127.0.0.1 - - [07/Mar/2017:02:32:10 +0000] "POST /api/atlas/entities HTTP/1.1" 201 - "-" "Java/1.7.0_80"
127.0.0.1 - - [07/Mar/2017:02:32:10 +0000] "POST /api/atlas/entities HTTP/1.1" 201 - "-" "Java/1.7.0_80"
127.0.0.1 - - [07/Mar/2017:02:32:11 +0000] "POST /api/atlas/entities HTTP/1.1" 201 - "-" "Java/1.7.0_80"
127.0.0.1 - - [07/Mar/2017:02:32:11 +0000] "GET /api/atlas/types/tableType HTTP/1.1" 200 - "-" "Java/1.7.0_80"
127.0.0.1 - - [07/Mar/2017:02:32:11 +0000] "GET /api/atlas/types/serdeType HTTP/1.1" 200 - "-" "Java/1.7.0_80"
127.0.0.1 - - [07/Mar/2017:02:32:11 +0000] "GET /api/atlas/types/classification HTTP/1.1" 200 - "-" "Java/1.7.0_80"
127.0.0.1 - - [07/Mar/2017:02:32:11 +0000] "GET /api/atlas/types/hive_db_v1 HTTP/1.1" 200 - "-" "Java/1.7.0_80"
127.0.0.1 - - [07/Mar/2017:02:32:11 +0000] "POST /api/atlas/entities HTTP/1.1" 201 - "-" "Java/1.7.0_80"
127.0.0.1 - - [07/Mar/2017:02:32:11 +0000] "POST /api/atlas/entities HTTP/1.1" 201 - "-" "Java/1.7.0_80"
127.0.0.1 - - [07/Mar/2017:02:32:11 +0000] "POST /api/atlas/entities HTTP/1.1" 201 - "-" "Java/1.7.0_80"
127.0.0.1 - - [07/Mar/2017:02:32:11 +0000] "POST /api/atlas/entities HTTP/1.1" 201 - "-" "Java/1.7.0_80"
127.0.0.1 - - [07/Mar/2017:02:32:11 +0000] "POST /api/atlas/entities HTTP/1.1" 201 - "-" "Java/1.7.0_80"
127.0.0.1 - - [07/Mar/2017:02:32:11 +0000] "POST /api/atlas/entities HTTP/1.1" 201 - "-" "Java/1.7.0_80"
127.0.0.1 - - [07/Mar/2017:02:32:11 +0000] "POST /api/atlas/entities HTTP/1.1" 201 - "-" "Java/1.7.0_80"
127.0.0.1 - - [07/Mar/2017:02:32:11 +0000] "POST /api/atlas/entities HTTP/1.1" 201 - "-" "Java/1.7.0_80"
127.0.0.1 - - [07/Mar/2017:02:32:11 +0000] "GET /api/atlas/lineage/hive/table/sales_fact_monthly_mvQSC4MSvybh/inputs/graph HTTP/1.1" 200 - "-" "Java/1.7.0_80"
127.0.0.1 - - [07/Mar/2017:02:32:13 +0000] "GET /api/atlas/entities?type=hive_table_v1&property=qualifiedName&value=sales_fact_monthly_mvQSC4MSvybh HTTP/1.1" 200 - "-" "Java/1.7.0_80"
127.0.0.1 - - [07/Mar/2017:02:32:13 +0000] "GET /api/atlas/lineage/848c6045-87aa-4b4f-aa47-2c240fc63e9d/inputs/graph HTTP/1.1" 200 - "-" "Java/1.7.0_80"
127.0.0.1 - - [07/Mar/2017:02:32:14 +0000] "GET /api/atlas/lineage/hive/table/sales_facttK2m5JF1sK/outputs/graph HTTP/1.1" 200 - "-" "Java/1.7.0_80"
127.0.0.1 - - [07/Mar/2017:02:32:16 +0000] "GET /api/atlas/entities?type=hive_table_v1&property=qualifiedName&value=sales_facttK2m5JF1sK HTTP/1.1" 200 - "-" "Java/1.7.0_80"
127.0.0.1 - - [07/Mar/2017:02:32:16 +0000] "GET /api/atlas/lineage/b6812568-091e-4dd8-9fd7-b10601d682cc/outputs/graph HTTP/1.1" 200 - "-" "Java/1.7.0_80"
127.0.0.1 - - [07/Mar/2017:02:32:17 +0000] "GET /api/atlas/lineage/hive/table/sales_facttK2m5JF1sK/schema HTTP/1.1" 200 - "-" "Java/1.7.0_80"
127.0.0.1 - - [07/Mar/2017:02:32:18 +0000] "GET /api/atlas/lineage/hive/table/SalesifZwPA0VUO/schema HTTP/1.1" 404 - "-" "Java/1.7.0_80"
127.0.0.1 - - [07/Mar/2017:02:32:18 +0000] "GET /api/atlas/entities?type=hive_table_v1&property=qualifiedName&value=sales_facttK2m5JF1sK HTTP/1.1" 200 - "-" "Java/1.7.0_80"
127.0.0.1 - - [07/Mar/2017:02:32:18 +0000] "GET /api/atlas/lineage/b6812568-091e-4dd8-9fd7-b10601d682cc/schema HTTP/1.1" 200 - "-" "Java/1.7.0_80"
127.0.0.1 - - [07/Mar/2017:02:32:19 +0000] "GET /api/atlas/lineage/hive/table/blah/schema HTTP/1.1" 404 - "-" "Java/1.7.0_80"
127.0.0.1 - - [07/Mar/2017:02:32:19 +0000] "GET /api/atlas/entities?type=hive_table_v1&property=qualifiedName&value=sales_fact_monthly_mvXOpKYY5Qad HTTP/1.1" 200 - "-" "Java/1.7.0_80"
127.0.0.1 - - [07/Mar/2017:02:32:19 +0000] "GET /api/atlas/v2/lineage/ff2dcdeb-bc2d-4f14-a729-4987d504061c?direction=INPUT&depth=5 HTTP/1.1" 200 - "-" "Java/1.7.0_80"
127.0.0.1 - - [07/Mar/2017:02:32:20 +0000] "GET /api/atlas/entities?type=hive_table_v1&property=qualifiedName&value=sales_fact_monthly_mvXOpKYY5Qad HTTP/1.1" 200 - "-" "Java/1.7.0_80"
127.0.0.1 - - [07/Mar/2017:02:32:20 +0000] "GET /api/atlas/v2/lineage/ff2dcdeb-bc2d-4f14-a729-4987d504061c?direction=BOTH&depth=5 HTTP/1.1" 200 - "-" "Java/1.7.0_80"
127.0.0.1 - - [07/Mar/2017:02:32:22 +0000] "GET /api/atlas/entities?type=hive_table_v1&property=qualifiedName&value=sales_factJsfMKcUrXY HTTP/1.1" 200 - "-" "Java/1.7.0_80"
127.0.0.1 - - [07/Mar/2017:02:32:22 +0000] "GET /api/atlas/v2/lineage/12f527b0-7294-47ca-be2e-ba169d46b90b?direction=OUTPUT&depth=5 HTTP/1.1" 200 - "-" "Java/1.7.0_80"
Tests run: 11, Failures: 0, Errors: 0, Skipped: 0, Time elapsed: 16.725 sec - in org.apache.atlas.web.resources.EntityLineageJerseyResourceIT
Running org.apache.atlas.CredentialProviderUtilityIT
Tests run: 4, Failures: 0, Errors: 0, Skipped: 0, Time elapsed: 1.609 sec - in org.apache.atlas.CredentialProviderUtilityIT
Running org.apache.atlas.notification.EntityNotificationIT
127.0.0.1 - - [07/Mar/2017:02:32:29 +0000] "GET /api/atlas/types/tableType HTTP/1.1" 200 - "-" "Java/1.7.0_80"
127.0.0.1 - - [07/Mar/2017:02:32:29 +0000] "GET /api/atlas/types/serdeType HTTP/1.1" 200 - "-" "Java/1.7.0_80"
127.0.0.1 - - [07/Mar/2017:02:32:29 +0000] "GET /api/atlas/types/classification HTTP/1.1" 200 - "-" "Java/1.7.0_80"
127.0.0.1 - - [07/Mar/2017:02:32:29 +0000] "GET /api/atlas/types/hive_db_v1 HTTP/1.1" 200 - "-" "Java/1.7.0_80"
127.0.0.1 - - [07/Mar/2017:02:32:30 +0000] "POST /api/atlas/entities HTTP/1.1" 201 - "-" "Java/1.7.0_80"
127.0.0.1 - - [07/Mar/2017:02:32:31 +0000] "POST /api/atlas/entities HTTP/1.1" 201 - "-" "Java/1.7.0_80"
127.0.0.1 - - [07/Mar/2017:02:32:32 +0000] "POST /api/atlas/types HTTP/1.1" 201 - "-" "Java/1.7.0_80"
127.0.0.1 - - [07/Mar/2017:02:32:32 +0000] "POST /api/atlas/types HTTP/1.1" 201 - "-" "Java/1.7.0_80"
127.0.0.1 - - [07/Mar/2017:02:32:32 +0000] "POST /api/atlas/types HTTP/1.1" 201 - "-" "Java/1.7.0_80"
127.0.0.1 - - [07/Mar/2017:02:32:32 +0000] "POST /api/atlas/entities/6882304c-04f2-418c-a493-2b61c1b792e8/traits HTTP/1.1" 201 - "-" "Java/1.7.0_80"
127.0.0.1 - - [07/Mar/2017:02:32:32 +0000] "POST /api/atlas/types HTTP/1.1" 201 - "-" "Java/1.7.0_80"
127.0.0.1 - - [07/Mar/2017:02:32:32 +0000] "POST /api/atlas/entities/6882304c-04f2-418c-a493-2b61c1b792e8/traits HTTP/1.1" 201 - "-" "Java/1.7.0_80"
127.0.0.1 - - [07/Mar/2017:02:32:32 +0000] "DELETE /api/atlas/entities/6882304c-04f2-418c-a493-2b61c1b792e8/traits/TraitR9yxAGMd1a HTTP/1.1" 200 - "-" "Java/1.7.0_80"
127.0.0.1 - - [07/Mar/2017:02:32:33 +0000] "POST /api/atlas/entities/6882304c-04f2-418c-a493-2b61c1b792e8?property=description HTTP/1.1" 200 - "-" "Java/1.7.0_80"
127.0.0.1 - - [07/Mar/2017:02:32:33 +0000] "POST /api/atlas/entities HTTP/1.1" 201 - "-" "Java/1.7.0_80"
127.0.0.1 - - [07/Mar/2017:02:32:33 +0000] "POST /api/atlas/entities HTTP/1.1" 201 - "-" "Java/1.7.0_80"
127.0.0.1 - - [07/Mar/2017:02:32:33 +0000] "DELETE /api/atlas/entities?type=hive_table&property=qualifiedName&value=table-QYADLk4Vx1 HTTP/1.1" 200 - "-" "Java/1.7.0_80"
Tests run: 5, Failures: 0, Errors: 0, Skipped: 0, Time elapsed: 6.286 sec - in org.apache.atlas.notification.EntityNotificationIT
Running org.apache.atlas.notification.NotificationHookConsumerIT
127.0.0.1 - - [07/Mar/2017:02:32:36 +0000] "GET /api/atlas/types/tableType HTTP/1.1" 200 - "-" "Java/1.7.0_80"
127.0.0.1 - - [07/Mar/2017:02:32:36 +0000] "GET /api/atlas/types/serdeType HTTP/1.1" 200 - "-" "Java/1.7.0_80"
127.0.0.1 - - [07/Mar/2017:02:32:36 +0000] "GET /api/atlas/types/classification HTTP/1.1" 200 - "-" "Java/1.7.0_80"
127.0.0.1 - - [07/Mar/2017:02:32:36 +0000] "GET /api/atlas/types/hive_db_v1 HTTP/1.1" 200 - "-" "Java/1.7.0_80"
127.0.0.1 - - [07/Mar/2017:02:32:37 +0000] "GET /api/atlas/discovery/search/dsl?query=hive_db+where+qualifiedName%3D'dbABNgqXVYq8'&limit=10&offset=0 HTTP/1.1" 200 - "-" "Java/1.7.0_80"
127.0.0.1 - - [07/Mar/2017:02:32:38 +0000] "GET /api/atlas/entities?type=hive_db&property=qualifiedName&value=dbABNgqXVYq8 HTTP/1.1" 200 - "-" "Java/1.7.0_80"
127.0.0.1 - - [07/Mar/2017:02:32:38 +0000] "GET /api/atlas/entities/48499bd9-1cfd-4a03-91e7-7750cf1983d1/audit?count=1 HTTP/1.1" 200 - "-" "Java/1.7.0_80"
127.0.0.1 - - [07/Mar/2017:02:32:38 +0000] "POST /api/atlas/entities HTTP/1.1" 201 - "-" "Java/1.7.0_80"
127.0.0.1 - - [07/Mar/2017:02:32:38 +0000] "GET /api/atlas/entities/b30b1130-6d3c-458d-b89e-fecff457f172 HTTP/1.1" 200 - "-" "Java/1.7.0_80"
127.0.0.1 - - [07/Mar/2017:02:32:38 +0000] "GET /api/atlas/entities/b30b1130-6d3c-458d-b89e-fecff457f172 HTTP/1.1" 200 - "-" "Java/1.7.0_80"
127.0.0.1 - - [07/Mar/2017:02:32:38 +0000] "GET /api/atlas/discovery/search/dsl?query=hive_db+where+name%3D'dbsU3DaoyMzS'&limit=10&offset=0 HTTP/1.1" 200 - "-" "Java/1.7.0_80"
127.0.0.1 - - [07/Mar/2017:02:32:39 +0000] "GET /api/atlas/discovery/search/dsl?query=hive_db+where+name%3D'dbsU3DaoyMzS'&limit=10&offset=0 HTTP/1.1" 200 - "-" "Java/1.7.0_80"
127.0.0.1 - - [07/Mar/2017:02:32:40 +0000] "POST /api/atlas/entities HTTP/1.1" 201 - "-" "Java/1.7.0_80"
127.0.0.1 - - [07/Mar/2017:02:32:40 +0000] "GET /api/atlas/discovery/search/dsl?query=hive_db+where+qualifiedName%3D'dbgXyNnD2YZz'&limit=10&offset=0 HTTP/1.1" 200 - "-" "Java/1.7.0_80"
127.0.0.1 - - [07/Mar/2017:02:32:41 +0000] "GET /api/atlas/entities?type=hive_db&property=qualifiedName&value=dbgXyNnD2YZz HTTP/1.1" 200 - "-" "Java/1.7.0_80"
127.0.0.1 - - [07/Mar/2017:02:32:41 +0000] "POST /api/atlas/entities HTTP/1.1" 201 - "-" "Java/1.7.0_80"
127.0.0.1 - - [07/Mar/2017:02:32:41 +0000] "GET /api/atlas/entities?type=hive_db&property=qualifiedName&value=dbvoyc5bexRN HTTP/1.1" 200 - "-" "Java/1.7.0_80"
127.0.0.1 - - [07/Mar/2017:02:32:41 +0000] "GET /api/atlas/entities?type=hive_db&property=qualifiedName&value=dbvoyc5bexRN HTTP/1.1" 200 - "-" "Java/1.7.0_80"
127.0.0.1 - - [07/Mar/2017:02:32:41 +0000] "GET /api/atlas/entities?type=hive_db&property=qualifiedName&value=dbvoyc5bexRN HTTP/1.1" 200 - "-" "Java/1.7.0_80"
127.0.0.1 - - [07/Mar/2017:02:32:41 +0000] "POST /api/atlas/entities HTTP/1.1" 201 - "-" "Java/1.7.0_80"
127.0.0.1 - - [07/Mar/2017:02:32:41 +0000] "GET /api/atlas/discovery/search/dsl?query=hive_db+where+qualifiedName%3D'dbbBTvONiSuf'&limit=10&offset=0 HTTP/1.1" 200 - "-" "Java/1.7.0_80"
127.0.0.1 - - [07/Mar/2017:02:32:42 +0000] "GET /api/atlas/discovery/search/dsl?query=hive_db+where+qualifiedName%3D'dbUVyFVb9vcl'&limit=10&offset=0 HTTP/1.1" 200 - "-" "Java/1.7.0_80"
Tests run: 6, Failures: 0, Errors: 0, Skipped: 0, Time elapsed: 9.212 sec - in org.apache.atlas.notification.NotificationHookConsumerIT

Results :

Failed tests: 
  EntityJerseyResourceIT.testPartialUpdate:741 expected:<2> but was:<1>

Tests run: 133, Failures: 1, Errors: 0, Skipped: 0

[INFO] 
[INFO] --- jetty-maven-plugin:9.2.12.v20150709:stop (stop-jetty) @ atlas-webapp ---
[INFO] Waiting 10 seconds for jetty to stop
[INFO] Stopped ServerConnector@237d813a{HTTP/1.1}{0.0.0.0:31000}
[INFO] Closing Spring root WebApplicationContext
[INFO] Shutting down log4j
[INFO] Stopped o.e.j.m.p.JettyWebAppContext@55699b59{/,<https://builds.apache.org/job/apache-atlas-nightly/ws/webapp/target/atlas-webapp-0.8-incubating-SNAPSHOT/,UNAVAILABLE}{/home/jenkins/jenkins-slave/workspace/apache-atlas-nightly/webapp/target/atlas-webapp-0.8-incubating-SNAPSHOT.war}>
[INFO] Server reports itself as stopped
[INFO] 
[INFO] --- maven-source-plugin:2.4:jar-no-fork (attach-sources) @ atlas-webapp ---
[INFO] Building jar: <https://builds.apache.org/job/apache-atlas-nightly/ws/webapp/target/atlas-webapp-0.8-incubating-SNAPSHOT-sources.jar>
log4j:WARN No appenders could be found for logger (org.apache.zookeeper.ClientCnxn).
log4j:WARN Please initialize the log4j system properly.
log4j:WARN See http://logging.apache.org/log4j/1.2/faq.html#noconfig for more info.
[INFO] 
[INFO] --- maven-source-plugin:2.4:test-jar-no-fork (attach-sources) @ atlas-webapp ---
[INFO] Building jar: <https://builds.apache.org/job/apache-atlas-nightly/ws/webapp/target/atlas-webapp-0.8-incubating-SNAPSHOT-test-sources.jar>
[INFO] 
[INFO] --- maven-failsafe-plugin:2.19.1:verify (verify) @ atlas-webapp ---
[INFO] ------------------------------------------------------------------------
[INFO] Reactor Summary:
[INFO] 
[INFO] Apache Atlas Server Build Tools .................... SUCCESS [  1.756 s]
[INFO] apache-atlas ....................................... SUCCESS [ 14.291 s]
[INFO] Apache Atlas Integration ........................... SUCCESS [01:06 min]
[INFO] Apache Atlas Common ................................ SUCCESS [ 21.251 s]
[INFO] Apache Atlas Typesystem ............................ SUCCESS [01:42 min]
[INFO] Apache Atlas Client ................................ SUCCESS [ 24.315 s]
[INFO] Apache Atlas Server API ............................ SUCCESS [ 12.577 s]
[INFO] Apache Atlas Notification .......................... SUCCESS [ 44.865 s]
[INFO] Apache Atlas Graph Database Projects ............... SUCCESS [  0.650 s]
[INFO] Apache Atlas Graph Database API .................... SUCCESS [  7.839 s]
[INFO] Graph Database Common Code ......................... SUCCESS [  7.497 s]
[INFO] Apache Atlas Titan 1.0.0 GraphDB Impl .............. SUCCESS [ 36.080 s]
[INFO] Shaded version of Apache hbase client .............. SUCCESS [  9.525 s]
[INFO] Apache Atlas Titan 0.5.4 Graph DB Impl ............. SUCCESS [01:51 min]
[INFO] Apache Atlas Graph Database Implementation Dependencies SUCCESS [  0.847 s]
[INFO] Shaded version of Apache hbase server .............. SUCCESS [ 24.370 s]
[INFO] Apache Atlas Repository ............................ SUCCESS [16:28 min]
[INFO] Apache Atlas Authorization ......................... SUCCESS [ 16.293 s]
[INFO] Apache Atlas Business Catalog ...................... SUCCESS [ 35.092 s]
[INFO] Apache Atlas UI .................................... SUCCESS [01:39 min]
[INFO] Apache Atlas Web Application ....................... FAILURE [09:02 min]
[INFO] Apache Atlas Documentation ......................... SKIPPED
[INFO] Apache Atlas FileSystem Model ...................... SKIPPED
[INFO] Apache Atlas Plugin Classloader .................... SKIPPED
[INFO] Apache Atlas Hive Bridge Shim ...................... SKIPPED
[INFO] Apache Atlas Hive Bridge ........................... SKIPPED
[INFO] Apache Atlas Falcon Bridge Shim .................... SKIPPED
[INFO] Apache Atlas Falcon Bridge ......................... SKIPPED
[INFO] Apache Atlas Sqoop Bridge Shim ..................... SKIPPED
[INFO] Apache Atlas Sqoop Bridge .......................... SKIPPED
[INFO] Apache Atlas Storm Bridge Shim ..................... SKIPPED
[INFO] Apache Atlas Storm Bridge .......................... SKIPPED
[INFO] Apache Atlas Distribution .......................... SKIPPED
[INFO] ------------------------------------------------------------------------
[INFO] BUILD FAILURE
[INFO] ------------------------------------------------------------------------
[INFO] Total time: 36:11 min
[INFO] Finished at: 2017-03-07T02:32:47+00:00
[INFO] Final Memory: 364M/2111M
[INFO] ------------------------------------------------------------------------
[ERROR] Failed to execute goal org.apache.maven.plugins:maven-failsafe-plugin:2.19.1:verify (verify) on project atlas-webapp: There are test failures.
[ERROR] 
[ERROR] Please refer to <https://builds.apache.org/job/apache-atlas-nightly/ws/webapp/target/failsafe-reports> for the individual test results.
[ERROR] -> [Help 1]
[ERROR] 
[ERROR] To see the full stack trace of the errors, re-run Maven with the -e switch.
[ERROR] Re-run Maven using the -X switch to enable full debug logging.
[ERROR] 
[ERROR] For more information about the errors and possible solutions, please read the following articles:
[ERROR] [Help 1] http://cwiki.apache.org/confluence/display/MAVEN/MojoFailureException
[ERROR] 
[ERROR] After correcting the problems, you can resume the build with the command
[ERROR]   mvn <goals> -rf :atlas-webapp
Build step 'Execute shell' marked build as failure
[CHECKSTYLE] Collecting checkstyle analysis files...
[CHECKSTYLE] Finding all files that match the pattern **/target/checkstyle-result.xml
[CHECKSTYLE] Parsing 31 files in <https://builds.apache.org/job/apache-atlas-nightly/ws/>
[CHECKSTYLE] Successfully parsed file <https://builds.apache.org/job/apache-atlas-nightly/ws/addons/falcon-bridge-shim/target/checkstyle-result.xml> with 29 unique warnings and 0 duplicates.
[CHECKSTYLE] Successfully parsed file <https://builds.apache.org/job/apache-atlas-nightly/ws/addons/falcon-bridge/target/checkstyle-result.xml> with 420 unique warnings and 0 duplicates.
[CHECKSTYLE] Successfully parsed file <https://builds.apache.org/job/apache-atlas-nightly/ws/addons/hdfs-model/target/checkstyle-result.xml> with 420 unique warnings and 0 duplicates.
[CHECKSTYLE] Successfully parsed file <https://builds.apache.org/job/apache-atlas-nightly/ws/addons/hive-bridge-shim/target/checkstyle-result.xml> with 435 unique warnings and 0 duplicates.
[CHECKSTYLE] Successfully parsed file <https://builds.apache.org/job/apache-atlas-nightly/ws/addons/sqoop-bridge-shim/target/checkstyle-result.xml> with 451 unique warnings and 0 duplicates.
[CHECKSTYLE] Successfully parsed file <https://builds.apache.org/job/apache-atlas-nightly/ws/addons/sqoop-bridge/target/checkstyle-result.xml> with 576 unique warnings and 0 duplicates.
[CHECKSTYLE] Successfully parsed file <https://builds.apache.org/job/apache-atlas-nightly/ws/addons/storm-bridge-shim/target/checkstyle-result.xml> with 597 unique warnings and 0 duplicates.
[CHECKSTYLE] Successfully parsed file <https://builds.apache.org/job/apache-atlas-nightly/ws/addons/storm-bridge/target/checkstyle-result.xml> with 866 unique warnings and 0 duplicates.
[CHECKSTYLE] Successfully parsed file <https://builds.apache.org/job/apache-atlas-nightly/ws/authorization/target/checkstyle-result.xml> with 1319 unique warnings and 0 duplicates.
[CHECKSTYLE] Successfully parsed file <https://builds.apache.org/job/apache-atlas-nightly/ws/catalog/target/checkstyle-result.xml> with 3453 unique warnings and 0 duplicates.
[CHECKSTYLE] Successfully parsed file <https://builds.apache.org/job/apache-atlas-nightly/ws/client/target/checkstyle-result.xml> with 5063 unique warnings and 0 duplicates.
[CHECKSTYLE] Successfully parsed file <https://builds.apache.org/job/apache-atlas-nightly/ws/common/target/checkstyle-result.xml> with 6245 unique warnings and 0 duplicates.
[CHECKSTYLE] Successfully parsed file <https://builds.apache.org/job/apache-atlas-nightly/ws/dashboardv2/target/checkstyle-result.xml> with 6245 unique warnings and 0 duplicates.
[CHECKSTYLE] Successfully parsed file <https://builds.apache.org/job/apache-atlas-nightly/ws/distro/target/checkstyle-result.xml> with 6245 unique warnings and 0 duplicates.
[CHECKSTYLE] Successfully parsed file <https://builds.apache.org/job/apache-atlas-nightly/ws/docs/target/checkstyle-result.xml> with 6245 unique warnings and 0 duplicates.
[CHECKSTYLE] Successfully parsed file <https://builds.apache.org/job/apache-atlas-nightly/ws/graphdb/api/target/checkstyle-result.xml> with 6490 unique warnings and 0 duplicates.
[CHECKSTYLE] Successfully parsed file <https://builds.apache.org/job/apache-atlas-nightly/ws/graphdb/common/target/checkstyle-result.xml> with 6639 unique warnings and 0 duplicates.
[CHECKSTYLE] Successfully parsed file <https://builds.apache.org/job/apache-atlas-nightly/ws/graphdb/graphdb-impls/target/checkstyle-result.xml> with 6639 unique warnings and 0 duplicates.
[CHECKSTYLE] Successfully parsed file <https://builds.apache.org/job/apache-atlas-nightly/ws/graphdb/target/checkstyle-result.xml> with 6639 unique warnings and 0 duplicates.
[CHECKSTYLE] Successfully parsed file <https://builds.apache.org/job/apache-atlas-nightly/ws/graphdb/titan0/target/checkstyle-result.xml> with 8859 unique warnings and 0 duplicates.
[CHECKSTYLE] Successfully parsed file <https://builds.apache.org/job/apache-atlas-nightly/ws/graphdb/titan1/target/checkstyle-result.xml> with 9764 unique warnings and 0 duplicates.
[CHECKSTYLE] Successfully parsed file <https://builds.apache.org/job/apache-atlas-nightly/ws/intg/target/checkstyle-result.xml> with 15663 unique warnings and 0 duplicates.
[CHECKSTYLE] Successfully parsed file <https://builds.apache.org/job/apache-atlas-nightly/ws/notification/target/checkstyle-result.xml> with 16828 unique warnings and 0 duplicates.
[CHECKSTYLE] Successfully parsed file <https://builds.apache.org/job/apache-atlas-nightly/ws/plugin-classloader/target/checkstyle-result.xml> with 16936 unique warnings and 0 duplicates.
[CHECKSTYLE] Successfully parsed file <https://builds.apache.org/job/apache-atlas-nightly/ws/repository/target/checkstyle-result.xml> with 31596 unique warnings and 0 duplicates.
[CHECKSTYLE] Successfully parsed file <https://builds.apache.org/job/apache-atlas-nightly/ws/server-api/target/checkstyle-result.xml> with 31993 unique warnings and 0 duplicates.
[CHECKSTYLE] Successfully parsed file <https://builds.apache.org/job/apache-atlas-nightly/ws/shaded/hbase-client-shaded/target/checkstyle-result.xml> with 31993 unique warnings and 0 duplicates.
[CHECKSTYLE] Successfully parsed file <https://builds.apache.org/job/apache-atlas-nightly/ws/shaded/hbase-server-shaded/target/checkstyle-result.xml> with 31993 unique warnings and 0 duplicates.
[CHECKSTYLE] Successfully parsed file <https://builds.apache.org/job/apache-atlas-nightly/ws/target/checkstyle-result.xml> with 31993 unique warnings and 0 duplicates.
[CHECKSTYLE] Successfully parsed file <https://builds.apache.org/job/apache-atlas-nightly/ws/titan/target/checkstyle-result.xml> with 32455 unique warnings and 0 duplicates.
[CHECKSTYLE] Successfully parsed file <https://builds.apache.org/job/apache-atlas-nightly/ws/typesystem/target/checkstyle-result.xml> with 36674 unique warnings and 0 duplicates.
[CHECKSTYLE] Computing warning deltas based on reference build #535
[FINDBUGS] Collecting findbugs analysis files...
[FINDBUGS] Finding all files that match the pattern **/target/findbugs.xml
[FINDBUGS] Parsing 21 files in <https://builds.apache.org/job/apache-atlas-nightly/ws/>
[FINDBUGS] Successfully parsed file <https://builds.apache.org/job/apache-atlas-nightly/ws/addons/falcon-bridge-shim/target/findbugs.xml> with 0 unique warnings and 0 duplicates.
[FINDBUGS] Successfully parsed file <https://builds.apache.org/job/apache-atlas-nightly/ws/addons/falcon-bridge/target/findbugs.xml> with 0 unique warnings and 0 duplicates.
[FINDBUGS] Successfully parsed file <https://builds.apache.org/job/apache-atlas-nightly/ws/addons/hive-bridge-shim/target/findbugs.xml> with 0 unique warnings and 0 duplicates.
[FINDBUGS] Successfully parsed file <https://builds.apache.org/job/apache-atlas-nightly/ws/addons/sqoop-bridge-shim/target/findbugs.xml> with 0 unique warnings and 0 duplicates.
[FINDBUGS] Successfully parsed file <https://builds.apache.org/job/apache-atlas-nightly/ws/addons/sqoop-bridge/target/findbugs.xml> with 0 unique warnings and 0 duplicates.
[FINDBUGS] Successfully parsed file <https://builds.apache.org/job/apache-atlas-nightly/ws/addons/storm-bridge-shim/target/findbugs.xml> with 0 unique warnings and 0 duplicates.
[FINDBUGS] Successfully parsed file <https://builds.apache.org/job/apache-atlas-nightly/ws/addons/storm-bridge/target/findbugs.xml> with 0 unique warnings and 0 duplicates.
[FINDBUGS] Successfully parsed file <https://builds.apache.org/job/apache-atlas-nightly/ws/authorization/target/findbugs.xml> with 0 unique warnings and 0 duplicates.
[FINDBUGS] Successfully parsed file <https://builds.apache.org/job/apache-atlas-nightly/ws/catalog/target/findbugs.xml> with 0 unique warnings and 0 duplicates.
[FINDBUGS] Successfully parsed file <https://builds.apache.org/job/apache-atlas-nightly/ws/client/target/findbugs.xml> with 0 unique warnings and 0 duplicates.
[FINDBUGS] Successfully parsed file <https://builds.apache.org/job/apache-atlas-nightly/ws/common/target/findbugs.xml> with 0 unique warnings and 0 duplicates.
[FINDBUGS] Successfully parsed file <https://builds.apache.org/job/apache-atlas-nightly/ws/graphdb/api/target/findbugs.xml> with 0 unique warnings and 0 duplicates.
[FINDBUGS] Successfully parsed file <https://builds.apache.org/job/apache-atlas-nightly/ws/graphdb/common/target/findbugs.xml> with 0 unique warnings and 0 duplicates.
[FINDBUGS] Successfully parsed file <https://builds.apache.org/job/apache-atlas-nightly/ws/graphdb/titan0/target/findbugs.xml> with 0 unique warnings and 0 duplicates.
[FINDBUGS] Successfully parsed file <https://builds.apache.org/job/apache-atlas-nightly/ws/intg/target/findbugs.xml> with 0 unique warnings and 0 duplicates.
[FINDBUGS] Successfully parsed file <https://builds.apache.org/job/apache-atlas-nightly/ws/notification/target/findbugs.xml> with 0 unique warnings and 0 duplicates.
[FINDBUGS] Successfully parsed file <https://builds.apache.org/job/apache-atlas-nightly/ws/plugin-classloader/target/findbugs.xml> with 0 unique warnings and 0 duplicates.
[FINDBUGS] Successfully parsed file <https://builds.apache.org/job/apache-atlas-nightly/ws/repository/target/findbugs.xml> with 0 unique warnings and 0 duplicates.
[FINDBUGS] Successfully parsed file <https://builds.apache.org/job/apache-atlas-nightly/ws/server-api/target/findbugs.xml> with 0 unique warnings and 0 duplicates.
[FINDBUGS] Successfully parsed file <https://builds.apache.org/job/apache-atlas-nightly/ws/titan/target/findbugs.xml> with 0 unique warnings and 0 duplicates.
[FINDBUGS] Successfully parsed file <https://builds.apache.org/job/apache-atlas-nightly/ws/typesystem/target/findbugs.xml> with 0 unique warnings and 0 duplicates.
[FINDBUGS] Computing warning deltas based on reference build #535
Archiving artifacts
Compressed 570.23 MB of artifacts by 63.7% relative to #535
TestNG Reports Processing: START
Looking for TestNG results report in workspace using pattern: **/target/surefire-reports/testng-results.xml,**/target/failsafe-reports/testng-results.xml
testng-results.xml was last modified before this build started. Ignoring it.
testng-results.xml was last modified before this build started. Ignoring it.
testng-results.xml was last modified before this build started. Ignoring it.
testng-results.xml was last modified before this build started. Ignoring it.
testng-results.xml was last modified before this build started. Ignoring it.
testng-results.xml was last modified before this build started. Ignoring it.
Saving reports...
Processing '/x1/jenkins/jenkins-home/jobs/apache-atlas-nightly/builds/675/testng/testng-results-1.xml'
Processing '/x1/jenkins/jenkins-home/jobs/apache-atlas-nightly/builds/675/testng/testng-results-10.xml'
Processing '/x1/jenkins/jenkins-home/jobs/apache-atlas-nightly/builds/675/testng/testng-results-2.xml'
Processing '/x1/jenkins/jenkins-home/jobs/apache-atlas-nightly/builds/675/testng/testng-results-3.xml'
Processing '/x1/jenkins/jenkins-home/jobs/apache-atlas-nightly/builds/675/testng/testng-results-4.xml'
Processing '/x1/jenkins/jenkins-home/jobs/apache-atlas-nightly/builds/675/testng/testng-results-5.xml'
Processing '/x1/jenkins/jenkins-home/jobs/apache-atlas-nightly/builds/675/testng/testng-results-6.xml'
Processing '/x1/jenkins/jenkins-home/jobs/apache-atlas-nightly/builds/675/testng/testng-results-7.xml'
Processing '/x1/jenkins/jenkins-home/jobs/apache-atlas-nightly/builds/675/testng/testng-results-8.xml'
Processing '/x1/jenkins/jenkins-home/jobs/apache-atlas-nightly/builds/675/testng/testng-results-9.xml'
Processing '/x1/jenkins/jenkins-home/jobs/apache-atlas-nightly/builds/675/testng/testng-results.xml'
TestNG Reports Processing: FINISH

Build failed in Jenkins: apache-atlas-nightly #674

Posted by Apache Jenkins Server <je...@builds.apache.org>.
See <https://builds.apache.org/job/apache-atlas-nightly/674/display/redirect?page=changes>

Changes:

[madhan] ATLAS-1635: fixed v1 lineage API return to return correct value in

------------------------------------------
[...truncated 589.27 KB...]
[INFO] Compiling 9 source files to <https://builds.apache.org/job/apache-atlas-nightly/ws/addons/hive-bridge/target/classes>
[WARNING] <https://builds.apache.org/job/apache-atlas-nightly/ws/addons/hive-bridge/src/main/java/org/apache/atlas/hive/bridge/ColumnLineageUtils.java>: Some input files use or override a deprecated API.
[WARNING] <https://builds.apache.org/job/apache-atlas-nightly/ws/addons/hive-bridge/src/main/java/org/apache/atlas/hive/bridge/ColumnLineageUtils.java>: Recompile with -Xlint:deprecation for details.
[WARNING] <https://builds.apache.org/job/apache-atlas-nightly/ws/addons/hive-bridge/src/main/java/org/apache/atlas/hive/bridge/ColumnLineageUtils.java>: Some input files use unchecked or unsafe operations.
[WARNING] <https://builds.apache.org/job/apache-atlas-nightly/ws/addons/hive-bridge/src/main/java/org/apache/atlas/hive/bridge/ColumnLineageUtils.java>: Recompile with -Xlint:unchecked for details.
[INFO] 
[INFO] --- maven-resources-plugin:2.7:testResources (default-testResources) @ hive-bridge ---
[INFO] Using 'UTF-8' encoding to copy filtered resources.
[INFO] Copying 1 resource
[INFO] skip non existing resourceDirectory <https://builds.apache.org/job/apache-atlas-nightly/ws/addons/hive-bridge/typesystem/src/test/resources>
[INFO] Copying 3 resources
[INFO] 
[INFO] --- maven-compiler-plugin:3.1:testCompile (default-testCompile) @ hive-bridge ---
[INFO] Changes detected - recompiling the module!
[INFO] Compiling 5 source files to <https://builds.apache.org/job/apache-atlas-nightly/ws/addons/hive-bridge/target/test-classes>
[WARNING] <https://builds.apache.org/job/apache-atlas-nightly/ws/addons/hive-bridge/src/test/java/org/apache/atlas/hive/HiveITBase.java>: Some input files use or override a deprecated API.
[WARNING] <https://builds.apache.org/job/apache-atlas-nightly/ws/addons/hive-bridge/src/test/java/org/apache/atlas/hive/HiveITBase.java>: Recompile with -Xlint:deprecation for details.
[WARNING] <https://builds.apache.org/job/apache-atlas-nightly/ws/addons/hive-bridge/src/test/java/org/apache/atlas/hive/HiveITBase.java>: Some input files use unchecked or unsafe operations.
[WARNING] <https://builds.apache.org/job/apache-atlas-nightly/ws/addons/hive-bridge/src/test/java/org/apache/atlas/hive/HiveITBase.java>: Recompile with -Xlint:unchecked for details.
[INFO] 
[INFO] --- maven-surefire-plugin:2.18.1:test (default-test) @ hive-bridge ---
[WARNING] The parameter forkMode is deprecated since version 2.14. Use forkCount and reuseForks instead.
[INFO] Surefire report directory: <https://builds.apache.org/job/apache-atlas-nightly/ws/addons/hive-bridge/target/surefire-reports>
[INFO] Using configured provider org.apache.maven.surefire.testng.TestNGProvider
[WARNING] file.encoding cannot be set as system property, use <argLine>-Dfile.encoding=...<argLine> instead

-------------------------------------------------------
 T E S T S
-------------------------------------------------------
Running org.apache.atlas.hive.bridge.HiveMetaStoreBridgeTest
Tests run: 5, Failures: 0, Errors: 0, Skipped: 0, Time elapsed: 12.159 sec - in org.apache.atlas.hive.bridge.HiveMetaStoreBridgeTest
Running org.apache.atlas.hive.bridge.HiveLiteralRewriterTest
Tests run: 0, Failures: 0, Errors: 0, Skipped: 0, Time elapsed: 0.339 sec - in org.apache.atlas.hive.bridge.HiveLiteralRewriterTest

Results :

Tests run: 5, Failures: 0, Errors: 0, Skipped: 0

[INFO] 
[INFO] --- maven-site-plugin:3.4:site (default) @ hive-bridge ---
[INFO] maven.site.skip = true: Skipping site generation
[INFO] 
[INFO] --- maven-jar-plugin:2.5:jar (default-jar) @ hive-bridge ---
[INFO] Building jar: <https://builds.apache.org/job/apache-atlas-nightly/ws/addons/hive-bridge/target/hive-bridge-0.8-incubating-SNAPSHOT.jar>
[INFO] 
[INFO] --- maven-site-plugin:3.4:attach-descriptor (attach-descriptor) @ hive-bridge ---
[INFO] 
[INFO] --- maven-dependency-plugin:2.10:copy (copy-hook) @ hive-bridge ---
[INFO] Configured Artifact: org.apache.atlas:hive-bridge:0.8-incubating-SNAPSHOT:jar
[INFO] Configured Artifact: org.json4s:json4s-native_2.11:3.2.11:jar
[INFO] Configured Artifact: org.json4s:json4s-core_2.11:3.2.11:jar
[INFO] Configured Artifact: org.json4s:json4s-ast_2.11:3.2.11:jar
[INFO] Configured Artifact: org.apache.atlas:atlas-client:0.8-incubating-SNAPSHOT:jar
[INFO] Configured Artifact: org.apache.atlas:atlas-typesystem:0.8-incubating-SNAPSHOT:jar
[INFO] Configured Artifact: org.apache.atlas:atlas-notification:0.8-incubating-SNAPSHOT:jar
[INFO] Configured Artifact: org.apache.atlas:hdfs-model:0.8-incubating-SNAPSHOT:jar
[INFO] Configured Artifact: org.apache.atlas:atlas-common:0.8-incubating-SNAPSHOT:jar
[INFO] Configured Artifact: org.scala-lang:scala-compiler:2.11.8:jar
[INFO] Configured Artifact: org.scala-lang:scala-reflect:2.11.8:jar
[INFO] Configured Artifact: org.scala-lang:scala-library:2.11.8:jar
[INFO] Configured Artifact: org.scala-lang:scalap:2.11.8:jar
[INFO] Configured Artifact: com.google.inject.extensions:guice-multibindings:?:jar
[INFO] Configured Artifact: org.apache.kafka:kafka_2.11:0.10.0.0:jar
[INFO] Configured Artifact: org.apache.kafka:kafka-clients:0.10.0.0:jar
[INFO] Configured Artifact: com.google.code.gson:gson:2.5:jar
[INFO] Copying hive-bridge-0.8-incubating-SNAPSHOT.jar to <https://builds.apache.org/job/apache-atlas-nightly/ws/addons/hive-bridge/target/dependency/hook/hive/atlas-hive-plugin-impl/hive-bridge-0.8-incubating-SNAPSHOT.jar>
[INFO] Copying json4s-native_2.11-3.2.11.jar to <https://builds.apache.org/job/apache-atlas-nightly/ws/addons/hive-bridge/target/dependency/hook/hive/atlas-hive-plugin-impl/json4s-native_2.11-3.2.11.jar>
[INFO] Copying json4s-core_2.11-3.2.11.jar to <https://builds.apache.org/job/apache-atlas-nightly/ws/addons/hive-bridge/target/dependency/hook/hive/atlas-hive-plugin-impl/json4s-core_2.11-3.2.11.jar>
[INFO] Copying json4s-ast_2.11-3.2.11.jar to <https://builds.apache.org/job/apache-atlas-nightly/ws/addons/hive-bridge/target/dependency/hook/hive/atlas-hive-plugin-impl/json4s-ast_2.11-3.2.11.jar>
[INFO] Copying atlas-client-0.8-incubating-SNAPSHOT.jar to <https://builds.apache.org/job/apache-atlas-nightly/ws/addons/hive-bridge/target/dependency/hook/hive/atlas-hive-plugin-impl/atlas-client-0.8-incubating-SNAPSHOT.jar>
[INFO] Copying atlas-typesystem-0.8-incubating-SNAPSHOT.jar to <https://builds.apache.org/job/apache-atlas-nightly/ws/addons/hive-bridge/target/dependency/hook/hive/atlas-hive-plugin-impl/atlas-typesystem-0.8-incubating-SNAPSHOT.jar>
[INFO] Copying atlas-notification-0.8-incubating-SNAPSHOT.jar to <https://builds.apache.org/job/apache-atlas-nightly/ws/addons/hive-bridge/target/dependency/hook/hive/atlas-hive-plugin-impl/atlas-notification-0.8-incubating-SNAPSHOT.jar>
[INFO] Copying hdfs-model-0.8-incubating-SNAPSHOT.jar to <https://builds.apache.org/job/apache-atlas-nightly/ws/addons/hive-bridge/target/dependency/hook/hive/atlas-hive-plugin-impl/hdfs-model-0.8-incubating-SNAPSHOT.jar>
[INFO] Copying atlas-common-0.8-incubating-SNAPSHOT.jar to <https://builds.apache.org/job/apache-atlas-nightly/ws/addons/hive-bridge/target/dependency/hook/hive/atlas-hive-plugin-impl/atlas-common-0.8-incubating-SNAPSHOT.jar>
[INFO] Copying scala-compiler-2.11.8.jar to <https://builds.apache.org/job/apache-atlas-nightly/ws/addons/hive-bridge/target/dependency/hook/hive/atlas-hive-plugin-impl/scala-compiler-2.11.8.jar>
[INFO] Copying scala-reflect-2.11.8.jar to <https://builds.apache.org/job/apache-atlas-nightly/ws/addons/hive-bridge/target/dependency/hook/hive/atlas-hive-plugin-impl/scala-reflect-2.11.8.jar>
[INFO] Copying scala-library-2.11.8.jar to <https://builds.apache.org/job/apache-atlas-nightly/ws/addons/hive-bridge/target/dependency/hook/hive/atlas-hive-plugin-impl/scala-library-2.11.8.jar>
[INFO] Copying scalap-2.11.8.jar to <https://builds.apache.org/job/apache-atlas-nightly/ws/addons/hive-bridge/target/dependency/hook/hive/atlas-hive-plugin-impl/scalap-2.11.8.jar>
[INFO] Copying guice-multibindings-4.1.0.jar to <https://builds.apache.org/job/apache-atlas-nightly/ws/addons/hive-bridge/target/dependency/hook/hive/atlas-hive-plugin-impl/guice-multibindings-4.1.0.jar>
[INFO] Copying kafka_2.11-0.10.0.0.jar to <https://builds.apache.org/job/apache-atlas-nightly/ws/addons/hive-bridge/target/dependency/hook/hive/atlas-hive-plugin-impl/kafka_2.11-0.10.0.0.jar>
[INFO] Copying kafka-clients-0.10.0.0.jar to <https://builds.apache.org/job/apache-atlas-nightly/ws/addons/hive-bridge/target/dependency/hook/hive/atlas-hive-plugin-impl/kafka-clients-0.10.0.0.jar>
[INFO] Copying gson-2.5.jar to <https://builds.apache.org/job/apache-atlas-nightly/ws/addons/hive-bridge/target/dependency/hook/hive/atlas-hive-plugin-impl/gson-2.5.jar>
[INFO] 
[INFO] --- maven-dependency-plugin:2.10:copy (copy-hook-shim) @ hive-bridge ---
[INFO] Configured Artifact: org.apache.atlas:hive-bridge-shim:0.8-incubating-SNAPSHOT:jar
[INFO] Configured Artifact: org.apache.atlas:atlas-plugin-classloader:0.8-incubating-SNAPSHOT:jar
[INFO] Copying hive-bridge-shim-0.8-incubating-SNAPSHOT.jar to <https://builds.apache.org/job/apache-atlas-nightly/ws/addons/hive-bridge/target/dependency/hook/hive/hive-bridge-shim-0.8-incubating-SNAPSHOT.jar>
[INFO] Copying atlas-plugin-classloader-0.8-incubating-SNAPSHOT.jar to <https://builds.apache.org/job/apache-atlas-nightly/ws/addons/hive-bridge/target/dependency/hook/hive/atlas-plugin-classloader-0.8-incubating-SNAPSHOT.jar>
[INFO] 
[INFO] >>> jetty-maven-plugin:9.2.12.v20150709:deploy-war (start-jetty) > validate @ hive-bridge >>>
[INFO] 
[INFO] --- buildnumber-maven-plugin:1.4:create (default) @ hive-bridge ---
[INFO] Executing: /bin/sh -c cd '<https://builds.apache.org/job/apache-atlas-nightly/ws/addons/hive-bridge'> && 'git' 'rev-parse' '--verify' 'HEAD'
[INFO] Working directory: <https://builds.apache.org/job/apache-atlas-nightly/ws/addons/hive-bridge>
[INFO] Storing buildNumber: fe86177a1d55b18b9b1a205fcd1cae83c6b85606 at timestamp: 1488792815046
[WARNING] Cannot get the branch information from the git repository: 
Detecting the current branch failed: fatal: ref HEAD is not a symbolic ref

[INFO] Executing: /bin/sh -c cd '<https://builds.apache.org/job/apache-atlas-nightly/ws/addons/hive-bridge'> && 'git' 'rev-parse' '--verify' 'HEAD'
[INFO] Working directory: <https://builds.apache.org/job/apache-atlas-nightly/ws/addons/hive-bridge>
[INFO] Storing buildScmBranch: UNKNOWN
[INFO] 
[INFO] --- maven-resources-plugin:2.7:copy-resources (copy-resources) @ hive-bridge ---
[INFO] Using 'UTF-8' encoding to copy filtered resources.
[INFO] Copying 10 resources
[INFO] 
[INFO] <<< jetty-maven-plugin:9.2.12.v20150709:deploy-war (start-jetty) < validate @ hive-bridge <<<
[INFO] 
[INFO] --- jetty-maven-plugin:9.2.12.v20150709:deploy-war (start-jetty) @ hive-bridge ---
[INFO] Configuring Jetty for project: Apache Atlas Hive Bridge
[INFO] ------------------------------------------------------------------------
[INFO] Reactor Summary:
[INFO] 
[INFO] Apache Atlas Server Build Tools .................... SUCCESS [  0.828 s]
[INFO] apache-atlas ....................................... SUCCESS [  7.144 s]
[INFO] Apache Atlas Integration ........................... SUCCESS [ 57.689 s]
[INFO] Apache Atlas Common ................................ SUCCESS [ 19.140 s]
[INFO] Apache Atlas Typesystem ............................ SUCCESS [01:34 min]
[INFO] Apache Atlas Client ................................ SUCCESS [ 21.738 s]
[INFO] Apache Atlas Server API ............................ SUCCESS [ 12.937 s]
[INFO] Apache Atlas Notification .......................... SUCCESS [ 44.053 s]
[INFO] Apache Atlas Graph Database Projects ............... SUCCESS [  0.720 s]
[INFO] Apache Atlas Graph Database API .................... SUCCESS [  8.383 s]
[INFO] Graph Database Common Code ......................... SUCCESS [  8.455 s]
[INFO] Apache Atlas Titan 1.0.0 GraphDB Impl .............. SUCCESS [ 33.756 s]
[INFO] Shaded version of Apache hbase client .............. SUCCESS [  8.743 s]
[INFO] Apache Atlas Titan 0.5.4 Graph DB Impl ............. SUCCESS [01:51 min]
[INFO] Apache Atlas Graph Database Implementation Dependencies SUCCESS [  0.738 s]
[INFO] Shaded version of Apache hbase server .............. SUCCESS [ 25.142 s]
[INFO] Apache Atlas Repository ............................ SUCCESS [17:00 min]
[INFO] Apache Atlas Authorization ......................... SUCCESS [ 16.196 s]
[INFO] Apache Atlas Business Catalog ...................... SUCCESS [ 35.346 s]
[INFO] Apache Atlas UI .................................... SUCCESS [ 59.496 s]
[INFO] Apache Atlas Web Application ....................... SUCCESS [10:03 min]
[INFO] Apache Atlas Documentation ......................... SUCCESS [  6.531 s]
[INFO] Apache Atlas FileSystem Model ...................... SUCCESS [  2.222 s]
[INFO] Apache Atlas Plugin Classloader .................... SUCCESS [ 11.711 s]
[INFO] Apache Atlas Hive Bridge Shim ...................... SUCCESS [  9.186 s]
[INFO] Apache Atlas Hive Bridge ........................... FAILURE [ 17.038 s]
[INFO] Apache Atlas Falcon Bridge Shim .................... SKIPPED
[INFO] Apache Atlas Falcon Bridge ......................... SKIPPED
[INFO] Apache Atlas Sqoop Bridge Shim ..................... SKIPPED
[INFO] Apache Atlas Sqoop Bridge .......................... SKIPPED
[INFO] Apache Atlas Storm Bridge Shim ..................... SKIPPED
[INFO] Apache Atlas Storm Bridge .......................... SKIPPED
[INFO] Apache Atlas Distribution .......................... SKIPPED
[INFO] ------------------------------------------------------------------------
[INFO] BUILD FAILURE
[INFO] ------------------------------------------------------------------------
[INFO] Total time: 37:19 min
[INFO] Finished at: 2017-03-06T09:33:35+00:00
[INFO] Final Memory: 415M/1967M
[INFO] ------------------------------------------------------------------------
[ERROR] Failed to execute goal org.eclipse.jetty:jetty-maven-plugin:9.2.12.v20150709:deploy-war (start-jetty) on project hive-bridge: Failure: ShutdownMonitorThread already started -> [Help 1]
[ERROR] 
[ERROR] To see the full stack trace of the errors, re-run Maven with the -e switch.
[ERROR] Re-run Maven using the -X switch to enable full debug logging.
[ERROR] 
[ERROR] For more information about the errors and possible solutions, please read the following articles:
[ERROR] [Help 1] http://cwiki.apache.org/confluence/display/MAVEN/MojoExecutionException
[ERROR] 
[ERROR] After correcting the problems, you can resume the build with the command
[ERROR]   mvn <goals> -rf :hive-bridge
Build step 'Execute shell' marked build as failure
[CHECKSTYLE] Collecting checkstyle analysis files...
[CHECKSTYLE] Finding all files that match the pattern **/target/checkstyle-result.xml
[CHECKSTYLE] Parsing 32 files in <https://builds.apache.org/job/apache-atlas-nightly/ws/>
[CHECKSTYLE] Successfully parsed file <https://builds.apache.org/job/apache-atlas-nightly/ws/addons/falcon-bridge-shim/target/checkstyle-result.xml> with 29 unique warnings and 0 duplicates.
[CHECKSTYLE] Successfully parsed file <https://builds.apache.org/job/apache-atlas-nightly/ws/addons/falcon-bridge/target/checkstyle-result.xml> with 420 unique warnings and 0 duplicates.
[CHECKSTYLE] Successfully parsed file <https://builds.apache.org/job/apache-atlas-nightly/ws/addons/hdfs-model/target/checkstyle-result.xml> with 420 unique warnings and 0 duplicates.
[CHECKSTYLE] Successfully parsed file <https://builds.apache.org/job/apache-atlas-nightly/ws/addons/hive-bridge-shim/target/checkstyle-result.xml> with 435 unique warnings and 0 duplicates.
[CHECKSTYLE] Successfully parsed file <https://builds.apache.org/job/apache-atlas-nightly/ws/addons/sqoop-bridge-shim/target/checkstyle-result.xml> with 451 unique warnings and 0 duplicates.
[CHECKSTYLE] Successfully parsed file <https://builds.apache.org/job/apache-atlas-nightly/ws/addons/sqoop-bridge/target/checkstyle-result.xml> with 576 unique warnings and 0 duplicates.
[CHECKSTYLE] Successfully parsed file <https://builds.apache.org/job/apache-atlas-nightly/ws/addons/storm-bridge-shim/target/checkstyle-result.xml> with 597 unique warnings and 0 duplicates.
[CHECKSTYLE] Successfully parsed file <https://builds.apache.org/job/apache-atlas-nightly/ws/addons/storm-bridge/target/checkstyle-result.xml> with 866 unique warnings and 0 duplicates.
[CHECKSTYLE] Successfully parsed file <https://builds.apache.org/job/apache-atlas-nightly/ws/authorization/target/checkstyle-result.xml> with 1319 unique warnings and 0 duplicates.
[CHECKSTYLE] Successfully parsed file <https://builds.apache.org/job/apache-atlas-nightly/ws/catalog/target/checkstyle-result.xml> with 3453 unique warnings and 0 duplicates.
[CHECKSTYLE] Successfully parsed file <https://builds.apache.org/job/apache-atlas-nightly/ws/client/target/checkstyle-result.xml> with 5063 unique warnings and 0 duplicates.
[CHECKSTYLE] Successfully parsed file <https://builds.apache.org/job/apache-atlas-nightly/ws/common/target/checkstyle-result.xml> with 6245 unique warnings and 0 duplicates.
[CHECKSTYLE] Successfully parsed file <https://builds.apache.org/job/apache-atlas-nightly/ws/dashboardv2/target/checkstyle-result.xml> with 6245 unique warnings and 0 duplicates.
[CHECKSTYLE] Successfully parsed file <https://builds.apache.org/job/apache-atlas-nightly/ws/distro/target/checkstyle-result.xml> with 6245 unique warnings and 0 duplicates.
[CHECKSTYLE] Successfully parsed file <https://builds.apache.org/job/apache-atlas-nightly/ws/docs/target/checkstyle-result.xml> with 6245 unique warnings and 0 duplicates.
[CHECKSTYLE] Successfully parsed file <https://builds.apache.org/job/apache-atlas-nightly/ws/graphdb/api/target/checkstyle-result.xml> with 6490 unique warnings and 0 duplicates.
[CHECKSTYLE] Successfully parsed file <https://builds.apache.org/job/apache-atlas-nightly/ws/graphdb/common/target/checkstyle-result.xml> with 6639 unique warnings and 0 duplicates.
[CHECKSTYLE] Successfully parsed file <https://builds.apache.org/job/apache-atlas-nightly/ws/graphdb/graphdb-impls/target/checkstyle-result.xml> with 6639 unique warnings and 0 duplicates.
[CHECKSTYLE] Successfully parsed file <https://builds.apache.org/job/apache-atlas-nightly/ws/graphdb/target/checkstyle-result.xml> with 6639 unique warnings and 0 duplicates.
[CHECKSTYLE] Successfully parsed file <https://builds.apache.org/job/apache-atlas-nightly/ws/graphdb/titan0/target/checkstyle-result.xml> with 8859 unique warnings and 0 duplicates.
[CHECKSTYLE] Successfully parsed file <https://builds.apache.org/job/apache-atlas-nightly/ws/graphdb/titan1/target/checkstyle-result.xml> with 9764 unique warnings and 0 duplicates.
[CHECKSTYLE] Successfully parsed file <https://builds.apache.org/job/apache-atlas-nightly/ws/intg/target/checkstyle-result.xml> with 15663 unique warnings and 0 duplicates.
[CHECKSTYLE] Successfully parsed file <https://builds.apache.org/job/apache-atlas-nightly/ws/notification/target/checkstyle-result.xml> with 16828 unique warnings and 0 duplicates.
[CHECKSTYLE] Successfully parsed file <https://builds.apache.org/job/apache-atlas-nightly/ws/plugin-classloader/target/checkstyle-result.xml> with 16936 unique warnings and 0 duplicates.
[CHECKSTYLE] Successfully parsed file <https://builds.apache.org/job/apache-atlas-nightly/ws/repository/target/checkstyle-result.xml> with 31571 unique warnings and 0 duplicates.
[CHECKSTYLE] Successfully parsed file <https://builds.apache.org/job/apache-atlas-nightly/ws/server-api/target/checkstyle-result.xml> with 31968 unique warnings and 0 duplicates.
[CHECKSTYLE] Successfully parsed file <https://builds.apache.org/job/apache-atlas-nightly/ws/shaded/hbase-client-shaded/target/checkstyle-result.xml> with 31968 unique warnings and 0 duplicates.
[CHECKSTYLE] Successfully parsed file <https://builds.apache.org/job/apache-atlas-nightly/ws/shaded/hbase-server-shaded/target/checkstyle-result.xml> with 31968 unique warnings and 0 duplicates.
[CHECKSTYLE] Successfully parsed file <https://builds.apache.org/job/apache-atlas-nightly/ws/target/checkstyle-result.xml> with 31968 unique warnings and 0 duplicates.
[CHECKSTYLE] Successfully parsed file <https://builds.apache.org/job/apache-atlas-nightly/ws/titan/target/checkstyle-result.xml> with 32430 unique warnings and 0 duplicates.
[CHECKSTYLE] Successfully parsed file <https://builds.apache.org/job/apache-atlas-nightly/ws/typesystem/target/checkstyle-result.xml> with 36649 unique warnings and 0 duplicates.
[CHECKSTYLE] Successfully parsed file <https://builds.apache.org/job/apache-atlas-nightly/ws/webapp/target/checkstyle-result.xml> with 44819 unique warnings and 0 duplicates.
[CHECKSTYLE] Computing warning deltas based on reference build #535
[FINDBUGS] Collecting findbugs analysis files...
[FINDBUGS] Finding all files that match the pattern **/target/findbugs.xml
[FINDBUGS] Parsing 22 files in <https://builds.apache.org/job/apache-atlas-nightly/ws/>
[FINDBUGS] Successfully parsed file <https://builds.apache.org/job/apache-atlas-nightly/ws/addons/falcon-bridge-shim/target/findbugs.xml> with 0 unique warnings and 0 duplicates.
[FINDBUGS] Successfully parsed file <https://builds.apache.org/job/apache-atlas-nightly/ws/addons/falcon-bridge/target/findbugs.xml> with 0 unique warnings and 0 duplicates.
[FINDBUGS] Successfully parsed file <https://builds.apache.org/job/apache-atlas-nightly/ws/addons/hive-bridge-shim/target/findbugs.xml> with 0 unique warnings and 0 duplicates.
[FINDBUGS] Successfully parsed file <https://builds.apache.org/job/apache-atlas-nightly/ws/addons/sqoop-bridge-shim/target/findbugs.xml> with 0 unique warnings and 0 duplicates.
[FINDBUGS] Successfully parsed file <https://builds.apache.org/job/apache-atlas-nightly/ws/addons/sqoop-bridge/target/findbugs.xml> with 0 unique warnings and 0 duplicates.
[FINDBUGS] Successfully parsed file <https://builds.apache.org/job/apache-atlas-nightly/ws/addons/storm-bridge-shim/target/findbugs.xml> with 0 unique warnings and 0 duplicates.
[FINDBUGS] Successfully parsed file <https://builds.apache.org/job/apache-atlas-nightly/ws/addons/storm-bridge/target/findbugs.xml> with 0 unique warnings and 0 duplicates.
[FINDBUGS] Successfully parsed file <https://builds.apache.org/job/apache-atlas-nightly/ws/authorization/target/findbugs.xml> with 0 unique warnings and 0 duplicates.
[FINDBUGS] Successfully parsed file <https://builds.apache.org/job/apache-atlas-nightly/ws/catalog/target/findbugs.xml> with 0 unique warnings and 0 duplicates.
[FINDBUGS] Successfully parsed file <https://builds.apache.org/job/apache-atlas-nightly/ws/client/target/findbugs.xml> with 0 unique warnings and 0 duplicates.
[FINDBUGS] Successfully parsed file <https://builds.apache.org/job/apache-atlas-nightly/ws/common/target/findbugs.xml> with 0 unique warnings and 0 duplicates.
[FINDBUGS] Successfully parsed file <https://builds.apache.org/job/apache-atlas-nightly/ws/graphdb/api/target/findbugs.xml> with 0 unique warnings and 0 duplicates.
[FINDBUGS] Successfully parsed file <https://builds.apache.org/job/apache-atlas-nightly/ws/graphdb/common/target/findbugs.xml> with 0 unique warnings and 0 duplicates.
[FINDBUGS] Successfully parsed file <https://builds.apache.org/job/apache-atlas-nightly/ws/graphdb/titan0/target/findbugs.xml> with 0 unique warnings and 0 duplicates.
[FINDBUGS] Successfully parsed file <https://builds.apache.org/job/apache-atlas-nightly/ws/intg/target/findbugs.xml> with 0 unique warnings and 0 duplicates.
[FINDBUGS] Successfully parsed file <https://builds.apache.org/job/apache-atlas-nightly/ws/notification/target/findbugs.xml> with 0 unique warnings and 0 duplicates.
[FINDBUGS] Successfully parsed file <https://builds.apache.org/job/apache-atlas-nightly/ws/plugin-classloader/target/findbugs.xml> with 0 unique warnings and 0 duplicates.
[FINDBUGS] Successfully parsed file <https://builds.apache.org/job/apache-atlas-nightly/ws/repository/target/findbugs.xml> with 0 unique warnings and 0 duplicates.
[FINDBUGS] Successfully parsed file <https://builds.apache.org/job/apache-atlas-nightly/ws/server-api/target/findbugs.xml> with 0 unique warnings and 0 duplicates.
[FINDBUGS] Successfully parsed file <https://builds.apache.org/job/apache-atlas-nightly/ws/titan/target/findbugs.xml> with 0 unique warnings and 0 duplicates.
[FINDBUGS] Successfully parsed file <https://builds.apache.org/job/apache-atlas-nightly/ws/typesystem/target/findbugs.xml> with 0 unique warnings and 0 duplicates.
[FINDBUGS] Successfully parsed file <https://builds.apache.org/job/apache-atlas-nightly/ws/webapp/target/findbugs.xml> with 0 unique warnings and 0 duplicates.
[FINDBUGS] Computing warning deltas based on reference build #535
Archiving artifacts
Compressed 569.93 MB of artifacts by 63.7% relative to #535
TestNG Reports Processing: START
Looking for TestNG results report in workspace using pattern: **/target/surefire-reports/testng-results.xml,**/target/failsafe-reports/testng-results.xml
testng-results.xml was last modified before this build started. Ignoring it.
testng-results.xml was last modified before this build started. Ignoring it.
testng-results.xml was last modified before this build started. Ignoring it.
testng-results.xml was last modified before this build started. Ignoring it.
Saving reports...
Processing '/x1/jenkins/jenkins-home/jobs/apache-atlas-nightly/builds/674/testng/testng-results-1.xml'
Processing '/x1/jenkins/jenkins-home/jobs/apache-atlas-nightly/builds/674/testng/testng-results-10.xml'
Processing '/x1/jenkins/jenkins-home/jobs/apache-atlas-nightly/builds/674/testng/testng-results-11.xml'
Processing '/x1/jenkins/jenkins-home/jobs/apache-atlas-nightly/builds/674/testng/testng-results-12.xml'
Processing '/x1/jenkins/jenkins-home/jobs/apache-atlas-nightly/builds/674/testng/testng-results-2.xml'
Processing '/x1/jenkins/jenkins-home/jobs/apache-atlas-nightly/builds/674/testng/testng-results-3.xml'
Processing '/x1/jenkins/jenkins-home/jobs/apache-atlas-nightly/builds/674/testng/testng-results-4.xml'
Processing '/x1/jenkins/jenkins-home/jobs/apache-atlas-nightly/builds/674/testng/testng-results-5.xml'
Processing '/x1/jenkins/jenkins-home/jobs/apache-atlas-nightly/builds/674/testng/testng-results-6.xml'
Processing '/x1/jenkins/jenkins-home/jobs/apache-atlas-nightly/builds/674/testng/testng-results-7.xml'
Processing '/x1/jenkins/jenkins-home/jobs/apache-atlas-nightly/builds/674/testng/testng-results-8.xml'
Processing '/x1/jenkins/jenkins-home/jobs/apache-atlas-nightly/builds/674/testng/testng-results-9.xml'
Processing '/x1/jenkins/jenkins-home/jobs/apache-atlas-nightly/builds/674/testng/testng-results.xml'
TestNG Reports Processing: FINISH