You are viewing a plain text version of this content. The canonical link for it is here.
Posted to builds@cassandra.apache.org by Apache Jenkins Server <je...@builds.apache.org> on 2023/11/04 00:23:34 UTC
Build complete: Cassandra-trunk #1767 [UNSTABLE] 5850996ab1735ffc2818f19d0514c0528bb43596
-------------------------------------------------------------------------------
Build Cassandra-trunk #1767 Still Unstable
URL: https://ci-cassandra.apache.org/job/Cassandra-trunk/1767/
-------------------------------------------------------------------------------
Changes:
[Stefan Miklosovic] Improve documentation for snitches
-------------------------------------------------------------------------------
Failed Tests:
11 tests failed.
FAILED: dtest-large.consistency_test.TestAccuracy.test_network_topology_strategy_users
FAILED: dtest-novnode.snapshot_test.TestArchiveCommitlog.test_archive_commitlog_point_in_time
FAILED: dtest-novnode.cqlsh_tests.test_cqlsh_copy.TestCqlshCopy.test_bulk_round_trip_blogposts_with_max_connections
FAILED: dtest-novnode.repair_tests.repair_test.TestRepair.test_repair_validates_dc
FAILED: dtest-novnode.repair_tests.incremental_repair_test.TestIncRepair.test_multiple_full_repairs_lcs
FAILED: dtest-offheap.snapshot_test.TestArchiveCommitlog.test_archive_commitlog
FAILED: dtest-offheap.cqlsh_tests.test_cqlsh_copy.TestCqlshCopy.test_bulk_round_trip_blogposts
FAILED: dtest-offheap.repair_tests.repair_test.TestRepair.test_dc_parallel_repair
FAILED: org.apache.cassandra.io.sstable.format.bti.PartitionIndexTest.testConstrainedIteration[1]-cassandra.testtag_IS_UNDEFINED
FAILED: org.apache.cassandra.utils.bytecomparable.ByteSourceComparisonTest.testPatitionerOrder-cassandra.testtag_IS_UNDEFINED
FAILED: dtest-upgrade.upgrade_tests.upgrade_through_versions_test.TestProtoV3Upgrade_AllVersions_EndsAt_Trunk_HEAD.test_parallel_upgrade
-------------------------------------------------------------------------------
For complete test report and logs see https://nightlies.apache.org/cassandra/Cassandra-trunk/1767/