You are viewing a plain text version of this content. The canonical link for it is here.
Posted to dev@lucene.apache.org by Policeman Jenkins Server <je...@thetaphi.de> on 2017/04/17 04:51:07 UTC
[JENKINS] Lucene-Solr-master-Linux (64bit/jdk1.8.0_121) - Build #
19412 - Still Unstable!
Build: https://jenkins.thetaphi.de/job/Lucene-Solr-master-Linux/19412/
Java: 64bit/jdk1.8.0_121 -XX:+UseCompressedOops -XX:+UseG1GC
2 tests failed.
FAILED: junit.framework.TestSuite.org.apache.solr.cloud.SolrCloudExampleTest
Error Message:
ObjectTracker found 5 object(s) that were not released!!! [MockDirectoryWrapper, MockDirectoryWrapper, MDCAwareThreadPoolExecutor, TransactionLog, MockDirectoryWrapper] org.apache.solr.common.util.ObjectReleaseTracker$ObjectTrackerException: org.apache.lucene.store.MockDirectoryWrapper at org.apache.solr.common.util.ObjectReleaseTracker.track(ObjectReleaseTracker.java:42) at org.apache.solr.core.CachingDirectoryFactory.get(CachingDirectoryFactory.java:347) at org.apache.solr.update.SolrIndexWriter.create(SolrIndexWriter.java:92) at org.apache.solr.core.SolrCore.initIndex(SolrCore.java:752) at org.apache.solr.core.SolrCore.<init>(SolrCore.java:947) at org.apache.solr.core.SolrCore.<init>(SolrCore.java:854) at org.apache.solr.core.CoreContainer.create(CoreContainer.java:958) at org.apache.solr.core.CoreContainer.create(CoreContainer.java:893) at org.apache.solr.handler.admin.CoreAdminOperation.lambda$static$0(CoreAdminOperation.java:88) at org.apache.solr.handler.admin.CoreAdminOperation.execute(CoreAdminOperation.java:370) at org.apache.solr.handler.admin.CoreAdminHandler$CallInfo.call(CoreAdminHandler.java:388) at org.apache.solr.handler.admin.CoreAdminHandler.handleRequestBody(CoreAdminHandler.java:174) at org.apache.solr.handler.RequestHandlerBase.handleRequest(RequestHandlerBase.java:178) at org.apache.solr.servlet.HttpSolrCall.handleAdmin(HttpSolrCall.java:747) at org.apache.solr.servlet.HttpSolrCall.handleAdminRequest(HttpSolrCall.java:728) at org.apache.solr.servlet.HttpSolrCall.call(HttpSolrCall.java:509) at org.apache.solr.servlet.SolrDispatchFilter.doFilter(SolrDispatchFilter.java:344) at org.apache.solr.servlet.SolrDispatchFilter.doFilter(SolrDispatchFilter.java:295) at org.eclipse.jetty.servlet.ServletHandler$CachedChain.doFilter(ServletHandler.java:1699) at org.apache.solr.client.solrj.embedded.JettySolrRunner$DebugFilter.doFilter(JettySolrRunner.java:139) at org.eclipse.jetty.servlet.ServletHandler$CachedChain.doFilter(ServletHandler.java:1699) at org.eclipse.jetty.servlet.ServletHandler.doHandle(ServletHandler.java:582) at org.eclipse.jetty.server.session.SessionHandler.doHandle(SessionHandler.java:224) at org.eclipse.jetty.server.handler.ContextHandler.doHandle(ContextHandler.java:1180) at org.eclipse.jetty.servlet.ServletHandler.doScope(ServletHandler.java:512) at org.eclipse.jetty.server.session.SessionHandler.doScope(SessionHandler.java:185) at org.eclipse.jetty.server.handler.ContextHandler.doScope(ContextHandler.java:1112) at org.eclipse.jetty.server.handler.ScopedHandler.handle(ScopedHandler.java:141) at org.eclipse.jetty.server.handler.gzip.GzipHandler.handle(GzipHandler.java:395) at org.eclipse.jetty.server.handler.HandlerWrapper.handle(HandlerWrapper.java:134) at org.eclipse.jetty.server.Server.handle(Server.java:534) at org.eclipse.jetty.server.HttpChannel.handle(HttpChannel.java:320) at org.eclipse.jetty.server.HttpConnection.onFillable(HttpConnection.java:251) at org.eclipse.jetty.io.AbstractConnection$ReadCallback.succeeded(AbstractConnection.java:273) at org.eclipse.jetty.io.FillInterest.fillable(FillInterest.java:95) at org.eclipse.jetty.io.SelectChannelEndPoint$2.run(SelectChannelEndPoint.java:93) at org.eclipse.jetty.util.thread.strategy.ExecuteProduceConsume.executeProduceConsume(ExecuteProduceConsume.java:303) at org.eclipse.jetty.util.thread.strategy.ExecuteProduceConsume.produceConsume(ExecuteProduceConsume.java:148) at org.eclipse.jetty.util.thread.strategy.ExecuteProduceConsume.execute(ExecuteProduceConsume.java:100) at org.eclipse.jetty.io.ManagedSelector.run(ManagedSelector.java:147) at org.eclipse.jetty.util.thread.QueuedThreadPool.runJob(QueuedThreadPool.java:671) at org.eclipse.jetty.util.thread.QueuedThreadPool$2.run(QueuedThreadPool.java:589) at java.lang.Thread.run(Thread.java:745) org.apache.solr.common.util.ObjectReleaseTracker$ObjectTrackerException: org.apache.lucene.store.MockDirectoryWrapper at org.apache.solr.common.util.ObjectReleaseTracker.track(ObjectReleaseTracker.java:42) at org.apache.solr.core.CachingDirectoryFactory.get(CachingDirectoryFactory.java:347) at org.apache.solr.core.SolrCore.initSnapshotMetaDataManager(SolrCore.java:489) at org.apache.solr.core.SolrCore.<init>(SolrCore.java:941) at org.apache.solr.core.SolrCore.<init>(SolrCore.java:854) at org.apache.solr.core.CoreContainer.create(CoreContainer.java:958) at org.apache.solr.core.CoreContainer.create(CoreContainer.java:893) at org.apache.solr.handler.admin.CoreAdminOperation.lambda$static$0(CoreAdminOperation.java:88) at org.apache.solr.handler.admin.CoreAdminOperation.execute(CoreAdminOperation.java:370) at org.apache.solr.handler.admin.CoreAdminHandler$CallInfo.call(CoreAdminHandler.java:388) at org.apache.solr.handler.admin.CoreAdminHandler.handleRequestBody(CoreAdminHandler.java:174) at org.apache.solr.handler.RequestHandlerBase.handleRequest(RequestHandlerBase.java:178) at org.apache.solr.servlet.HttpSolrCall.handleAdmin(HttpSolrCall.java:747) at org.apache.solr.servlet.HttpSolrCall.handleAdminRequest(HttpSolrCall.java:728) at org.apache.solr.servlet.HttpSolrCall.call(HttpSolrCall.java:509) at org.apache.solr.servlet.SolrDispatchFilter.doFilter(SolrDispatchFilter.java:344) at org.apache.solr.servlet.SolrDispatchFilter.doFilter(SolrDispatchFilter.java:295) at org.eclipse.jetty.servlet.ServletHandler$CachedChain.doFilter(ServletHandler.java:1699) at org.apache.solr.client.solrj.embedded.JettySolrRunner$DebugFilter.doFilter(JettySolrRunner.java:139) at org.eclipse.jetty.servlet.ServletHandler$CachedChain.doFilter(ServletHandler.java:1699) at org.eclipse.jetty.servlet.ServletHandler.doHandle(ServletHandler.java:582) at org.eclipse.jetty.server.session.SessionHandler.doHandle(SessionHandler.java:224) at org.eclipse.jetty.server.handler.ContextHandler.doHandle(ContextHandler.java:1180) at org.eclipse.jetty.servlet.ServletHandler.doScope(ServletHandler.java:512) at org.eclipse.jetty.server.session.SessionHandler.doScope(SessionHandler.java:185) at org.eclipse.jetty.server.handler.ContextHandler.doScope(ContextHandler.java:1112) at org.eclipse.jetty.server.handler.ScopedHandler.handle(ScopedHandler.java:141) at org.eclipse.jetty.server.handler.gzip.GzipHandler.handle(GzipHandler.java:395) at org.eclipse.jetty.server.handler.HandlerWrapper.handle(HandlerWrapper.java:134) at org.eclipse.jetty.server.Server.handle(Server.java:534) at org.eclipse.jetty.server.HttpChannel.handle(HttpChannel.java:320) at org.eclipse.jetty.server.HttpConnection.onFillable(HttpConnection.java:251) at org.eclipse.jetty.io.AbstractConnection$ReadCallback.succeeded(AbstractConnection.java:273) at org.eclipse.jetty.io.FillInterest.fillable(FillInterest.java:95) at org.eclipse.jetty.io.SelectChannelEndPoint$2.run(SelectChannelEndPoint.java:93) at org.eclipse.jetty.util.thread.strategy.ExecuteProduceConsume.executeProduceConsume(ExecuteProduceConsume.java:303) at org.eclipse.jetty.util.thread.strategy.ExecuteProduceConsume.produceConsume(ExecuteProduceConsume.java:148) at org.eclipse.jetty.util.thread.strategy.ExecuteProduceConsume.execute(ExecuteProduceConsume.java:100) at org.eclipse.jetty.io.ManagedSelector.run(ManagedSelector.java:147) at org.eclipse.jetty.util.thread.QueuedThreadPool.runJob(QueuedThreadPool.java:671) at org.eclipse.jetty.util.thread.QueuedThreadPool$2.run(QueuedThreadPool.java:589) at java.lang.Thread.run(Thread.java:745) org.apache.solr.common.util.ObjectReleaseTracker$ObjectTrackerException: org.apache.solr.common.util.ExecutorUtil$MDCAwareThreadPoolExecutor at org.apache.solr.common.util.ObjectReleaseTracker.track(ObjectReleaseTracker.java:42) at org.apache.solr.core.SolrCore.<init>(SolrCore.java:883) at org.apache.solr.core.SolrCore.reload(SolrCore.java:647) at org.apache.solr.core.CoreContainer.reload(CoreContainer.java:1154) at org.apache.solr.core.SolrCore.lambda$getConfListener$18(SolrCore.java:2949) at org.apache.solr.handler.SolrConfigHandler$Command.lambda$handleGET$0(SolrConfigHandler.java:225) at java.lang.Thread.run(Thread.java:745) org.apache.solr.common.util.ObjectReleaseTracker$ObjectTrackerException: org.apache.solr.update.TransactionLog at org.apache.solr.common.util.ObjectReleaseTracker.track(ObjectReleaseTracker.java:42) at org.apache.solr.update.TransactionLog.<init>(TransactionLog.java:190) at org.apache.solr.update.UpdateLog.newTransactionLog(UpdateLog.java:438) at org.apache.solr.update.UpdateLog.ensureLog(UpdateLog.java:1250) at org.apache.solr.update.UpdateLog.add(UpdateLog.java:524) at org.apache.solr.update.UpdateLog.add(UpdateLog.java:509) at org.apache.solr.update.DirectUpdateHandler2.doNormalUpdate(DirectUpdateHandler2.java:348) at org.apache.solr.update.DirectUpdateHandler2.addDoc0(DirectUpdateHandler2.java:267) at org.apache.solr.update.DirectUpdateHandler2.addDoc(DirectUpdateHandler2.java:217) at org.apache.solr.update.processor.RunUpdateProcessor.processAdd(RunUpdateProcessorFactory.java:67) at org.apache.solr.update.processor.UpdateRequestProcessor.processAdd(UpdateRequestProcessor.java:55) at org.apache.solr.update.processor.DistributedUpdateProcessor.doLocalAdd(DistributedUpdateProcessor.java:991) at org.apache.solr.update.processor.DistributedUpdateProcessor.versionAdd(DistributedUpdateProcessor.java:1207) at org.apache.solr.update.processor.DistributedUpdateProcessor.processAdd(DistributedUpdateProcessor.java:753) at org.apache.solr.update.processor.LogUpdateProcessorFactory$LogUpdateProcessor.processAdd(LogUpdateProcessorFactory.java:103) at org.apache.solr.update.processor.UpdateRequestProcessor.processAdd(UpdateRequestProcessor.java:55) at org.apache.solr.update.processor.AddSchemaFieldsUpdateProcessorFactory$AddSchemaFieldsUpdateProcessor.processAdd(AddSchemaFieldsUpdateProcessorFactory.java:336) at org.apache.solr.handler.loader.JavabinLoader$1.update(JavabinLoader.java:98) at org.apache.solr.client.solrj.request.JavaBinUpdateRequestCodec$1.readOuterMostDocIterator(JavaBinUpdateRequestCodec.java:187) at org.apache.solr.client.solrj.request.JavaBinUpdateRequestCodec$1.readIterator(JavaBinUpdateRequestCodec.java:143) at org.apache.solr.common.util.JavaBinCodec.readObject(JavaBinCodec.java:313) at org.apache.solr.common.util.JavaBinCodec.readVal(JavaBinCodec.java:258) at org.apache.solr.client.solrj.request.JavaBinUpdateRequestCodec$1.readNamedList(JavaBinUpdateRequestCodec.java:129) at org.apache.solr.common.util.JavaBinCodec.readObject(JavaBinCodec.java:278) at org.apache.solr.common.util.JavaBinCodec.readVal(JavaBinCodec.java:258) at org.apache.solr.common.util.JavaBinCodec.unmarshal(JavaBinCodec.java:180) at org.apache.solr.client.solrj.request.JavaBinUpdateRequestCodec.unmarshal(JavaBinUpdateRequestCodec.java:194) at org.apache.solr.handler.loader.JavabinLoader.parseAndLoadDocs(JavabinLoader.java:108) at org.apache.solr.handler.loader.JavabinLoader.load(JavabinLoader.java:55) at org.apache.solr.handler.UpdateRequestHandler$1.load(UpdateRequestHandler.java:97) at org.apache.solr.handler.ContentStreamHandlerBase.handleRequestBody(ContentStreamHandlerBase.java:68) at org.apache.solr.handler.RequestHandlerBase.handleRequest(RequestHandlerBase.java:178) at org.apache.solr.core.SolrCore.execute(SolrCore.java:2486) at org.apache.solr.servlet.HttpSolrCall.execute(HttpSolrCall.java:722) at org.apache.solr.servlet.HttpSolrCall.call(HttpSolrCall.java:528) at org.apache.solr.servlet.SolrDispatchFilter.doFilter(SolrDispatchFilter.java:344) at org.apache.solr.servlet.SolrDispatchFilter.doFilter(SolrDispatchFilter.java:295) at org.eclipse.jetty.servlet.ServletHandler$CachedChain.doFilter(ServletHandler.java:1699) at org.apache.solr.client.solrj.embedded.JettySolrRunner$DebugFilter.doFilter(JettySolrRunner.java:139) at org.eclipse.jetty.servlet.ServletHandler$CachedChain.doFilter(ServletHandler.java:1699) at org.eclipse.jetty.servlet.ServletHandler.doHandle(ServletHandler.java:582) at org.eclipse.jetty.server.session.SessionHandler.doHandle(SessionHandler.java:224) at org.eclipse.jetty.server.handler.ContextHandler.doHandle(ContextHandler.java:1180) at org.eclipse.jetty.servlet.ServletHandler.doScope(ServletHandler.java:512) at org.eclipse.jetty.server.session.SessionHandler.doScope(SessionHandler.java:185) at org.eclipse.jetty.server.handler.ContextHandler.doScope(ContextHandler.java:1112) at org.eclipse.jetty.server.handler.ScopedHandler.handle(ScopedHandler.java:141) at org.eclipse.jetty.server.handler.gzip.GzipHandler.handle(GzipHandler.java:395) at org.eclipse.jetty.server.handler.HandlerWrapper.handle(HandlerWrapper.java:134) at org.eclipse.jetty.server.Server.handle(Server.java:534) at org.eclipse.jetty.server.HttpChannel.handle(HttpChannel.java:320) at org.eclipse.jetty.server.HttpConnection.onFillable(HttpConnection.java:251) at org.eclipse.jetty.io.AbstractConnection$ReadCallback.succeeded(AbstractConnection.java:273) at org.eclipse.jetty.io.FillInterest.fillable(FillInterest.java:95) at org.eclipse.jetty.io.SelectChannelEndPoint$2.run(SelectChannelEndPoint.java:93) at org.eclipse.jetty.util.thread.strategy.ExecuteProduceConsume.executeProduceConsume(ExecuteProduceConsume.java:303) at org.eclipse.jetty.util.thread.strategy.ExecuteProduceConsume.produceConsume(ExecuteProduceConsume.java:148) at org.eclipse.jetty.util.thread.strategy.ExecuteProduceConsume.run(ExecuteProduceConsume.java:136) at org.eclipse.jetty.util.thread.QueuedThreadPool.runJob(QueuedThreadPool.java:671) at org.eclipse.jetty.util.thread.QueuedThreadPool$2.run(QueuedThreadPool.java:589) at java.lang.Thread.run(Thread.java:745) org.apache.solr.common.util.ObjectReleaseTracker$ObjectTrackerException: org.apache.lucene.store.MockDirectoryWrapper at org.apache.solr.common.util.ObjectReleaseTracker.track(ObjectReleaseTracker.java:42) at org.apache.solr.core.CachingDirectoryFactory.get(CachingDirectoryFactory.java:347) at org.apache.solr.core.SolrCore.getNewIndexDir(SolrCore.java:360) at org.apache.solr.core.SolrCore.initIndex(SolrCore.java:720) at org.apache.solr.core.SolrCore.<init>(SolrCore.java:947) at org.apache.solr.core.SolrCore.<init>(SolrCore.java:854) at org.apache.solr.core.CoreContainer.create(CoreContainer.java:958) at org.apache.solr.core.CoreContainer.create(CoreContainer.java:893) at org.apache.solr.handler.admin.CoreAdminOperation.lambda$static$0(CoreAdminOperation.java:88) at org.apache.solr.handler.admin.CoreAdminOperation.execute(CoreAdminOperation.java:370) at org.apache.solr.handler.admin.CoreAdminHandler$CallInfo.call(CoreAdminHandler.java:388) at org.apache.solr.handler.admin.CoreAdminHandler.handleRequestBody(CoreAdminHandler.java:174) at org.apache.solr.handler.RequestHandlerBase.handleRequest(RequestHandlerBase.java:178) at org.apache.solr.servlet.HttpSolrCall.handleAdmin(HttpSolrCall.java:747) at org.apache.solr.servlet.HttpSolrCall.handleAdminRequest(HttpSolrCall.java:728) at org.apache.solr.servlet.HttpSolrCall.call(HttpSolrCall.java:509) at org.apache.solr.servlet.SolrDispatchFilter.doFilter(SolrDispatchFilter.java:344) at org.apache.solr.servlet.SolrDispatchFilter.doFilter(SolrDispatchFilter.java:295) at org.eclipse.jetty.servlet.ServletHandler$CachedChain.doFilter(ServletHandler.java:1699) at org.apache.solr.client.solrj.embedded.JettySolrRunner$DebugFilter.doFilter(JettySolrRunner.java:139) at org.eclipse.jetty.servlet.ServletHandler$CachedChain.doFilter(ServletHandler.java:1699) at org.eclipse.jetty.servlet.ServletHandler.doHandle(ServletHandler.java:582) at org.eclipse.jetty.server.session.SessionHandler.doHandle(SessionHandler.java:224) at org.eclipse.jetty.server.handler.ContextHandler.doHandle(ContextHandler.java:1180) at org.eclipse.jetty.servlet.ServletHandler.doScope(ServletHandler.java:512) at org.eclipse.jetty.server.session.SessionHandler.doScope(SessionHandler.java:185) at org.eclipse.jetty.server.handler.ContextHandler.doScope(ContextHandler.java:1112) at org.eclipse.jetty.server.handler.ScopedHandler.handle(ScopedHandler.java:141) at org.eclipse.jetty.server.handler.gzip.GzipHandler.handle(GzipHandler.java:395) at org.eclipse.jetty.server.handler.HandlerWrapper.handle(HandlerWrapper.java:134) at org.eclipse.jetty.server.Server.handle(Server.java:534) at org.eclipse.jetty.server.HttpChannel.handle(HttpChannel.java:320) at org.eclipse.jetty.server.HttpConnection.onFillable(HttpConnection.java:251) at org.eclipse.jetty.io.AbstractConnection$ReadCallback.succeeded(AbstractConnection.java:273) at org.eclipse.jetty.io.FillInterest.fillable(FillInterest.java:95) at org.eclipse.jetty.io.SelectChannelEndPoint$2.run(SelectChannelEndPoint.java:93) at org.eclipse.jetty.util.thread.strategy.ExecuteProduceConsume.executeProduceConsume(ExecuteProduceConsume.java:303) at org.eclipse.jetty.util.thread.strategy.ExecuteProduceConsume.produceConsume(ExecuteProduceConsume.java:148) at org.eclipse.jetty.util.thread.strategy.ExecuteProduceConsume.execute(ExecuteProduceConsume.java:100) at org.eclipse.jetty.io.ManagedSelector.run(ManagedSelector.java:147) at org.eclipse.jetty.util.thread.QueuedThreadPool.runJob(QueuedThreadPool.java:671) at org.eclipse.jetty.util.thread.QueuedThreadPool$2.run(QueuedThreadPool.java:589) at java.lang.Thread.run(Thread.java:745)
Stack Trace:
java.lang.AssertionError: ObjectTracker found 5 object(s) that were not released!!! [MockDirectoryWrapper, MockDirectoryWrapper, MDCAwareThreadPoolExecutor, TransactionLog, MockDirectoryWrapper]
org.apache.solr.common.util.ObjectReleaseTracker$ObjectTrackerException: org.apache.lucene.store.MockDirectoryWrapper
at org.apache.solr.common.util.ObjectReleaseTracker.track(ObjectReleaseTracker.java:42)
at org.apache.solr.core.CachingDirectoryFactory.get(CachingDirectoryFactory.java:347)
at org.apache.solr.update.SolrIndexWriter.create(SolrIndexWriter.java:92)
at org.apache.solr.core.SolrCore.initIndex(SolrCore.java:752)
at org.apache.solr.core.SolrCore.<init>(SolrCore.java:947)
at org.apache.solr.core.SolrCore.<init>(SolrCore.java:854)
at org.apache.solr.core.CoreContainer.create(CoreContainer.java:958)
at org.apache.solr.core.CoreContainer.create(CoreContainer.java:893)
at org.apache.solr.handler.admin.CoreAdminOperation.lambda$static$0(CoreAdminOperation.java:88)
at org.apache.solr.handler.admin.CoreAdminOperation.execute(CoreAdminOperation.java:370)
at org.apache.solr.handler.admin.CoreAdminHandler$CallInfo.call(CoreAdminHandler.java:388)
at org.apache.solr.handler.admin.CoreAdminHandler.handleRequestBody(CoreAdminHandler.java:174)
at org.apache.solr.handler.RequestHandlerBase.handleRequest(RequestHandlerBase.java:178)
at org.apache.solr.servlet.HttpSolrCall.handleAdmin(HttpSolrCall.java:747)
at org.apache.solr.servlet.HttpSolrCall.handleAdminRequest(HttpSolrCall.java:728)
at org.apache.solr.servlet.HttpSolrCall.call(HttpSolrCall.java:509)
at org.apache.solr.servlet.SolrDispatchFilter.doFilter(SolrDispatchFilter.java:344)
at org.apache.solr.servlet.SolrDispatchFilter.doFilter(SolrDispatchFilter.java:295)
at org.eclipse.jetty.servlet.ServletHandler$CachedChain.doFilter(ServletHandler.java:1699)
at org.apache.solr.client.solrj.embedded.JettySolrRunner$DebugFilter.doFilter(JettySolrRunner.java:139)
at org.eclipse.jetty.servlet.ServletHandler$CachedChain.doFilter(ServletHandler.java:1699)
at org.eclipse.jetty.servlet.ServletHandler.doHandle(ServletHandler.java:582)
at org.eclipse.jetty.server.session.SessionHandler.doHandle(SessionHandler.java:224)
at org.eclipse.jetty.server.handler.ContextHandler.doHandle(ContextHandler.java:1180)
at org.eclipse.jetty.servlet.ServletHandler.doScope(ServletHandler.java:512)
at org.eclipse.jetty.server.session.SessionHandler.doScope(SessionHandler.java:185)
at org.eclipse.jetty.server.handler.ContextHandler.doScope(ContextHandler.java:1112)
at org.eclipse.jetty.server.handler.ScopedHandler.handle(ScopedHandler.java:141)
at org.eclipse.jetty.server.handler.gzip.GzipHandler.handle(GzipHandler.java:395)
at org.eclipse.jetty.server.handler.HandlerWrapper.handle(HandlerWrapper.java:134)
at org.eclipse.jetty.server.Server.handle(Server.java:534)
at org.eclipse.jetty.server.HttpChannel.handle(HttpChannel.java:320)
at org.eclipse.jetty.server.HttpConnection.onFillable(HttpConnection.java:251)
at org.eclipse.jetty.io.AbstractConnection$ReadCallback.succeeded(AbstractConnection.java:273)
at org.eclipse.jetty.io.FillInterest.fillable(FillInterest.java:95)
at org.eclipse.jetty.io.SelectChannelEndPoint$2.run(SelectChannelEndPoint.java:93)
at org.eclipse.jetty.util.thread.strategy.ExecuteProduceConsume.executeProduceConsume(ExecuteProduceConsume.java:303)
at org.eclipse.jetty.util.thread.strategy.ExecuteProduceConsume.produceConsume(ExecuteProduceConsume.java:148)
at org.eclipse.jetty.util.thread.strategy.ExecuteProduceConsume.execute(ExecuteProduceConsume.java:100)
at org.eclipse.jetty.io.ManagedSelector.run(ManagedSelector.java:147)
at org.eclipse.jetty.util.thread.QueuedThreadPool.runJob(QueuedThreadPool.java:671)
at org.eclipse.jetty.util.thread.QueuedThreadPool$2.run(QueuedThreadPool.java:589)
at java.lang.Thread.run(Thread.java:745)
org.apache.solr.common.util.ObjectReleaseTracker$ObjectTrackerException: org.apache.lucene.store.MockDirectoryWrapper
at org.apache.solr.common.util.ObjectReleaseTracker.track(ObjectReleaseTracker.java:42)
at org.apache.solr.core.CachingDirectoryFactory.get(CachingDirectoryFactory.java:347)
at org.apache.solr.core.SolrCore.initSnapshotMetaDataManager(SolrCore.java:489)
at org.apache.solr.core.SolrCore.<init>(SolrCore.java:941)
at org.apache.solr.core.SolrCore.<init>(SolrCore.java:854)
at org.apache.solr.core.CoreContainer.create(CoreContainer.java:958)
at org.apache.solr.core.CoreContainer.create(CoreContainer.java:893)
at org.apache.solr.handler.admin.CoreAdminOperation.lambda$static$0(CoreAdminOperation.java:88)
at org.apache.solr.handler.admin.CoreAdminOperation.execute(CoreAdminOperation.java:370)
at org.apache.solr.handler.admin.CoreAdminHandler$CallInfo.call(CoreAdminHandler.java:388)
at org.apache.solr.handler.admin.CoreAdminHandler.handleRequestBody(CoreAdminHandler.java:174)
at org.apache.solr.handler.RequestHandlerBase.handleRequest(RequestHandlerBase.java:178)
at org.apache.solr.servlet.HttpSolrCall.handleAdmin(HttpSolrCall.java:747)
at org.apache.solr.servlet.HttpSolrCall.handleAdminRequest(HttpSolrCall.java:728)
at org.apache.solr.servlet.HttpSolrCall.call(HttpSolrCall.java:509)
at org.apache.solr.servlet.SolrDispatchFilter.doFilter(SolrDispatchFilter.java:344)
at org.apache.solr.servlet.SolrDispatchFilter.doFilter(SolrDispatchFilter.java:295)
at org.eclipse.jetty.servlet.ServletHandler$CachedChain.doFilter(ServletHandler.java:1699)
at org.apache.solr.client.solrj.embedded.JettySolrRunner$DebugFilter.doFilter(JettySolrRunner.java:139)
at org.eclipse.jetty.servlet.ServletHandler$CachedChain.doFilter(ServletHandler.java:1699)
at org.eclipse.jetty.servlet.ServletHandler.doHandle(ServletHandler.java:582)
at org.eclipse.jetty.server.session.SessionHandler.doHandle(SessionHandler.java:224)
at org.eclipse.jetty.server.handler.ContextHandler.doHandle(ContextHandler.java:1180)
at org.eclipse.jetty.servlet.ServletHandler.doScope(ServletHandler.java:512)
at org.eclipse.jetty.server.session.SessionHandler.doScope(SessionHandler.java:185)
at org.eclipse.jetty.server.handler.ContextHandler.doScope(ContextHandler.java:1112)
at org.eclipse.jetty.server.handler.ScopedHandler.handle(ScopedHandler.java:141)
at org.eclipse.jetty.server.handler.gzip.GzipHandler.handle(GzipHandler.java:395)
at org.eclipse.jetty.server.handler.HandlerWrapper.handle(HandlerWrapper.java:134)
at org.eclipse.jetty.server.Server.handle(Server.java:534)
at org.eclipse.jetty.server.HttpChannel.handle(HttpChannel.java:320)
at org.eclipse.jetty.server.HttpConnection.onFillable(HttpConnection.java:251)
at org.eclipse.jetty.io.AbstractConnection$ReadCallback.succeeded(AbstractConnection.java:273)
at org.eclipse.jetty.io.FillInterest.fillable(FillInterest.java:95)
at org.eclipse.jetty.io.SelectChannelEndPoint$2.run(SelectChannelEndPoint.java:93)
at org.eclipse.jetty.util.thread.strategy.ExecuteProduceConsume.executeProduceConsume(ExecuteProduceConsume.java:303)
at org.eclipse.jetty.util.thread.strategy.ExecuteProduceConsume.produceConsume(ExecuteProduceConsume.java:148)
at org.eclipse.jetty.util.thread.strategy.ExecuteProduceConsume.execute(ExecuteProduceConsume.java:100)
at org.eclipse.jetty.io.ManagedSelector.run(ManagedSelector.java:147)
at org.eclipse.jetty.util.thread.QueuedThreadPool.runJob(QueuedThreadPool.java:671)
at org.eclipse.jetty.util.thread.QueuedThreadPool$2.run(QueuedThreadPool.java:589)
at java.lang.Thread.run(Thread.java:745)
org.apache.solr.common.util.ObjectReleaseTracker$ObjectTrackerException: org.apache.solr.common.util.ExecutorUtil$MDCAwareThreadPoolExecutor
at org.apache.solr.common.util.ObjectReleaseTracker.track(ObjectReleaseTracker.java:42)
at org.apache.solr.core.SolrCore.<init>(SolrCore.java:883)
at org.apache.solr.core.SolrCore.reload(SolrCore.java:647)
at org.apache.solr.core.CoreContainer.reload(CoreContainer.java:1154)
at org.apache.solr.core.SolrCore.lambda$getConfListener$18(SolrCore.java:2949)
at org.apache.solr.handler.SolrConfigHandler$Command.lambda$handleGET$0(SolrConfigHandler.java:225)
at java.lang.Thread.run(Thread.java:745)
org.apache.solr.common.util.ObjectReleaseTracker$ObjectTrackerException: org.apache.solr.update.TransactionLog
at org.apache.solr.common.util.ObjectReleaseTracker.track(ObjectReleaseTracker.java:42)
at org.apache.solr.update.TransactionLog.<init>(TransactionLog.java:190)
at org.apache.solr.update.UpdateLog.newTransactionLog(UpdateLog.java:438)
at org.apache.solr.update.UpdateLog.ensureLog(UpdateLog.java:1250)
at org.apache.solr.update.UpdateLog.add(UpdateLog.java:524)
at org.apache.solr.update.UpdateLog.add(UpdateLog.java:509)
at org.apache.solr.update.DirectUpdateHandler2.doNormalUpdate(DirectUpdateHandler2.java:348)
at org.apache.solr.update.DirectUpdateHandler2.addDoc0(DirectUpdateHandler2.java:267)
at org.apache.solr.update.DirectUpdateHandler2.addDoc(DirectUpdateHandler2.java:217)
at org.apache.solr.update.processor.RunUpdateProcessor.processAdd(RunUpdateProcessorFactory.java:67)
at org.apache.solr.update.processor.UpdateRequestProcessor.processAdd(UpdateRequestProcessor.java:55)
at org.apache.solr.update.processor.DistributedUpdateProcessor.doLocalAdd(DistributedUpdateProcessor.java:991)
at org.apache.solr.update.processor.DistributedUpdateProcessor.versionAdd(DistributedUpdateProcessor.java:1207)
at org.apache.solr.update.processor.DistributedUpdateProcessor.processAdd(DistributedUpdateProcessor.java:753)
at org.apache.solr.update.processor.LogUpdateProcessorFactory$LogUpdateProcessor.processAdd(LogUpdateProcessorFactory.java:103)
at org.apache.solr.update.processor.UpdateRequestProcessor.processAdd(UpdateRequestProcessor.java:55)
at org.apache.solr.update.processor.AddSchemaFieldsUpdateProcessorFactory$AddSchemaFieldsUpdateProcessor.processAdd(AddSchemaFieldsUpdateProcessorFactory.java:336)
at org.apache.solr.handler.loader.JavabinLoader$1.update(JavabinLoader.java:98)
at org.apache.solr.client.solrj.request.JavaBinUpdateRequestCodec$1.readOuterMostDocIterator(JavaBinUpdateRequestCodec.java:187)
at org.apache.solr.client.solrj.request.JavaBinUpdateRequestCodec$1.readIterator(JavaBinUpdateRequestCodec.java:143)
at org.apache.solr.common.util.JavaBinCodec.readObject(JavaBinCodec.java:313)
at org.apache.solr.common.util.JavaBinCodec.readVal(JavaBinCodec.java:258)
at org.apache.solr.client.solrj.request.JavaBinUpdateRequestCodec$1.readNamedList(JavaBinUpdateRequestCodec.java:129)
at org.apache.solr.common.util.JavaBinCodec.readObject(JavaBinCodec.java:278)
at org.apache.solr.common.util.JavaBinCodec.readVal(JavaBinCodec.java:258)
at org.apache.solr.common.util.JavaBinCodec.unmarshal(JavaBinCodec.java:180)
at org.apache.solr.client.solrj.request.JavaBinUpdateRequestCodec.unmarshal(JavaBinUpdateRequestCodec.java:194)
at org.apache.solr.handler.loader.JavabinLoader.parseAndLoadDocs(JavabinLoader.java:108)
at org.apache.solr.handler.loader.JavabinLoader.load(JavabinLoader.java:55)
at org.apache.solr.handler.UpdateRequestHandler$1.load(UpdateRequestHandler.java:97)
at org.apache.solr.handler.ContentStreamHandlerBase.handleRequestBody(ContentStreamHandlerBase.java:68)
at org.apache.solr.handler.RequestHandlerBase.handleRequest(RequestHandlerBase.java:178)
at org.apache.solr.core.SolrCore.execute(SolrCore.java:2486)
at org.apache.solr.servlet.HttpSolrCall.execute(HttpSolrCall.java:722)
at org.apache.solr.servlet.HttpSolrCall.call(HttpSolrCall.java:528)
at org.apache.solr.servlet.SolrDispatchFilter.doFilter(SolrDispatchFilter.java:344)
at org.apache.solr.servlet.SolrDispatchFilter.doFilter(SolrDispatchFilter.java:295)
at org.eclipse.jetty.servlet.ServletHandler$CachedChain.doFilter(ServletHandler.java:1699)
at org.apache.solr.client.solrj.embedded.JettySolrRunner$DebugFilter.doFilter(JettySolrRunner.java:139)
at org.eclipse.jetty.servlet.ServletHandler$CachedChain.doFilter(ServletHandler.java:1699)
at org.eclipse.jetty.servlet.ServletHandler.doHandle(ServletHandler.java:582)
at org.eclipse.jetty.server.session.SessionHandler.doHandle(SessionHandler.java:224)
at org.eclipse.jetty.server.handler.ContextHandler.doHandle(ContextHandler.java:1180)
at org.eclipse.jetty.servlet.ServletHandler.doScope(ServletHandler.java:512)
at org.eclipse.jetty.server.session.SessionHandler.doScope(SessionHandler.java:185)
at org.eclipse.jetty.server.handler.ContextHandler.doScope(ContextHandler.java:1112)
at org.eclipse.jetty.server.handler.ScopedHandler.handle(ScopedHandler.java:141)
at org.eclipse.jetty.server.handler.gzip.GzipHandler.handle(GzipHandler.java:395)
at org.eclipse.jetty.server.handler.HandlerWrapper.handle(HandlerWrapper.java:134)
at org.eclipse.jetty.server.Server.handle(Server.java:534)
at org.eclipse.jetty.server.HttpChannel.handle(HttpChannel.java:320)
at org.eclipse.jetty.server.HttpConnection.onFillable(HttpConnection.java:251)
at org.eclipse.jetty.io.AbstractConnection$ReadCallback.succeeded(AbstractConnection.java:273)
at org.eclipse.jetty.io.FillInterest.fillable(FillInterest.java:95)
at org.eclipse.jetty.io.SelectChannelEndPoint$2.run(SelectChannelEndPoint.java:93)
at org.eclipse.jetty.util.thread.strategy.ExecuteProduceConsume.executeProduceConsume(ExecuteProduceConsume.java:303)
at org.eclipse.jetty.util.thread.strategy.ExecuteProduceConsume.produceConsume(ExecuteProduceConsume.java:148)
at org.eclipse.jetty.util.thread.strategy.ExecuteProduceConsume.run(ExecuteProduceConsume.java:136)
at org.eclipse.jetty.util.thread.QueuedThreadPool.runJob(QueuedThreadPool.java:671)
at org.eclipse.jetty.util.thread.QueuedThreadPool$2.run(QueuedThreadPool.java:589)
at java.lang.Thread.run(Thread.java:745)
org.apache.solr.common.util.ObjectReleaseTracker$ObjectTrackerException: org.apache.lucene.store.MockDirectoryWrapper
at org.apache.solr.common.util.ObjectReleaseTracker.track(ObjectReleaseTracker.java:42)
at org.apache.solr.core.CachingDirectoryFactory.get(CachingDirectoryFactory.java:347)
at org.apache.solr.core.SolrCore.getNewIndexDir(SolrCore.java:360)
at org.apache.solr.core.SolrCore.initIndex(SolrCore.java:720)
at org.apache.solr.core.SolrCore.<init>(SolrCore.java:947)
at org.apache.solr.core.SolrCore.<init>(SolrCore.java:854)
at org.apache.solr.core.CoreContainer.create(CoreContainer.java:958)
at org.apache.solr.core.CoreContainer.create(CoreContainer.java:893)
at org.apache.solr.handler.admin.CoreAdminOperation.lambda$static$0(CoreAdminOperation.java:88)
at org.apache.solr.handler.admin.CoreAdminOperation.execute(CoreAdminOperation.java:370)
at org.apache.solr.handler.admin.CoreAdminHandler$CallInfo.call(CoreAdminHandler.java:388)
at org.apache.solr.handler.admin.CoreAdminHandler.handleRequestBody(CoreAdminHandler.java:174)
at org.apache.solr.handler.RequestHandlerBase.handleRequest(RequestHandlerBase.java:178)
at org.apache.solr.servlet.HttpSolrCall.handleAdmin(HttpSolrCall.java:747)
at org.apache.solr.servlet.HttpSolrCall.handleAdminRequest(HttpSolrCall.java:728)
at org.apache.solr.servlet.HttpSolrCall.call(HttpSolrCall.java:509)
at org.apache.solr.servlet.SolrDispatchFilter.doFilter(SolrDispatchFilter.java:344)
at org.apache.solr.servlet.SolrDispatchFilter.doFilter(SolrDispatchFilter.java:295)
at org.eclipse.jetty.servlet.ServletHandler$CachedChain.doFilter(ServletHandler.java:1699)
at org.apache.solr.client.solrj.embedded.JettySolrRunner$DebugFilter.doFilter(JettySolrRunner.java:139)
at org.eclipse.jetty.servlet.ServletHandler$CachedChain.doFilter(ServletHandler.java:1699)
at org.eclipse.jetty.servlet.ServletHandler.doHandle(ServletHandler.java:582)
at org.eclipse.jetty.server.session.SessionHandler.doHandle(SessionHandler.java:224)
at org.eclipse.jetty.server.handler.ContextHandler.doHandle(ContextHandler.java:1180)
at org.eclipse.jetty.servlet.ServletHandler.doScope(ServletHandler.java:512)
at org.eclipse.jetty.server.session.SessionHandler.doScope(SessionHandler.java:185)
at org.eclipse.jetty.server.handler.ContextHandler.doScope(ContextHandler.java:1112)
at org.eclipse.jetty.server.handler.ScopedHandler.handle(ScopedHandler.java:141)
at org.eclipse.jetty.server.handler.gzip.GzipHandler.handle(GzipHandler.java:395)
at org.eclipse.jetty.server.handler.HandlerWrapper.handle(HandlerWrapper.java:134)
at org.eclipse.jetty.server.Server.handle(Server.java:534)
at org.eclipse.jetty.server.HttpChannel.handle(HttpChannel.java:320)
at org.eclipse.jetty.server.HttpConnection.onFillable(HttpConnection.java:251)
at org.eclipse.jetty.io.AbstractConnection$ReadCallback.succeeded(AbstractConnection.java:273)
at org.eclipse.jetty.io.FillInterest.fillable(FillInterest.java:95)
at org.eclipse.jetty.io.SelectChannelEndPoint$2.run(SelectChannelEndPoint.java:93)
at org.eclipse.jetty.util.thread.strategy.ExecuteProduceConsume.executeProduceConsume(ExecuteProduceConsume.java:303)
at org.eclipse.jetty.util.thread.strategy.ExecuteProduceConsume.produceConsume(ExecuteProduceConsume.java:148)
at org.eclipse.jetty.util.thread.strategy.ExecuteProduceConsume.execute(ExecuteProduceConsume.java:100)
at org.eclipse.jetty.io.ManagedSelector.run(ManagedSelector.java:147)
at org.eclipse.jetty.util.thread.QueuedThreadPool.runJob(QueuedThreadPool.java:671)
at org.eclipse.jetty.util.thread.QueuedThreadPool$2.run(QueuedThreadPool.java:589)
at java.lang.Thread.run(Thread.java:745)
at __randomizedtesting.SeedInfo.seed([8DA550B5CEC3697B]:0)
at org.junit.Assert.fail(Assert.java:93)
at org.junit.Assert.assertTrue(Assert.java:43)
at org.junit.Assert.assertNull(Assert.java:551)
at org.apache.solr.SolrTestCaseJ4.teardownTestCases(SolrTestCaseJ4.java:302)
at sun.reflect.NativeMethodAccessorImpl.invoke0(Native Method)
at sun.reflect.NativeMethodAccessorImpl.invoke(NativeMethodAccessorImpl.java:62)
at sun.reflect.DelegatingMethodAccessorImpl.invoke(DelegatingMethodAccessorImpl.java:43)
at java.lang.reflect.Method.invoke(Method.java:498)
at com.carrotsearch.randomizedtesting.RandomizedRunner.invoke(RandomizedRunner.java:1713)
at com.carrotsearch.randomizedtesting.RandomizedRunner$7.evaluate(RandomizedRunner.java:870)
at com.carrotsearch.randomizedtesting.rules.StatementAdapter.evaluate(StatementAdapter.java:36)
at com.carrotsearch.randomizedtesting.rules.SystemPropertiesRestoreRule$1.evaluate(SystemPropertiesRestoreRule.java:57)
at org.apache.lucene.util.AbstractBeforeAfterRule$1.evaluate(AbstractBeforeAfterRule.java:45)
at com.carrotsearch.randomizedtesting.rules.StatementAdapter.evaluate(StatementAdapter.java:36)
at org.apache.lucene.util.TestRuleStoreClassName$1.evaluate(TestRuleStoreClassName.java:41)
at com.carrotsearch.randomizedtesting.rules.NoShadowingOrOverridesOnMethodsRule$1.evaluate(NoShadowingOrOverridesOnMethodsRule.java:40)
at com.carrotsearch.randomizedtesting.rules.NoShadowingOrOverridesOnMethodsRule$1.evaluate(NoShadowingOrOverridesOnMethodsRule.java:40)
at com.carrotsearch.randomizedtesting.rules.StatementAdapter.evaluate(StatementAdapter.java:36)
at com.carrotsearch.randomizedtesting.rules.StatementAdapter.evaluate(StatementAdapter.java:36)
at com.carrotsearch.randomizedtesting.rules.StatementAdapter.evaluate(StatementAdapter.java:36)
at org.apache.lucene.util.TestRuleAssertionsRequired$1.evaluate(TestRuleAssertionsRequired.java:53)
at org.apache.lucene.util.TestRuleMarkFailure$1.evaluate(TestRuleMarkFailure.java:47)
at org.apache.lucene.util.TestRuleIgnoreAfterMaxFailures$1.evaluate(TestRuleIgnoreAfterMaxFailures.java:64)
at org.apache.lucene.util.TestRuleIgnoreTestSuites$1.evaluate(TestRuleIgnoreTestSuites.java:54)
at com.carrotsearch.randomizedtesting.rules.StatementAdapter.evaluate(StatementAdapter.java:36)
at com.carrotsearch.randomizedtesting.ThreadLeakControl$StatementRunner.run(ThreadLeakControl.java:368)
at java.lang.Thread.run(Thread.java:745)
FAILED: org.apache.solr.handler.admin.StatsReloadRaceTest.testParallelReloadAndStats
Error Message:
Key SEARCHER.searcher.indexVersion not found in registry solr.core.collection1
Stack Trace:
java.lang.AssertionError: Key SEARCHER.searcher.indexVersion not found in registry solr.core.collection1
at __randomizedtesting.SeedInfo.seed([8DA550B5CEC3697B:423B358C41320124]:0)
at org.junit.Assert.fail(Assert.java:93)
at org.junit.Assert.assertTrue(Assert.java:43)
at org.apache.solr.handler.admin.StatsReloadRaceTest.requestMetrics(StatsReloadRaceTest.java:132)
at org.apache.solr.handler.admin.StatsReloadRaceTest.testParallelReloadAndStats(StatsReloadRaceTest.java:70)
at sun.reflect.NativeMethodAccessorImpl.invoke0(Native Method)
at sun.reflect.NativeMethodAccessorImpl.invoke(NativeMethodAccessorImpl.java:62)
at sun.reflect.DelegatingMethodAccessorImpl.invoke(DelegatingMethodAccessorImpl.java:43)
at java.lang.reflect.Method.invoke(Method.java:498)
at com.carrotsearch.randomizedtesting.RandomizedRunner.invoke(RandomizedRunner.java:1713)
at com.carrotsearch.randomizedtesting.RandomizedRunner$8.evaluate(RandomizedRunner.java:907)
at com.carrotsearch.randomizedtesting.RandomizedRunner$9.evaluate(RandomizedRunner.java:943)
at com.carrotsearch.randomizedtesting.RandomizedRunner$10.evaluate(RandomizedRunner.java:957)
at com.carrotsearch.randomizedtesting.rules.SystemPropertiesRestoreRule$1.evaluate(SystemPropertiesRestoreRule.java:57)
at org.apache.lucene.util.TestRuleSetupTeardownChained$1.evaluate(TestRuleSetupTeardownChained.java:49)
at org.apache.lucene.util.AbstractBeforeAfterRule$1.evaluate(AbstractBeforeAfterRule.java:45)
at org.apache.lucene.util.TestRuleThreadAndTestName$1.evaluate(TestRuleThreadAndTestName.java:48)
at org.apache.lucene.util.TestRuleIgnoreAfterMaxFailures$1.evaluate(TestRuleIgnoreAfterMaxFailures.java:64)
at org.apache.lucene.util.TestRuleMarkFailure$1.evaluate(TestRuleMarkFailure.java:47)
at com.carrotsearch.randomizedtesting.rules.StatementAdapter.evaluate(StatementAdapter.java:36)
at com.carrotsearch.randomizedtesting.ThreadLeakControl$StatementRunner.run(ThreadLeakControl.java:368)
at com.carrotsearch.randomizedtesting.ThreadLeakControl.forkTimeoutingTask(ThreadLeakControl.java:817)
at com.carrotsearch.randomizedtesting.ThreadLeakControl$3.evaluate(ThreadLeakControl.java:468)
at com.carrotsearch.randomizedtesting.RandomizedRunner.runSingleTest(RandomizedRunner.java:916)
at com.carrotsearch.randomizedtesting.RandomizedRunner$5.evaluate(RandomizedRunner.java:802)
at com.carrotsearch.randomizedtesting.RandomizedRunner$6.evaluate(RandomizedRunner.java:852)
at com.carrotsearch.randomizedtesting.RandomizedRunner$7.evaluate(RandomizedRunner.java:863)
at com.carrotsearch.randomizedtesting.rules.StatementAdapter.evaluate(StatementAdapter.java:36)
at com.carrotsearch.randomizedtesting.rules.SystemPropertiesRestoreRule$1.evaluate(SystemPropertiesRestoreRule.java:57)
at org.apache.lucene.util.AbstractBeforeAfterRule$1.evaluate(AbstractBeforeAfterRule.java:45)
at com.carrotsearch.randomizedtesting.rules.StatementAdapter.evaluate(StatementAdapter.java:36)
at org.apache.lucene.util.TestRuleStoreClassName$1.evaluate(TestRuleStoreClassName.java:41)
at com.carrotsearch.randomizedtesting.rules.NoShadowingOrOverridesOnMethodsRule$1.evaluate(NoShadowingOrOverridesOnMethodsRule.java:40)
at com.carrotsearch.randomizedtesting.rules.NoShadowingOrOverridesOnMethodsRule$1.evaluate(NoShadowingOrOverridesOnMethodsRule.java:40)
at com.carrotsearch.randomizedtesting.rules.StatementAdapter.evaluate(StatementAdapter.java:36)
at com.carrotsearch.randomizedtesting.rules.StatementAdapter.evaluate(StatementAdapter.java:36)
at com.carrotsearch.randomizedtesting.rules.StatementAdapter.evaluate(StatementAdapter.java:36)
at org.apache.lucene.util.TestRuleAssertionsRequired$1.evaluate(TestRuleAssertionsRequired.java:53)
at org.apache.lucene.util.TestRuleMarkFailure$1.evaluate(TestRuleMarkFailure.java:47)
at org.apache.lucene.util.TestRuleIgnoreAfterMaxFailures$1.evaluate(TestRuleIgnoreAfterMaxFailures.java:64)
at org.apache.lucene.util.TestRuleIgnoreTestSuites$1.evaluate(TestRuleIgnoreTestSuites.java:54)
at com.carrotsearch.randomizedtesting.rules.StatementAdapter.evaluate(StatementAdapter.java:36)
at com.carrotsearch.randomizedtesting.ThreadLeakControl$StatementRunner.run(ThreadLeakControl.java:368)
at java.lang.Thread.run(Thread.java:745)
Build Log:
[...truncated 11010 lines...]
[junit4] Suite: org.apache.solr.cloud.SolrCloudExampleTest
[junit4] 2> Creating dataDir: /home/jenkins/workspace/Lucene-Solr-master-Linux/solr/build/solr-core/test/J2/temp/solr.cloud.SolrCloudExampleTest_8DA550B5CEC3697B-001/init-core-data-001
[junit4] 2> 44645 WARN (SUITE-SolrCloudExampleTest-seed#[8DA550B5CEC3697B]-worker) [ ] o.a.s.SolrTestCaseJ4 startTrackingSearchers: numOpens=7 numCloses=7
[junit4] 2> 44646 INFO (SUITE-SolrCloudExampleTest-seed#[8DA550B5CEC3697B]-worker) [ ] o.a.s.SolrTestCaseJ4 Using PointFields
[junit4] 2> 44650 INFO (SUITE-SolrCloudExampleTest-seed#[8DA550B5CEC3697B]-worker) [ ] o.a.s.SolrTestCaseJ4 Randomized ssl (false) and clientAuth (false) via: @org.apache.solr.util.RandomizeSSL(reason=, value=NaN, ssl=NaN, clientAuth=NaN)
[junit4] 2> 44650 INFO (SUITE-SolrCloudExampleTest-seed#[8DA550B5CEC3697B]-worker) [ ] o.a.s.BaseDistributedSearchTestCase Setting hostContext system property: /
[junit4] 2> 44654 INFO (TEST-SolrCloudExampleTest.testLoadDocsIntoGettingStartedCollection-seed#[8DA550B5CEC3697B]) [ ] o.a.s.c.ZkTestServer STARTING ZK TEST SERVER
[junit4] 2> 44664 INFO (Thread-55) [ ] o.a.s.c.ZkTestServer client port:0.0.0.0/0.0.0.0:0
[junit4] 2> 44664 INFO (Thread-55) [ ] o.a.s.c.ZkTestServer Starting server
[junit4] 2> 44764 INFO (TEST-SolrCloudExampleTest.testLoadDocsIntoGettingStartedCollection-seed#[8DA550B5CEC3697B]) [ ] o.a.s.c.ZkTestServer start zk server on port:35697
[junit4] 2> 44792 INFO (TEST-SolrCloudExampleTest.testLoadDocsIntoGettingStartedCollection-seed#[8DA550B5CEC3697B]) [ ] o.a.s.c.AbstractZkTestCase put /home/jenkins/workspace/Lucene-Solr-master-Linux/solr/core/src/test-files/solr/collection1/conf/solrconfig-tlog.xml to /configs/conf1/solrconfig.xml
[junit4] 2> 44794 INFO (TEST-SolrCloudExampleTest.testLoadDocsIntoGettingStartedCollection-seed#[8DA550B5CEC3697B]) [ ] o.a.s.c.AbstractZkTestCase put /home/jenkins/workspace/Lucene-Solr-master-Linux/solr/core/src/test-files/solr/collection1/conf/schema.xml to /configs/conf1/schema.xml
[junit4] 2> 44796 INFO (TEST-SolrCloudExampleTest.testLoadDocsIntoGettingStartedCollection-seed#[8DA550B5CEC3697B]) [ ] o.a.s.c.AbstractZkTestCase put /home/jenkins/workspace/Lucene-Solr-master-Linux/solr/core/src/test-files/solr/collection1/conf/solrconfig.snippet.randomindexconfig.xml to /configs/conf1/solrconfig.snippet.randomindexconfig.xml
[junit4] 2> 44797 INFO (TEST-SolrCloudExampleTest.testLoadDocsIntoGettingStartedCollection-seed#[8DA550B5CEC3697B]) [ ] o.a.s.c.AbstractZkTestCase put /home/jenkins/workspace/Lucene-Solr-master-Linux/solr/core/src/test-files/solr/collection1/conf/stopwords.txt to /configs/conf1/stopwords.txt
[junit4] 2> 44798 INFO (TEST-SolrCloudExampleTest.testLoadDocsIntoGettingStartedCollection-seed#[8DA550B5CEC3697B]) [ ] o.a.s.c.AbstractZkTestCase put /home/jenkins/workspace/Lucene-Solr-master-Linux/solr/core/src/test-files/solr/collection1/conf/protwords.txt to /configs/conf1/protwords.txt
[junit4] 2> 44799 INFO (TEST-SolrCloudExampleTest.testLoadDocsIntoGettingStartedCollection-seed#[8DA550B5CEC3697B]) [ ] o.a.s.c.AbstractZkTestCase put /home/jenkins/workspace/Lucene-Solr-master-Linux/solr/core/src/test-files/solr/collection1/conf/currency.xml to /configs/conf1/currency.xml
[junit4] 2> 44801 INFO (TEST-SolrCloudExampleTest.testLoadDocsIntoGettingStartedCollection-seed#[8DA550B5CEC3697B]) [ ] o.a.s.c.AbstractZkTestCase put /home/jenkins/workspace/Lucene-Solr-master-Linux/solr/core/src/test-files/solr/collection1/conf/enumsConfig.xml to /configs/conf1/enumsConfig.xml
[junit4] 2> 44801 INFO (TEST-SolrCloudExampleTest.testLoadDocsIntoGettingStartedCollection-seed#[8DA550B5CEC3697B]) [ ] o.a.s.c.AbstractZkTestCase put /home/jenkins/workspace/Lucene-Solr-master-Linux/solr/core/src/test-files/solr/collection1/conf/open-exchange-rates.json to /configs/conf1/open-exchange-rates.json
[junit4] 2> 44803 INFO (TEST-SolrCloudExampleTest.testLoadDocsIntoGettingStartedCollection-seed#[8DA550B5CEC3697B]) [ ] o.a.s.c.AbstractZkTestCase put /home/jenkins/workspace/Lucene-Solr-master-Linux/solr/core/src/test-files/solr/collection1/conf/mapping-ISOLatin1Accent.txt to /configs/conf1/mapping-ISOLatin1Accent.txt
[junit4] 2> 44804 INFO (TEST-SolrCloudExampleTest.testLoadDocsIntoGettingStartedCollection-seed#[8DA550B5CEC3697B]) [ ] o.a.s.c.AbstractZkTestCase put /home/jenkins/workspace/Lucene-Solr-master-Linux/solr/core/src/test-files/solr/collection1/conf/old_synonyms.txt to /configs/conf1/old_synonyms.txt
[junit4] 2> 44805 INFO (TEST-SolrCloudExampleTest.testLoadDocsIntoGettingStartedCollection-seed#[8DA550B5CEC3697B]) [ ] o.a.s.c.AbstractZkTestCase put /home/jenkins/workspace/Lucene-Solr-master-Linux/solr/core/src/test-files/solr/collection1/conf/synonyms.txt to /configs/conf1/synonyms.txt
[junit4] 2> 44925 INFO (TEST-SolrCloudExampleTest.testLoadDocsIntoGettingStartedCollection-seed#[8DA550B5CEC3697B]) [ ] o.a.s.SolrTestCaseJ4 Writing core.properties file to /home/jenkins/workspace/Lucene-Solr-master-Linux/solr/build/solr-core/test/J2/temp/solr.cloud.SolrCloudExampleTest_8DA550B5CEC3697B-001/control-001/cores/collection1
[junit4] 2> 44928 INFO (TEST-SolrCloudExampleTest.testLoadDocsIntoGettingStartedCollection-seed#[8DA550B5CEC3697B]) [ ] o.e.j.s.Server jetty-9.3.14.v20161028
[junit4] 2> 44929 INFO (TEST-SolrCloudExampleTest.testLoadDocsIntoGettingStartedCollection-seed#[8DA550B5CEC3697B]) [ ] o.e.j.s.h.ContextHandler Started o.e.j.s.ServletContextHandler@24c7d1a6{/,null,AVAILABLE}
[junit4] 2> 44942 INFO (TEST-SolrCloudExampleTest.testLoadDocsIntoGettingStartedCollection-seed#[8DA550B5CEC3697B]) [ ] o.e.j.s.AbstractConnector Started ServerConnector@530e523c{HTTP/1.1,[http/1.1]}{127.0.0.1:36056}
[junit4] 2> 44942 INFO (TEST-SolrCloudExampleTest.testLoadDocsIntoGettingStartedCollection-seed#[8DA550B5CEC3697B]) [ ] o.e.j.s.Server Started @47012ms
[junit4] 2> 44942 INFO (TEST-SolrCloudExampleTest.testLoadDocsIntoGettingStartedCollection-seed#[8DA550B5CEC3697B]) [ ] o.a.s.c.s.e.JettySolrRunner Jetty properties: {solr.data.dir=/home/jenkins/workspace/Lucene-Solr-master-Linux/solr/build/solr-core/test/J2/temp/solr.cloud.SolrCloudExampleTest_8DA550B5CEC3697B-001/tempDir-001/control/data, hostContext=/, hostPort=36056, coreRootDirectory=/home/jenkins/workspace/Lucene-Solr-master-Linux/solr/build/solr-core/test/J2/../../../../../../../../../home/jenkins/workspace/Lucene-Solr-master-Linux/solr/build/solr-core/test/J2/temp/solr.cloud.SolrCloudExampleTest_8DA550B5CEC3697B-001/control-001/cores}
[junit4] 2> 44943 ERROR (TEST-SolrCloudExampleTest.testLoadDocsIntoGettingStartedCollection-seed#[8DA550B5CEC3697B]) [ ] o.a.s.s.StartupLoggingUtils Missing Java Option solr.log.dir. Logging may be missing or incomplete.
[junit4] 2> 44943 INFO (TEST-SolrCloudExampleTest.testLoadDocsIntoGettingStartedCollection-seed#[8DA550B5CEC3697B]) [ ] o.a.s.s.SolrDispatchFilter ___ _ Welcome to Apache Solr? version 7.0.0
[junit4] 2> 44943 INFO (TEST-SolrCloudExampleTest.testLoadDocsIntoGettingStartedCollection-seed#[8DA550B5CEC3697B]) [ ] o.a.s.s.SolrDispatchFilter / __| ___| |_ _ Starting in cloud mode on port null
[junit4] 2> 44943 INFO (TEST-SolrCloudExampleTest.testLoadDocsIntoGettingStartedCollection-seed#[8DA550B5CEC3697B]) [ ] o.a.s.s.SolrDispatchFilter \__ \/ _ \ | '_| Install dir: null
[junit4] 2> 44945 INFO (TEST-SolrCloudExampleTest.testLoadDocsIntoGettingStartedCollection-seed#[8DA550B5CEC3697B]) [ ] o.a.s.s.SolrDispatchFilter |___/\___/_|_| Start time: 2017-04-17T03:58:16.798Z
[junit4] 2> 44965 INFO (TEST-SolrCloudExampleTest.testLoadDocsIntoGettingStartedCollection-seed#[8DA550B5CEC3697B]) [ ] o.a.s.s.SolrDispatchFilter Loading solr.xml from SolrHome (not found in ZooKeeper)
[junit4] 2> 44966 INFO (TEST-SolrCloudExampleTest.testLoadDocsIntoGettingStartedCollection-seed#[8DA550B5CEC3697B]) [ ] o.a.s.c.SolrXmlConfig Loading container configuration from /home/jenkins/workspace/Lucene-Solr-master-Linux/solr/build/solr-core/test/J2/temp/solr.cloud.SolrCloudExampleTest_8DA550B5CEC3697B-001/control-001/solr.xml
[junit4] 2> 44973 INFO (TEST-SolrCloudExampleTest.testLoadDocsIntoGettingStartedCollection-seed#[8DA550B5CEC3697B]) [ ] o.a.s.c.SolrXmlConfig MBean server found: com.sun.jmx.mbeanserver.JmxMBeanServer@7e1e3324, but no JMX reporters were configured - adding default JMX reporter.
[junit4] 2> 44977 INFO (TEST-SolrCloudExampleTest.testLoadDocsIntoGettingStartedCollection-seed#[8DA550B5CEC3697B]) [ ] o.a.s.c.ZkContainer Zookeeper client=127.0.0.1:35697/solr
[junit4] 2> 45024 INFO (TEST-SolrCloudExampleTest.testLoadDocsIntoGettingStartedCollection-seed#[8DA550B5CEC3697B]) [n:127.0.0.1:36056_ ] o.a.s.c.Overseer Overseer (id=null) closing
[junit4] 2> 45024 INFO (TEST-SolrCloudExampleTest.testLoadDocsIntoGettingStartedCollection-seed#[8DA550B5CEC3697B]) [n:127.0.0.1:36056_ ] o.a.s.c.OverseerElectionContext I am going to be the leader 127.0.0.1:36056_
[junit4] 2> 45028 INFO (TEST-SolrCloudExampleTest.testLoadDocsIntoGettingStartedCollection-seed#[8DA550B5CEC3697B]) [n:127.0.0.1:36056_ ] o.a.s.c.Overseer Overseer (id=97806024475934724-127.0.0.1:36056_-n_0000000000) starting
[junit4] 2> 45058 INFO (TEST-SolrCloudExampleTest.testLoadDocsIntoGettingStartedCollection-seed#[8DA550B5CEC3697B]) [n:127.0.0.1:36056_ ] o.a.s.c.ZkController Register node as live in ZooKeeper:/live_nodes/127.0.0.1:36056_
[junit4] 2> 45064 INFO (OverseerStateUpdate-97806024475934724-127.0.0.1:36056_-n_0000000000) [n:127.0.0.1:36056_ ] o.a.s.c.c.ZkStateReader Updated live nodes from ZooKeeper... (0) -> (1)
[junit4] 2> 45351 INFO (TEST-SolrCloudExampleTest.testLoadDocsIntoGettingStartedCollection-seed#[8DA550B5CEC3697B]) [n:127.0.0.1:36056_ ] o.a.s.m.r.SolrJmxReporter JMX monitoring for 'solr.node' (registry 'solr.node') enabled at server: com.sun.jmx.mbeanserver.JmxMBeanServer@7e1e3324
[junit4] 2> 45360 INFO (TEST-SolrCloudExampleTest.testLoadDocsIntoGettingStartedCollection-seed#[8DA550B5CEC3697B]) [n:127.0.0.1:36056_ ] o.a.s.m.r.SolrJmxReporter JMX monitoring for 'solr.jvm' (registry 'solr.jvm') enabled at server: com.sun.jmx.mbeanserver.JmxMBeanServer@7e1e3324
[junit4] 2> 45360 INFO (TEST-SolrCloudExampleTest.testLoadDocsIntoGettingStartedCollection-seed#[8DA550B5CEC3697B]) [n:127.0.0.1:36056_ ] o.a.s.m.r.SolrJmxReporter JMX monitoring for 'solr.jetty' (registry 'solr.jetty') enabled at server: com.sun.jmx.mbeanserver.JmxMBeanServer@7e1e3324
[junit4] 2> 45372 INFO (TEST-SolrCloudExampleTest.testLoadDocsIntoGettingStartedCollection-seed#[8DA550B5CEC3697B]) [n:127.0.0.1:36056_ ] o.a.s.c.CorePropertiesLocator Found 1 core definitions underneath /home/jenkins/workspace/Lucene-Solr-master-Linux/solr/build/solr-core/test/J2/../../../../../../../../../home/jenkins/workspace/Lucene-Solr-master-Linux/solr/build/solr-core/test/J2/temp/solr.cloud.SolrCloudExampleTest_8DA550B5CEC3697B-001/control-001/cores
[junit4] 2> 45372 INFO (TEST-SolrCloudExampleTest.testLoadDocsIntoGettingStartedCollection-seed#[8DA550B5CEC3697B]) [n:127.0.0.1:36056_ ] o.a.s.c.CorePropertiesLocator Cores are: [collection1]
[junit4] 2> 45382 INFO (coreLoadExecutor-206-thread-1-processing-n:127.0.0.1:36056_) [n:127.0.0.1:36056_ c:control_collection x:collection1] o.a.s.c.TransientSolrCoreCacheDefault Allocating transient cache for 4 transient cores
[junit4] 2> 45405 INFO (OverseerStateUpdate-97806024475934724-127.0.0.1:36056_-n_0000000000) [n:127.0.0.1:36056_ ] o.a.s.c.o.ReplicaMutator Assigning new node to shard shard=shard1
[junit4] 2> 46486 INFO (coreLoadExecutor-206-thread-1-processing-n:127.0.0.1:36056_) [n:127.0.0.1:36056_ c:control_collection x:collection1] o.a.s.c.SolrConfig Using Lucene MatchVersion: 7.0.0
[junit4] 2> 46539 INFO (coreLoadExecutor-206-thread-1-processing-n:127.0.0.1:36056_) [n:127.0.0.1:36056_ c:control_collection x:collection1] o.a.s.s.IndexSchema [collection1] Schema name=test
[junit4] 2> 46674 WARN (coreLoadExecutor-206-thread-1-processing-n:127.0.0.1:36056_) [n:127.0.0.1:36056_ c:control_collection x:collection1] o.a.s.s.IndexSchema [collection1] default search field in schema is text. WARNING: Deprecated, please use 'df' on request instead.
[junit4] 2> 46680 INFO (coreLoadExecutor-206-thread-1-processing-n:127.0.0.1:36056_) [n:127.0.0.1:36056_ c:control_collection x:collection1] o.a.s.s.IndexSchema Loaded schema test/1.0 with uniqueid field id
[junit4] 2> 46708 INFO (coreLoadExecutor-206-thread-1-processing-n:127.0.0.1:36056_) [n:127.0.0.1:36056_ c:control_collection x:collection1] o.a.s.c.CoreContainer Creating SolrCore 'collection1' using configuration from collection control_collection, trusted=true
[junit4] 2> 46708 INFO (coreLoadExecutor-206-thread-1-processing-n:127.0.0.1:36056_) [n:127.0.0.1:36056_ c:control_collection x:collection1] o.a.s.m.r.SolrJmxReporter JMX monitoring for 'solr.core.control_collection.shard1.core_node1' (registry 'solr.core.control_collection.shard1.core_node1') enabled at server: com.sun.jmx.mbeanserver.JmxMBeanServer@7e1e3324
[junit4] 2> 46709 INFO (coreLoadExecutor-206-thread-1-processing-n:127.0.0.1:36056_) [n:127.0.0.1:36056_ c:control_collection x:collection1] o.a.s.c.SolrCore solr.RecoveryStrategy.Builder
[junit4] 2> 46709 INFO (coreLoadExecutor-206-thread-1-processing-n:127.0.0.1:36056_) [n:127.0.0.1:36056_ c:control_collection x:collection1] o.a.s.c.SolrCore [[collection1] ] Opening new SolrCore at [/home/jenkins/workspace/Lucene-Solr-master-Linux/solr/build/solr-core/test/J2/temp/solr.cloud.SolrCloudExampleTest_8DA550B5CEC3697B-001/control-001/cores/collection1], dataDir=[/home/jenkins/workspace/Lucene-Solr-master-Linux/solr/build/solr-core/test/J2/../../../../../../../../../home/jenkins/workspace/Lucene-Solr-master-Linux/solr/build/solr-core/test/J2/temp/solr.cloud.SolrCloudExampleTest_8DA550B5CEC3697B-001/control-001/cores/collection1/data/]
[junit4] 2> 46711 INFO (coreLoadExecutor-206-thread-1-processing-n:127.0.0.1:36056_) [n:127.0.0.1:36056_ c:control_collection x:collection1] o.a.s.u.RandomMergePolicy RandomMergePolicy wrapping class org.apache.lucene.index.LogByteSizeMergePolicy: [LogByteSizeMergePolicy: minMergeSize=1677721, mergeFactor=33, maxMergeSize=2147483648, maxMergeSizeForForcedMerge=9223372036854775807, calibrateSizeByDeletes=true, maxMergeDocs=2147483647, maxCFSSegmentSizeMB=8.796093022207999E12, noCFSRatio=1.0]
[junit4] 2> 46740 WARN (coreLoadExecutor-206-thread-1-processing-n:127.0.0.1:36056_) [n:127.0.0.1:36056_ c:control_collection x:collection1] o.a.s.c.RequestHandlers INVALID paramSet a in requestHandler {type = requestHandler,name = /dump,class = DumpRequestHandler,attributes = {initParams=a, name=/dump, class=DumpRequestHandler},args = {defaults={a=A,b=B}}}
[junit4] 2> 46839 INFO (coreLoadExecutor-206-thread-1-processing-n:127.0.0.1:36056_) [n:127.0.0.1:36056_ c:control_collection x:collection1] o.a.s.u.UpdateHandler Using UpdateLog implementation: org.apache.solr.update.UpdateLog
[junit4] 2> 46839 INFO (coreLoadExecutor-206-thread-1-processing-n:127.0.0.1:36056_) [n:127.0.0.1:36056_ c:control_collection x:collection1] o.a.s.u.UpdateLog Initializing UpdateLog: dataDir= defaultSyncLevel=FLUSH numRecordsToKeep=100 maxNumLogsToKeep=10 numVersionBuckets=65536
[junit4] 2> 46841 INFO (coreLoadExecutor-206-thread-1-processing-n:127.0.0.1:36056_) [n:127.0.0.1:36056_ c:control_collection x:collection1] o.a.s.u.CommitTracker Hard AutoCommit: disabled
[junit4] 2> 46841 INFO (coreLoadExecutor-206-thread-1-processing-n:127.0.0.1:36056_) [n:127.0.0.1:36056_ c:control_collection x:collection1] o.a.s.u.CommitTracker Soft AutoCommit: disabled
[junit4] 2> 46842 INFO (coreLoadExecutor-206-thread-1-processing-n:127.0.0.1:36056_) [n:127.0.0.1:36056_ c:control_collection x:collection1] o.a.s.u.RandomMergePolicy RandomMergePolicy wrapping class org.apache.lucene.index.LogDocMergePolicy: [LogDocMergePolicy: minMergeSize=1000, mergeFactor=19, maxMergeSize=9223372036854775807, maxMergeSizeForForcedMerge=9223372036854775807, calibrateSizeByDeletes=false, maxMergeDocs=2147483647, maxCFSSegmentSizeMB=8.796093022207999E12, noCFSRatio=0.0]
[junit4] 2> 46843 INFO (coreLoadExecutor-206-thread-1-processing-n:127.0.0.1:36056_) [n:127.0.0.1:36056_ c:control_collection x:collection1] o.a.s.s.SolrIndexSearcher Opening [Searcher@64bb824[collection1] main]
[junit4] 2> 46845 INFO (coreLoadExecutor-206-thread-1-processing-n:127.0.0.1:36056_) [n:127.0.0.1:36056_ c:control_collection x:collection1] o.a.s.r.ManagedResourceStorage Configured ZooKeeperStorageIO with znodeBase: /configs/conf1
[junit4] 2> 46845 INFO (coreLoadExecutor-206-thread-1-processing-n:127.0.0.1:36056_) [n:127.0.0.1:36056_ c:control_collection x:collection1] o.a.s.r.ManagedResourceStorage Loaded null at path _rest_managed.json using ZooKeeperStorageIO:path=/configs/conf1
[junit4] 2> 46846 INFO (coreLoadExecutor-206-thread-1-processing-n:127.0.0.1:36056_) [n:127.0.0.1:36056_ c:control_collection x:collection1] o.a.s.h.ReplicationHandler Commits will be reserved for 10000
[junit4] 2> 46846 INFO (coreLoadExecutor-206-thread-1-processing-n:127.0.0.1:36056_) [n:127.0.0.1:36056_ c:control_collection x:collection1] o.a.s.u.UpdateLog Could not find max version in index or recent updates, using new clock 1564896393901899776
[junit4] 2> 46863 INFO (searcherExecutor-207-thread-1-processing-n:127.0.0.1:36056_ x:collection1 c:control_collection) [n:127.0.0.1:36056_ c:control_collection x:collection1] o.a.s.c.SolrCore [collection1] Registered new searcher Searcher@64bb824[collection1] main{ExitableDirectoryReader(UninvertingDirectoryReader())}
[junit4] 2> 46868 INFO (coreZkRegister-199-thread-1-processing-n:127.0.0.1:36056_ x:collection1 c:control_collection) [n:127.0.0.1:36056_ c:control_collection s:shard1 r:core_node1 x:collection1] o.a.s.c.ShardLeaderElectionContext Enough replicas found to continue.
[junit4] 2> 46868 INFO (coreZkRegister-199-thread-1-processing-n:127.0.0.1:36056_ x:collection1 c:control_collection) [n:127.0.0.1:36056_ c:control_collection s:shard1 r:core_node1 x:collection1] o.a.s.c.ShardLeaderElectionContext I may be the new leader - try and sync
[junit4] 2> 46868 INFO (coreZkRegister-199-thread-1-processing-n:127.0.0.1:36056_ x:collection1 c:control_collection) [n:127.0.0.1:36056_ c:control_collection s:shard1 r:core_node1 x:collection1] o.a.s.c.SyncStrategy Sync replicas to http://127.0.0.1:36056/collection1/
[junit4] 2> 46868 INFO (coreZkRegister-199-thread-1-processing-n:127.0.0.1:36056_ x:collection1 c:control_collection) [n:127.0.0.1:36056_ c:control_collection s:shard1 r:core_node1 x:collection1] o.a.s.c.SyncStrategy Sync Success - now sync replicas to me
[junit4] 2> 46868 INFO (coreZkRegister-199-thread-1-processing-n:127.0.0.1:36056_ x:collection1 c:control_collection) [n:127.0.0.1:36056_ c:control_collection s:shard1 r:core_node1 x:collection1] o.a.s.c.SyncStrategy http://127.0.0.1:36056/collection1/ has no replicas
[junit4] 2> 46868 INFO (coreZkRegister-199-thread-1-processing-n:127.0.0.1:36056_ x:collection1 c:control_collection) [n:127.0.0.1:36056_ c:control_collection s:shard1 r:core_node1 x:collection1] o.a.s.c.ShardLeaderElectionContext Found all replicas participating in election, clear LIR
[junit4] 2> 46874 INFO (coreZkRegister-199-thread-1-processing-n:127.0.0.1:36056_ x:collection1 c:control_collection) [n:127.0.0.1:36056_ c:control_collection s:shard1 r:core_node1 x:collection1] o.a.s.c.ShardLeaderElectionContext I am the new leader: http://127.0.0.1:36056/collection1/ shard1
[junit4] 2> 46995 INFO (TEST-SolrCloudExampleTest.testLoadDocsIntoGettingStartedCollection-seed#[8DA550B5CEC3697B]) [ ] o.a.s.c.c.ZkStateReader Updated live nodes from ZooKeeper... (0) -> (1)
[junit4] 2> 46996 INFO (TEST-SolrCloudExampleTest.testLoadDocsIntoGettingStartedCollection-seed#[8DA550B5CEC3697B]) [ ] o.a.s.c.s.i.ZkClientClusterStateProvider Cluster at 127.0.0.1:35697/solr ready
[junit4] 2> 46996 INFO (TEST-SolrCloudExampleTest.testLoadDocsIntoGettingStartedCollection-seed#[8DA550B5CEC3697B]) [ ] o.a.s.c.ChaosMonkey monkey: init - expire sessions:false cause connection loss:false
[junit4] 2> 47025 INFO (coreZkRegister-199-thread-1-processing-n:127.0.0.1:36056_ x:collection1 c:control_collection) [n:127.0.0.1:36056_ c:control_collection s:shard1 r:core_node1 x:collection1] o.a.s.c.ZkController I am the leader, no recovery necessary
[junit4] 2> 47104 INFO (TEST-SolrCloudExampleTest.testLoadDocsIntoGettingStartedCollection-seed#[8DA550B5CEC3697B]) [ ] o.a.s.SolrTestCaseJ4 Writing core.properties file to /home/jenkins/workspace/Lucene-Solr-master-Linux/solr/build/solr-core/test/J2/temp/solr.cloud.SolrCloudExampleTest_8DA550B5CEC3697B-001/shard-1-001/cores/collection1
[junit4] 2> 47105 INFO (TEST-SolrCloudExampleTest.testLoadDocsIntoGettingStartedCollection-seed#[8DA550B5CEC3697B]) [ ] o.a.s.c.AbstractFullDistribZkTestBase create jetty 1 in directory /home/jenkins/workspace/Lucene-Solr-master-Linux/solr/build/solr-core/test/J2/temp/solr.cloud.SolrCloudExampleTest_8DA550B5CEC3697B-001/shard-1-001
[junit4] 2> 47106 INFO (TEST-SolrCloudExampleTest.testLoadDocsIntoGettingStartedCollection-seed#[8DA550B5CEC3697B]) [ ] o.e.j.s.Server jetty-9.3.14.v20161028
[junit4] 2> 47107 INFO (TEST-SolrCloudExampleTest.testLoadDocsIntoGettingStartedCollection-seed#[8DA550B5CEC3697B]) [ ] o.e.j.s.h.ContextHandler Started o.e.j.s.ServletContextHandler@2ecffbf9{/,null,AVAILABLE}
[junit4] 2> 47107 INFO (TEST-SolrCloudExampleTest.testLoadDocsIntoGettingStartedCollection-seed#[8DA550B5CEC3697B]) [ ] o.e.j.s.AbstractConnector Started ServerConnector@3c055206{HTTP/1.1,[http/1.1]}{127.0.0.1:40299}
[junit4] 2> 47107 INFO (TEST-SolrCloudExampleTest.testLoadDocsIntoGettingStartedCollection-seed#[8DA550B5CEC3697B]) [ ] o.e.j.s.Server Started @49178ms
[junit4] 2> 47108 INFO (TEST-SolrCloudExampleTest.testLoadDocsIntoGettingStartedCollection-seed#[8DA550B5CEC3697B]) [ ] o.a.s.c.s.e.JettySolrRunner Jetty properties: {solr.data.dir=/home/jenkins/workspace/Lucene-Solr-master-Linux/solr/build/solr-core/test/J2/temp/solr.cloud.SolrCloudExampleTest_8DA550B5CEC3697B-001/tempDir-001/jetty1, solrconfig=solrconfig.xml, hostContext=/, hostPort=40299, coreRootDirectory=/home/jenkins/workspace/Lucene-Solr-master-Linux/solr/build/solr-core/test/J2/../../../../../../../../../home/jenkins/workspace/Lucene-Solr-master-Linux/solr/build/solr-core/test/J2/temp/solr.cloud.SolrCloudExampleTest_8DA550B5CEC3697B-001/shard-1-001/cores}
[junit4] 2> 47108 ERROR (TEST-SolrCloudExampleTest.testLoadDocsIntoGettingStartedCollection-seed#[8DA550B5CEC3697B]) [ ] o.a.s.s.StartupLoggingUtils Missing Java Option solr.log.dir. Logging may be missing or incomplete.
[junit4] 2> 47108 INFO (TEST-SolrCloudExampleTest.testLoadDocsIntoGettingStartedCollection-seed#[8DA550B5CEC3697B]) [ ] o.a.s.s.SolrDispatchFilter ___ _ Welcome to Apache Solr? version 7.0.0
[junit4] 2> 47108 INFO (TEST-SolrCloudExampleTest.testLoadDocsIntoGettingStartedCollection-seed#[8DA550B5CEC3697B]) [ ] o.a.s.s.SolrDispatchFilter / __| ___| |_ _ Starting in cloud mode on port null
[junit4] 2> 47108 INFO (TEST-SolrCloudExampleTest.testLoadDocsIntoGettingStartedCollection-seed#[8DA550B5CEC3697B]) [ ] o.a.s.s.SolrDispatchFilter \__ \/ _ \ | '_| Install dir: null
[junit4] 2> 47108 INFO (TEST-SolrCloudExampleTest.testLoadDocsIntoGettingStartedCollection-seed#[8DA550B5CEC3697B]) [ ] o.a.s.s.SolrDispatchFilter |___/\___/_|_| Start time: 2017-04-17T03:58:18.963Z
[junit4] 2> 47114 INFO (TEST-SolrCloudExampleTest.testLoadDocsIntoGettingStartedCollection-seed#[8DA550B5CEC3697B]) [ ] o.a.s.s.SolrDispatchFilter Loading solr.xml from SolrHome (not found in ZooKeeper)
[junit4] 2> 47115 INFO (TEST-SolrCloudExampleTest.testLoadDocsIntoGettingStartedCollection-seed#[8DA550B5CEC3697B]) [ ] o.a.s.c.SolrXmlConfig Loading container configuration from /home/jenkins/workspace/Lucene-Solr-master-Linux/solr/build/solr-core/test/J2/temp/solr.cloud.SolrCloudExampleTest_8DA550B5CEC3697B-001/shard-1-001/solr.xml
[junit4] 2> 47121 INFO (TEST-SolrCloudExampleTest.testLoadDocsIntoGettingStartedCollection-seed#[8DA550B5CEC3697B]) [ ] o.a.s.c.SolrXmlConfig MBean server found: com.sun.jmx.mbeanserver.JmxMBeanServer@7e1e3324, but no JMX reporters were configured - adding default JMX reporter.
[junit4] 2> 47127 INFO (TEST-SolrCloudExampleTest.testLoadDocsIntoGettingStartedCollection-seed#[8DA550B5CEC3697B]) [ ] o.a.s.c.ZkContainer Zookeeper client=127.0.0.1:35697/solr
[junit4] 2> 47148 INFO (TEST-SolrCloudExampleTest.testLoadDocsIntoGettingStartedCollection-seed#[8DA550B5CEC3697B]) [n:127.0.0.1:40299_ ] o.a.s.c.c.ZkStateReader Updated live nodes from ZooKeeper... (0) -> (1)
[junit4] 2> 47150 INFO (TEST-SolrCloudExampleTest.testLoadDocsIntoGettingStartedCollection-seed#[8DA550B5CEC3697B]) [n:127.0.0.1:40299_ ] o.a.s.c.Overseer Overseer (id=null) closing
[junit4] 2> 47152 INFO (TEST-SolrCloudExampleTest.testLoadDocsIntoGettingStartedCollection-seed#[8DA550B5CEC3697B]) [n:127.0.0.1:40299_ ] o.a.s.c.ZkController Register node as live in ZooKeeper:/live_nodes/127.0.0.1:40299_
[junit4] 2> 47154 INFO (zkCallback-100-thread-1-processing-n:127.0.0.1:36056_) [n:127.0.0.1:36056_ ] o.a.s.c.c.ZkStateReader Updated live nodes from ZooKeeper... (1) -> (2)
[junit4] 2> 47157 INFO (zkCallback-104-thread-1) [ ] o.a.s.c.c.ZkStateReader Updated live nodes from ZooKeeper... (1) -> (2)
[junit4] 2> 47157 INFO (zkCallback-109-thread-1-processing-n:127.0.0.1:40299_) [n:127.0.0.1:40299_ ] o.a.s.c.c.ZkStateReader Updated live nodes from ZooKeeper... (1) -> (2)
[junit4] 2> 47273 INFO (TEST-SolrCloudExampleTest.testLoadDocsIntoGettingStartedCollection-seed#[8DA550B5CEC3697B]) [n:127.0.0.1:40299_ ] o.a.s.m.r.SolrJmxReporter JMX monitoring for 'solr.node' (registry 'solr.node') enabled at server: com.sun.jmx.mbeanserver.JmxMBeanServer@7e1e3324
[junit4] 2> 47279 INFO (TEST-SolrCloudExampleTest.testLoadDocsIntoGettingStartedCollection-seed#[8DA550B5CEC3697B]) [n:127.0.0.1:40299_ ] o.a.s.m.r.SolrJmxReporter JMX monitoring for 'solr.jvm' (registry 'solr.jvm') enabled at server: com.sun.jmx.mbeanserver.JmxMBeanServer@7e1e3324
[junit4] 2> 47280 INFO (TEST-SolrCloudExampleTest.testLoadDocsIntoGettingStartedCollection-seed#[8DA550B5CEC3697B]) [n:127.0.0.1:40299_ ] o.a.s.m.r.SolrJmxReporter JMX monitoring for 'solr.jetty' (registry 'solr.jetty') enabled at server: com.sun.jmx.mbeanserver.JmxMBeanServer@7e1e3324
[junit4] 2> 47282 INFO (TEST-SolrCloudExampleTest.testLoadDocsIntoGettingStartedCollection-seed#[8DA550B5CEC3697B]) [n:127.0.0.1:40299_ ] o.a.s.c.CorePropertiesLocator Found 1 core definitions underneath /home/jenkins/workspace/Lucene-Solr-master-Linux/solr/build/solr-core/test/J2/../../../../../../../../../home/jenkins/workspace/Lucene-Solr-master-Linux/solr/build/solr-core/test/J2/temp/solr.cloud.SolrCloudExampleTest_8DA550B5CEC3697B-001/shard-1-001/cores
[junit4] 2> 47283 INFO (TEST-SolrCloudExampleTest.testLoadDocsIntoGettingStartedCollection-seed#[8DA550B5CEC3697B]) [n:127.0.0.1:40299_ ] o.a.s.c.CorePropertiesLocator Cores are: [collection1]
[junit4] 2> 47283 INFO (coreLoadExecutor-217-thread-1-processing-n:127.0.0.1:40299_) [n:127.0.0.1:40299_ c:collection1 x:collection1] o.a.s.c.TransientSolrCoreCacheDefault Allocating transient cache for 4 transient cores
[junit4] 2> 47285 INFO (OverseerStateUpdate-97806024475934724-127.0.0.1:36056_-n_0000000000) [n:127.0.0.1:36056_ ] o.a.s.c.o.ReplicaMutator Assigning new node to shard shard=shard2
[junit4] 2> 48307 INFO (coreLoadExecutor-217-thread-1-processing-n:127.0.0.1:40299_) [n:127.0.0.1:40299_ c:collection1 x:collection1] o.a.s.c.SolrConfig Using Lucene MatchVersion: 7.0.0
[junit4] 2> 48325 INFO (coreLoadExecutor-217-thread-1-processing-n:127.0.0.1:40299_) [n:127.0.0.1:40299_ c:collection1 x:collection1] o.a.s.s.IndexSchema [collection1] Schema name=test
[junit4] 2> 48482 WARN (coreLoadExecutor-217-thread-1-processing-n:127.0.0.1:40299_) [n:127.0.0.1:40299_ c:collection1 x:collection1] o.a.s.s.IndexSchema [collection1] default search field in schema is text. WARNING: Deprecated, please use 'df' on request instead.
[junit4] 2> 48486 INFO (coreLoadExecutor-217-thread-1-processing-n:127.0.0.1:40299_) [n:127.0.0.1:40299_ c:collection1 x:collection1] o.a.s.s.IndexSchema Loaded schema test/1.0 with uniqueid field id
[junit4] 2> 48525 INFO (coreLoadExecutor-217-thread-1-processing-n:127.0.0.1:40299_) [n:127.0.0.1:40299_ c:collection1 x:collection1] o.a.s.c.CoreContainer Creating SolrCore 'collection1' using configuration from collection collection1, trusted=true
[junit4] 2> 48525 INFO (coreLoadExecutor-217-thread-1-processing-n:127.0.0.1:40299_) [n:127.0.0.1:40299_ c:collection1 x:collection1] o.a.s.m.r.SolrJmxReporter JMX monitoring for 'solr.core.collection1.shard2.core_node1' (registry 'solr.core.collection1.shard2.core_node1') enabled at server: com.sun.jmx.mbeanserver.JmxMBeanServer@7e1e3324
[junit4] 2> 48525 INFO (coreLoadExecutor-217-thread-1-processing-n:127.0.0.1:40299_) [n:127.0.0.1:40299_ c:collection1 x:collection1] o.a.s.c.SolrCore solr.RecoveryStrategy.Builder
[junit4] 2> 48525 INFO (coreLoadExecutor-217-thread-1-processing-n:127.0.0.1:40299_) [n:127.0.0.1:40299_ c:collection1 x:collection1] o.a.s.c.SolrCore [[collection1] ] Opening new SolrCore at [/home/jenkins/workspace/Lucene-Solr-master-Linux/solr/build/solr-core/test/J2/temp/solr.cloud.SolrCloudExampleTest_8DA550B5CEC3697B-001/shard-1-001/cores/collection1], dataDir=[/home/jenkins/workspace/Lucene-Solr-master-Linux/solr/build/solr-core/test/J2/../../../../../../../../../home/jenkins/workspace/Lucene-Solr-master-Linux/solr/build/solr-core/test/J2/temp/solr.cloud.SolrCloudExampleTest_8DA550B5CEC3697B-001/shard-1-001/cores/collection1/data/]
[junit4] 2> 48528 INFO (coreLoadExecutor-217-thread-1-processing-n:127.0.0.1:40299_) [n:127.0.0.1:40299_ c:collection1 x:collection1] o.a.s.u.RandomMergePolicy RandomMergePolicy wrapping class org.apache.lucene.index.LogByteSizeMergePolicy: [LogByteSizeMergePolicy: minMergeSize=1677721, mergeFactor=33, maxMergeSize=2147483648, maxMergeSizeForForcedMerge=9223372036854775807, calibrateSizeByDeletes=true, maxMergeDocs=2147483647, maxCFSSegmentSizeMB=8.796093022207999E12, noCFSRatio=1.0]
[junit4] 2> 48531 WARN (coreLoadExecutor-217-thread-1-processing-n:127.0.0.1:40299_) [n:127.0.0.1:40299_ c:collection1 x:collection1] o.a.s.c.RequestHandlers INVALID paramSet a in requestHandler {type = requestHandler,name = /dump,class = DumpRequestHandler,attributes = {initParams=a, name=/dump, class=DumpRequestHandler},args = {defaults={a=A,b=B}}}
[junit4] 2> 48574 INFO (coreLoadExecutor-217-thread-1-processing-n:127.0.0.1:40299_) [n:127.0.0.1:40299_ c:collection1 x:collection1] o.a.s.u.UpdateHandler Using UpdateLog implementation: org.apache.solr.update.UpdateLog
[junit4] 2> 48575 INFO (coreLoadExecutor-217-thread-1-processing-n:127.0.0.1:40299_) [n:127.0.0.1:40299_ c:collection1 x:collection1] o.a.s.u.UpdateLog Initializing UpdateLog: dataDir= defaultSyncLevel=FLUSH numRecordsToKeep=100 maxNumLogsToKeep=10 numVersionBuckets=65536
[junit4] 2> 48575 INFO (coreLoadExecutor-217-thread-1-processing-n:127.0.0.1:40299_) [n:127.0.0.1:40299_ c:collection1 x:collection1] o.a.s.u.CommitTracker Hard AutoCommit: disabled
[junit4] 2> 48575 INFO (coreLoadExecutor-217-thread-1-processing-n:127.0.0.1:40299_) [n:127.0.0.1:40299_ c:collection1 x:collection1] o.a.s.u.CommitTracker Soft AutoCommit: disabled
[junit4] 2> 48576 INFO (coreLoadExecutor-217-thread-1-processing-n:127.0.0.1:40299_) [n:127.0.0.1:40299_ c:collection1 x:collection1] o.a.s.u.RandomMergePolicy RandomMergePolicy wrapping class org.apache.lucene.index.LogDocMergePolicy: [LogDocMergePolicy: minMergeSize=1000, mergeFactor=19, maxMergeSize=9223372036854775807, maxMergeSizeForForcedMerge=9223372036854775807, calibrateSizeByDeletes=false, maxMergeDocs=2147483647, maxCFSSegmentSizeMB=8.796093022207999E12, noCFSRatio=0.0]
[junit4] 2> 48577 INFO (coreLoadExecutor-217-thread-1-processing-n:127.0.0.1:40299_) [n:127.0.0.1:40299_ c:collection1 x:collection1] o.a.s.s.SolrIndexSearcher Opening [Searcher@6ad98bde[collection1] main]
[junit4] 2> 48577 INFO (coreLoadExecutor-217-thread-1-processing-n:127.0.0.1:40299_) [n:127.0.0.1:40299_ c:collection1 x:collection1] o.a.s.r.ManagedResourceStorage Configured ZooKeeperStorageIO with znodeBase: /configs/conf1
[junit4] 2> 48578 INFO (coreLoadExecutor-217-thread-1-processing-n:127.0.0.1:40299_) [n:127.0.0.1:40299_ c:collection1 x:collection1] o.a.s.r.ManagedResourceStorage Loaded null at path _rest_managed.json using ZooKeeperStorageIO:path=/configs/conf1
[junit4] 2> 48578 INFO (coreLoadExecutor-217-thread-1-processing-n:127.0.0.1:40299_) [n:127.0.0.1:40299_ c:collection1 x:collection1] o.a.s.h.ReplicationHandler Commits will be reserved for 10000
[junit4] 2> 48580 INFO (searcherExecutor-218-thread-1-processing-n:127.0.0.1:40299_ x:collection1 c:collection1) [n:127.0.0.1:40299_ c:collection1 x:collection1] o.a.s.c.SolrCore [collection1] Registered new searcher Searcher@6ad98bde[collection1] main{ExitableDirectoryReader(UninvertingDirectoryReader())}
[junit4] 2> 48580 INFO (coreLoadExecutor-217-thread-1-processing-n:127.0.0.1:40299_) [n:127.0.0.1:40299_ c:collection1 x:collection1] o.a.s.u.UpdateLog Could not find max version in index or recent updates, using new clock 1564896395720130560
[junit4] 2> 48585 INFO (coreZkRegister-212-thread-1-processing-n:127.0.0.1:40299_ x:collection1 c:collection1) [n:127.0.0.1:40299_ c:collection1 s:shard2 r:core_node1 x:collection1] o.a.s.c.ShardLeaderElectionContext Enough replicas found to continue.
[junit4] 2> 48585 INFO (coreZkRegister-212-thread-1-processing-n:127.0.0.1:40299_ x:collection1 c:collection1) [n:127.0.0.1:40299_ c:collection1 s:shard2 r:core_node1 x:collection1] o.a.s.c.ShardLeaderElectionContext I may be the new leader - try and sync
[junit4] 2> 48585 INFO (coreZkRegister-212-thread-1-processing-n:127.0.0.1:40299_ x:collection1 c:collection1) [n:127.0.0.1:40299_ c:collection1 s:shard2 r:core_node1 x:collection1] o.a.s.c.SyncStrategy Sync replicas to http://127.0.0.1:40299/collection1/
[junit4] 2> 48585 INFO (coreZkRegister-212-thread-1-processing-n:127.0.0.1:40299_ x:collection1 c:collection1) [n:127.0.0.1:40299_ c:collection1 s:shard2 r:core_node1 x:collection1] o.a.s.c.SyncStrategy Sync Success - now sync replicas to me
[junit4] 2> 48585 INFO (coreZkRegister-212-thread-1-processing-n:127.0.0.1:40299_ x:collection1 c:collection1) [n:127.0.0.1:40299_ c:collection1 s:shard2 r:core_node1 x:collection1] o.a.s.c.SyncStrategy http://127.0.0.1:40299/collection1/ has no replicas
[junit4] 2> 48585 INFO (coreZkRegister-212-thread-1-processing-n:127.0.0.1:40299_ x:collection1 c:collection1) [n:127.0.0.1:40299_ c:collection1 s:shard2 r:core_node1 x:collection1] o.a.s.c.ShardLeaderElectionContext Found all replicas participating in election, clear LIR
[junit4] 2> 48589 INFO (coreZkRegister-212-thread-1-processing-n:127.0.0.1:40299_ x:collection1 c:collection1) [n:127.0.0.1:40299_ c:collection1 s:shard2 r:core_node1 x:collection1] o.a.s.c.ShardLeaderElectionContext I am the new leader: http://127.0.0.1:40299/collection1/ shard2
[junit4] 2> 48741 INFO (coreZkRegister-212-thread-1-processing-n:127.0.0.1:40299_ x:collection1 c:collection1) [n:127.0.0.1:40299_ c:collection1 s:shard2 r:core_node1 x:collection1] o.a.s.c.ZkController I am the leader, no recovery necessary
[junit4] 2> 48921 INFO (TEST-SolrCloudExampleTest.testLoadDocsIntoGettingStartedCollection-seed#[8DA550B5CEC3697B]) [ ] o.a.s.SolrTestCaseJ4 Writing core.properties file to /home/jenkins/workspace/Lucene-Solr-master-Linux/solr/build/solr-core/test/J2/temp/solr.cloud.SolrCloudExampleTest_8DA550B5CEC3697B-001/shard-2-001/cores/collection1
[junit4] 2> 48923 INFO (TEST-SolrCloudExampleTest.testLoadDocsIntoGettingStartedCollection-seed#[8DA550B5CEC3697B]) [ ] o.a.s.c.AbstractFullDistribZkTestBase create jetty 2 in directory /home/jenkins/workspace/Lucene-Solr-master-Linux/solr/build/solr-core/test/J2/temp/solr.cloud.SolrCloudExampleTest_8DA550B5CEC3697B-001/shard-2-001
[junit4] 2> 48924 INFO (TEST-SolrCloudExampleTest.testLoadDocsIntoGettingStartedCollection-seed#[8DA550B5CEC3697B]) [ ] o.e.j.s.Server jetty-9.3.14.v20161028
[junit4] 2> 48925 INFO (TEST-SolrCloudExampleTest.testLoadDocsIntoGettingStartedCollection-seed#[8DA550B5CEC3697B]) [ ] o.e.j.s.h.ContextHandler Started o.e.j.s.ServletContextHandler@608ad620{/,null,AVAILABLE}
[junit4] 2> 48926 INFO (TEST-SolrCloudExampleTest.testLoadDocsIntoGettingStartedCollection-seed#[8DA550B5CEC3697B]) [ ] o.e.j.s.AbstractConnector Started ServerConnector@287330a7{HTTP/1.1,[http/1.1]}{127.0.0.1:36084}
[junit4] 2> 48926 INFO (TEST-SolrCloudExampleTest.testLoadDocsIntoGettingStartedCollection-seed#[8DA550B5CEC3697B]) [ ] o.e.j.s.Server Started @50997ms
[junit4] 2> 48926 INFO (TEST-SolrCloudExampleTest.testLoadDocsIntoGettingStartedCollection-seed#[8DA550B5CEC3697B]) [ ] o.a.s.c.s.e.JettySolrRunner Jetty properties: {solr.data.dir=/home/jenkins/workspace/Lucene-Solr-master-Linux/solr/build/solr-core/test/J2/temp/solr.cloud.SolrCloudExampleTest_8DA550B5CEC3697B-001/tempDir-001/jetty2, solrconfig=solrconfig.xml, hostContext=/, hostPort=36084, coreRootDirectory=/home/jenkins/workspace/Lucene-Solr-master-Linux/solr/build/solr-core/test/J2/temp/solr.cloud.SolrCloudExampleTest_8DA550B5CEC3697B-001/shard-2-001/cores}
[junit4] 2> 48927 ERROR (TEST-SolrCloudExampleTest.testLoadDocsIntoGettingStartedCollection-seed#[8DA550B5CEC3697B]) [ ] o.a.s.s.StartupLoggingUtils Missing Java Option solr.log.dir. Logging may be missing or incomplete.
[junit4] 2> 48927 INFO (TEST-SolrCloudExampleTest.testLoadDocsIntoGettingStartedCollection-seed#[8DA550B5CEC3697B]) [ ] o.a.s.s.SolrDispatchFilter ___ _ Welcome to Apache Solr? version 7.0.0
[junit4] 2> 48927 INFO (TEST-SolrCloudExampleTest.testLoadDocsIntoGettingStartedCollection-seed#[8DA550B5CEC3697B]) [ ] o.a.s.s.SolrDispatchFilter / __| ___| |_ _ Starting in cloud mode on port null
[junit4] 2> 48927 INFO (TEST-SolrCloudExampleTest.testLoadDocsIntoGettingStartedCollection-seed#[8DA550B5CEC3697B]) [ ] o.a.s.s.SolrDispatchFilter \__ \/ _ \ | '_| Install dir: null
[junit4] 2> 48927 INFO (TEST-SolrCloudExampleTest.testLoadDocsIntoGettingStartedCollection-seed#[8DA550B5CEC3697B]) [ ] o.a.s.s.SolrDispatchFilter |___/\___/_|_| Start time: 2017-04-17T03:58:20.782Z
[junit4] 2> 48930 INFO (TEST-SolrCloudExampleTest.testLoadDocsIntoGettingStartedCollection-seed#[8DA550B5CEC3697B]) [ ] o.a.s.s.SolrDispatchFilter Loading solr.xml from SolrHome (not found in ZooKeeper)
[junit4] 2> 48931 INFO (TEST-SolrCloudExampleTest.testLoadDocsIntoGettingStartedCollection-seed#[8DA550B5CEC3697B]) [ ] o.a.s.c.SolrXmlConfig Loading container configuration from /home/jenkins/workspace/Lucene-Solr-master-Linux/solr/build/solr-core/test/J2/temp/solr.cloud.SolrCloudExampleTest_8DA550B5CEC3697B-001/shard-2-001/solr.xml
[junit4] 2> 48937 INFO (TEST-SolrCloudExampleTest.testLoadDocsIntoGettingStartedCollection-seed#[8DA550B5CEC3697B]) [ ] o.a.s.c.SolrXmlConfig MBean server found: com.sun.jmx.mbeanserver.JmxMBeanServer@7e1e3324, but no JMX reporters were configured - adding default JMX reporter.
[junit4] 2> 48941 INFO (TEST-SolrCloudExampleTest.testLoadDocsIntoGettingStartedCollection-seed#[8DA550B5CEC3697B]) [ ] o.a.s.c.ZkContainer Zookeeper client=127.0.0.1:35697/solr
[junit4] 2> 48959 INFO (TEST-SolrCloudExampleTest.testLoadDocsIntoGettingStartedCollection-seed#[8DA550B5CEC3697B]) [n:127.0.0.1:36084_ ] o.a.s.c.c.ZkStateReader Updated live nodes from ZooKeeper... (0) -> (2)
[junit4] 2> 48960 INFO (TEST-SolrCloudExampleTest.testLoadDocsIntoGettingStartedCollection-seed#[8DA550B5CEC3697B]) [n:127.0.0.1:36084_ ] o.a.s.c.Overseer Overseer (id=null) closing
[junit4] 2> 48979 INFO (TEST-SolrCloudExampleTest.testLoadDocsIntoGettingStartedCollection-seed#[8DA550B5CEC3697B]) [n:127.0.0.1:36084_ ] o.a.s.c.ZkController Register node as live in ZooKeeper:/live_nodes/127.0.0.1:36084_
[junit4] 2> 48981 INFO (zkCallback-109-thread-1-processing-n:127.0.0.1:40299_) [n:127.0.0.1:40299_ ] o.a.s.c.c.ZkStateReader Updated live nodes from ZooKeeper... (2) -> (3)
[junit4] 2> 48982 INFO (zkCallback-115-thread-1-processing-n:127.0.0.1:36084_) [n:127.0.0.1:36084_ ] o.a.s.c.c.ZkStateReader Updated live nodes from ZooKeeper... (2) -> (3)
[junit4] 2> 48989 INFO (zkCallback-104-thread-1) [ ] o.a.s.c.c.ZkStateReader Updated live nodes from ZooKeeper... (2) -> (3)
[junit4] 2> 48996 INFO (zkCallback-100-thread-3-processing-n:127.0.0.1:36056_) [n:127.0.0.1:36056_ ] o.a.s.c.c.ZkStateReader Updated live nodes from ZooKeeper... (2) -> (3)
[junit4] 2> 49063 INFO (TEST-SolrCloudExampleTest.testLoadDocsIntoGettingStartedCollection-seed#[8DA550B5CEC3697B]) [n:127.0.0.1:36084_ ] o.a.s.m.r.SolrJmxReporter JMX monitoring for 'solr.node' (registry 'solr.node') enabled at server: com.sun.jmx.mbeanserver.JmxMBeanServer@7e1e3324
[junit4] 2> 49068 INFO (TEST-SolrCloudExampleTest.testLoadDocsIntoGettingStartedCollection-seed#[8DA550B5CEC3697B]) [n:127.0.0.1:36084_ ] o.a.s.m.r.SolrJmxReporter JMX monitoring for 'solr.jvm' (registry 'solr.jvm') enabled at server: com.sun.jmx.mbeanserver.JmxMBeanServer@7e1e3324
[junit4] 2> 49068 INFO (TEST-SolrCloudExampleTest.testLoadDocsIntoGettingStartedCollection-seed#[8DA550B5CEC3697B]) [n:127.0.0.1:36084_ ] o.a.s.m.r.SolrJmxReporter JMX monitoring for 'solr.jetty' (registry 'solr.jetty') enabled at server: com.sun.jmx.mbeanserver.JmxMBeanServer@7e1e3324
[junit4] 2> 49071 INFO (TEST-SolrCloudExampleTest.testLoadDocsIntoGettingStartedCollection-seed#[8DA550B5CEC3697B]) [n:127.0.0.1:36084_ ] o.a.s.c.CorePropertiesLocator Found 1 core definitions underneath /home/jenkins/workspace/Lucene-Solr-master-Linux/solr/build/solr-core/test/J2/temp/solr.cloud.SolrCloudExampleTest_8DA550B5CEC3697B-001/shard-2-001/cores
[junit4] 2> 49071 INFO (TEST-SolrCloudExampleTest.testLoadDocsIntoGettingStartedCollection-seed#[8DA550B5CEC3697B]) [n:127.0.0.1:36084_ ] o.a.s.c.CorePropertiesLocator Cores are: [collection1]
[junit4] 2> 49072 INFO (coreLoadExecutor-228-thread-1-processing-n:127.0.0.1:36084_) [n:127.0.0.1:36084_ c:collection1 x:collection1] o.a.s.c.TransientSolrCoreCacheDefault Allocating transient cache for 4 transient cores
[junit4] 2> 49073 INFO (OverseerStateUpdate-97806024475934724-127.0.0.1:36056_-n_0000000000) [n:127.0.0.1:36056_ ] o.a.s.c.o.ReplicaMutator Assigning new node to shard shard=shard1
[junit4] 2> 50093 INFO (coreLoadExecutor-228-thread-1-processing-n:127.0.0.1:36084_) [n:127.0.0.1:36084_ c:collection1 x:collection1] o.a.s.c.SolrConfig Using Lucene MatchVersion: 7.0.0
[junit4] 2> 50111 INFO (coreLoadExecutor-228-thread-1-processing-n:127.0.0.1:36084_) [n:127.0.0.1:36084_ c:collection1 x:collection1] o.a.s.s.IndexSchema [collection1] Schema name=test
[junit4] 2> 50330 WARN (coreLoadExecutor-228-thread-1-processing-n:127.0.0.1:36084_) [n:127.0.0.1:36084_ c:collection1 x:collection1] o.a.s.s.IndexSchema [collection1] default search field in schema is text. WARNING: Deprecated, please use 'df' on request instead.
[junit4] 2> 50334 INFO (coreLoadExecutor-228-thread-1-processing-n:127.0.0.1:36084_) [n:127.0.0.1:36084_ c:collection1 x:collection1] o.a.s.s.IndexSchema Loaded schema test/1.0 with uniqueid field id
[junit4] 2> 50367 INFO (coreLoadExecutor-228-thread-1-processing-n:127.0.0.1:36084_) [n:127.0.0.1:36084_ c:collection1 x:collection1] o.a.s.c.CoreContainer Creating SolrCore 'collection1' using configuration from collection collection1, trusted=true
[junit4] 2> 50374 INFO (coreLoadExecutor-228-thread-1-processing-n:127.0.0.1:36084_) [n:127.0.0.1:36084_ c:collection1 x:collection1] o.a.s.m.r.SolrJmxReporter JMX monitoring for 'solr.core.collection1.shard1.core_node2' (registry 'solr.core.collection1.shard1.core_node2') enabled at server: com.sun.jmx.mbeanserver.JmxMBeanServer@7e1e3324
[junit4] 2> 50375 INFO (coreLoadExecutor-228-thread-1-processing-n:127.0.0.1:36084_) [n:127.0.0.1:36084_ c:collection1 x:collection1] o.a.s.c.SolrCore solr.RecoveryStrategy.Builder
[junit4] 2> 50375 INFO (coreLoadExecutor-228-thread-1-processing-n:127.0.0.1:36084_) [n:127.0.0.1:36084_ c:collection1 x:collection1] o.a.s.c.SolrCore [[collection1] ] Opening new SolrCore at [/home/jenkins/workspace/Lucene-Solr-master-Linux/solr/build/solr-core/test/J2/temp/solr.cloud.SolrCloudExampleTest_8DA550B5CEC3697B-001/shard-2-001/cores/collection1], dataDir=[/home/jenkins/workspace/Lucene-Solr-master-Linux/solr/build/solr-core/test/J2/temp/solr.cloud.SolrCloudExampleTest_8DA550B5CEC3697B-001/shard-2-001/cores/collection1/data/]
[junit4] 2> 50378 INFO (coreLoadExecutor-228-thread-1-processing-n:127.0.0.1:36084_) [n:127.0.0.1:36084_ c:collection1 x:collection1] o.a.s.u.RandomMergePolicy RandomMergePolicy wrapping class org.apache.lucene.index.LogByteSizeMergePolicy: [LogByteSizeMergePolicy: minMergeSize=1677721, mergeFactor=33, maxMergeSize=2147483648, maxMergeSizeForForcedMerge=9223372036854775807, calibrateSizeByDeletes=true, maxMergeDocs=2147483647, maxCFSSegmentSizeMB=8.796093022207999E12, noCFSRatio=1.0]
[junit4] 2> 50388 WARN (coreLoadExecutor-228-thread-1-processing-n:127.0.0.1:36084_) [n:127.0.0.1:36084_ c:collection1 x:collection1] o.a.s.c.RequestHandlers INVALID paramSet a in requestHandler {type = requestHandler,name = /dump,class = DumpRequestHandler,attributes = {initParams=a, name=/dump, class=DumpRequestHandler},args = {defaults={a=A,b=B}}}
[junit4] 2> 50477 INFO (coreLoadExecutor-228-thread-1-processing-n:127.0.0.1:36084_) [n:127.0.0.1:36084_ c:collection1 x:collection1] o.a.s.u.UpdateHandler Using UpdateLog implementation: org.apache.solr.update.UpdateLog
[junit4] 2> 50477 INFO (coreLoadExecutor-228-thread-1-processing-n:127.0.0.1:36084_) [n:127.0.0.1:36084_ c:collection1 x:collection1] o.a.s.u.UpdateLog Initializing UpdateLog: dataDir= defaultSyncLevel=FLUSH numRecordsToKeep=100 maxNumLogsToKeep=10 numVersionBuckets=65536
[junit4] 2> 50479 INFO (coreLoadExecutor-228-thread-1-processing-n:127.0.0.1:36084_) [n:127.0.0.1:36084_ c:collection1 x:collection1] o.a.s.u.CommitTracker Hard AutoCommit: disabled
[junit4] 2> 50479 INFO (coreLoadExecutor-228-thread-1-processing-n:127.0.0.1:36084_) [n:127.0.0.1:36084_ c:collection1 x:collection1] o.a.s.u.CommitTracker Soft AutoCommit: disabled
[junit4] 2> 50480 INFO (coreLoadExecutor-228-thread-1-processing-n:127.0.0.1:36084_) [n:127.0.0.1:36084_ c:collection1 x:collection1] o.a.s.u.RandomMergePolicy RandomMergePolicy wrapping class org.apache.lucene.index.LogDocMergePolicy: [LogDocMergePolicy: minMergeSize=1000, mergeFactor=19, maxMergeSize=9223372036854775807, maxMergeSizeForForcedMerge=9223372036854775807, calibrateSizeByDeletes=false, maxMergeDocs=21474
[...truncated too long message...]
minOperation Checking request status for : 6
[junit4] 2> 551143 INFO (searcherExecutor-1294-thread-1-processing-x:collection1 6 RELOAD) [ x:collection1] o.a.s.h.c.SpellCheckComponent Loading spell index for spellchecker: perDict
[junit4] 2> 551143 INFO (TEST-StatsReloadRaceTest.testParallelReloadAndStats-seed#[8DA550B5CEC3697B]) [ ] o.a.s.h.a.CoreAdminOperation Checking request status for : 6
[junit4] 2> 551143 INFO (TEST-StatsReloadRaceTest.testParallelReloadAndStats-seed#[8DA550B5CEC3697B]) [ ] o.a.s.h.a.CoreAdminOperation Checking request status for : 6
[junit4] 2> 551144 INFO (TEST-StatsReloadRaceTest.testParallelReloadAndStats-seed#[8DA550B5CEC3697B]) [ ] o.a.s.h.a.CoreAdminOperation Checking request status for : 6
[junit4] 2> 551144 INFO (TEST-StatsReloadRaceTest.testParallelReloadAndStats-seed#[8DA550B5CEC3697B]) [ ] o.a.s.h.a.CoreAdminOperation Checking request status for : 6
[junit4] 2> 551144 INFO (TEST-StatsReloadRaceTest.testParallelReloadAndStats-seed#[8DA550B5CEC3697B]) [ ] o.a.s.h.a.CoreAdminOperation Checking request status for : 6
[junit4] 2> 551144 INFO (TEST-StatsReloadRaceTest.testParallelReloadAndStats-seed#[8DA550B5CEC3697B]) [ ] o.a.s.h.a.CoreAdminOperation Checking request status for : 6
[junit4] 2> 551145 INFO (TEST-StatsReloadRaceTest.testParallelReloadAndStats-seed#[8DA550B5CEC3697B]) [ ] o.a.s.h.a.CoreAdminOperation Checking request status for : 6
[junit4] 2> 551145 INFO (TEST-StatsReloadRaceTest.testParallelReloadAndStats-seed#[8DA550B5CEC3697B]) [ ] o.a.s.h.a.CoreAdminOperation Checking request status for : 6
[junit4] 2> 551145 INFO (TEST-StatsReloadRaceTest.testParallelReloadAndStats-seed#[8DA550B5CEC3697B]) [ ] o.a.s.h.a.CoreAdminOperation Checking request status for : 6
[junit4] 2> 551145 INFO (TEST-StatsReloadRaceTest.testParallelReloadAndStats-seed#[8DA550B5CEC3697B]) [ ] o.a.s.h.a.CoreAdminOperation Checking request status for : 6
[junit4] 2> 551146 INFO (TEST-StatsReloadRaceTest.testParallelReloadAndStats-seed#[8DA550B5CEC3697B]) [ ] o.a.s.h.a.CoreAdminOperation Checking request status for : 6
[junit4] 2> 551146 INFO (TEST-StatsReloadRaceTest.testParallelReloadAndStats-seed#[8DA550B5CEC3697B]) [ ] o.a.s.h.a.CoreAdminOperation Checking request status for : 6
[junit4] 2> 551146 INFO (TEST-StatsReloadRaceTest.testParallelReloadAndStats-seed#[8DA550B5CEC3697B]) [ ] o.a.s.h.a.CoreAdminOperation Checking request status for : 6
[junit4] 2> 551147 INFO (searcherExecutor-1294-thread-1-processing-x:collection1 6 RELOAD) [ x:collection1] o.a.s.c.SolrCore [collection1] Registered new searcher Searcher@73bacc0f[collection1] main{ExitableDirectoryReader(UninvertingDirectoryReader(Uninverting(_0(7.0.0):c38)))}
[junit4] 2> 551147 INFO (TEST-StatsReloadRaceTest.testParallelReloadAndStats-seed#[8DA550B5CEC3697B]) [ ] o.a.s.h.a.CoreAdminOperation Checking request status for : 6
[junit4] 2> 551159 INFO (TEST-StatsReloadRaceTest.testParallelReloadAndStats-seed#[8DA550B5CEC3697B]) [ ] o.a.s.h.a.CoreAdminOperation Checking request status for : 6
[junit4] 2> 551159 INFO (TEST-StatsReloadRaceTest.testParallelReloadAndStats-seed#[8DA550B5CEC3697B]) [ ] o.a.s.h.a.CoreAdminOperation Checking request status for : 6
[junit4] 2> 551159 INFO (parallelCoreAdminExecutor-1267-thread-6-processing-6 RELOAD) [ x:collection1] o.a.s.u.RandomMergePolicy RandomMergePolicy wrapping class org.apache.lucene.index.LogDocMergePolicy: [LogDocMergePolicy: minMergeSize=1000, mergeFactor=15, maxMergeSize=9223372036854775807, maxMergeSizeForForcedMerge=9223372036854775807, calibrateSizeByDeletes=true, maxMergeDocs=2147483647, maxCFSSegmentSizeMB=8.796093022207999E12, noCFSRatio=1.0]
[junit4] 2> 551160 INFO (TEST-StatsReloadRaceTest.testParallelReloadAndStats-seed#[8DA550B5CEC3697B]) [ ] o.a.s.h.a.CoreAdminOperation Checking request status for : 6
[junit4] 2> 551160 INFO (parallelCoreAdminExecutor-1267-thread-6-processing-6 RELOAD) [ x:collection1] o.a.s.u.DefaultSolrCoreState New IndexWriter is ready to be used.
[junit4] 2> 551160 INFO (TEST-StatsReloadRaceTest.testParallelReloadAndStats-seed#[8DA550B5CEC3697B]) [ ] o.a.s.h.a.CoreAdminOperation Checking request status for : 6
[junit4] 2> 551161 INFO (TEST-StatsReloadRaceTest.testParallelReloadAndStats-seed#[8DA550B5CEC3697B]) [ ] o.a.s.h.a.CoreAdminOperation Checking request status for : 6
[junit4] 2> 551161 INFO (parallelCoreAdminExecutor-1267-thread-6-processing-6 RELOAD) [ x:collection1] o.a.s.s.SolrIndexSearcher Opening [Searcher@2a387465[collection1] main]
[junit4] 2> 551161 INFO (TEST-StatsReloadRaceTest.testParallelReloadAndStats-seed#[8DA550B5CEC3697B]) [ ] o.a.s.h.a.CoreAdminOperation Checking request status for : 6
[junit4] 2> 551162 INFO (parallelCoreAdminExecutor-1267-thread-6-processing-6 RELOAD) [ x:collection1] o.a.s.c.SolrCore [collection1] CLOSING SolrCore org.apache.solr.core.SolrCore@c9a5513
[junit4] 2> 551163 INFO (TEST-StatsReloadRaceTest.testParallelReloadAndStats-seed#[8DA550B5CEC3697B]) [ ] o.a.s.h.a.CoreAdminOperation Checking request status for : 6
[junit4] 2> 551163 INFO (TEST-StatsReloadRaceTest.testParallelReloadAndStats-seed#[8DA550B5CEC3697B]) [ ] o.a.s.h.a.CoreAdminOperation Checking request status for : 6
[junit4] 2> 551164 INFO (TEST-StatsReloadRaceTest.testParallelReloadAndStats-seed#[8DA550B5CEC3697B]) [ ] o.a.s.h.a.CoreAdminOperation Checking request status for : 6
[junit4] 2> 551164 INFO (TEST-StatsReloadRaceTest.testParallelReloadAndStats-seed#[8DA550B5CEC3697B]) [ ] o.a.s.h.a.CoreAdminOperation Checking request status for : 6
[junit4] 2> 551165 INFO (TEST-StatsReloadRaceTest.testParallelReloadAndStats-seed#[8DA550B5CEC3697B]) [ ] o.a.s.h.a.CoreAdminOperation Checking request status for : 6
[junit4] 2> 551165 INFO (searcherExecutor-1294-thread-1-processing-x:collection1 6 RELOAD) [ x:collection1] o.a.s.c.SolrCore [collection1] Registered new searcher Searcher@2a387465[collection1] main{ExitableDirectoryReader(UninvertingDirectoryReader(Uninverting(_0(7.0.0):c38)))}
[junit4] 2> 551166 INFO (parallelCoreAdminExecutor-1267-thread-6-processing-6 RELOAD) [ x:collection1] o.a.s.m.SolrMetricManager Closing metric reporters for registry=solr.core.collection1, tag=211440915
[junit4] 2> 561173 INFO (TEST-StatsReloadRaceTest.testParallelReloadAndStats-seed#[8DA550B5CEC3697B]) [ ] o.a.s.SolrTestCaseJ4 ###Ending testParallelReloadAndStats
[junit4] 2> NOTE: reproduce with: ant test -Dtestcase=StatsReloadRaceTest -Dtests.method=testParallelReloadAndStats -Dtests.seed=8DA550B5CEC3697B -Dtests.multiplier=3 -Dtests.slow=true -Dtests.locale=is -Dtests.timezone=America/Cayenne -Dtests.asserts=true -Dtests.file.encoding=ISO-8859-1
[junit4] FAILURE 12.4s J0 | StatsReloadRaceTest.testParallelReloadAndStats <<<
[junit4] > Throwable #1: java.lang.AssertionError: Key SEARCHER.searcher.indexVersion not found in registry solr.core.collection1
[junit4] > at __randomizedtesting.SeedInfo.seed([8DA550B5CEC3697B:423B358C41320124]:0)
[junit4] > at org.apache.solr.handler.admin.StatsReloadRaceTest.requestMetrics(StatsReloadRaceTest.java:132)
[junit4] > at org.apache.solr.handler.admin.StatsReloadRaceTest.testParallelReloadAndStats(StatsReloadRaceTest.java:70)
[junit4] > at java.lang.Thread.run(Thread.java:745)
[junit4] 2> 561178 INFO (SUITE-StatsReloadRaceTest-seed#[8DA550B5CEC3697B]-worker) [ ] o.a.s.SolrTestCaseJ4 ###deleteCore
[junit4] 2> 561178 INFO (SUITE-StatsReloadRaceTest-seed#[8DA550B5CEC3697B]-worker) [ ] o.a.s.c.CoreContainer Shutting down CoreContainer instance=1052931327
[junit4] 2> 561178 INFO (SUITE-StatsReloadRaceTest-seed#[8DA550B5CEC3697B]-worker) [ ] o.a.s.m.SolrMetricManager Closing metric reporters for registry=solr.node, tag=null
[junit4] 2> 561181 INFO (SUITE-StatsReloadRaceTest-seed#[8DA550B5CEC3697B]-worker) [ ] o.a.s.m.SolrMetricManager Closing metric reporters for registry=solr.jvm, tag=null
[junit4] 2> 561182 INFO (SUITE-StatsReloadRaceTest-seed#[8DA550B5CEC3697B]-worker) [ ] o.a.s.m.SolrMetricManager Closing metric reporters for registry=solr.jetty, tag=null
[junit4] 2> 561183 INFO (SUITE-StatsReloadRaceTest-seed#[8DA550B5CEC3697B]-worker) [ ] o.a.s.c.TransientSolrCoreCacheDefault Allocating transient cache for 2147483647 transient cores
[junit4] 2> 561183 INFO (coreCloseExecutor-1298-thread-1) [ x:collection1] o.a.s.c.SolrCore [collection1] CLOSING SolrCore org.apache.solr.core.SolrCore@314d3ef
[junit4] 2> 561184 INFO (coreCloseExecutor-1298-thread-1) [ x:collection1] o.a.s.m.SolrMetricManager Closing metric reporters for registry=solr.core.collection1, tag=51696623
[junit4] 2> NOTE: leaving temporary files on disk at: /home/jenkins/workspace/Lucene-Solr-master-Linux/solr/build/solr-core/test/J0/temp/solr.handler.admin.StatsReloadRaceTest_8DA550B5CEC3697B-001
[junit4] 2> NOTE: test params are: codec=Asserting(Lucene70), sim=RandomSimilarity(queryNorm=true): {}, locale=is, timezone=America/Cayenne
[junit4] 2> NOTE: Linux 4.4.0-72-generic amd64/Oracle Corporation 1.8.0_121 (64-bit)/cpus=12,threads=1,free=276429328,total=536870912
[junit4] 2> NOTE: All tests run in this JVM: [TestInPlaceUpdatesStandalone, CollectionsAPIAsyncDistributedZkTest, TestSlowCompositeReaderWrapper, TestDynamicFieldResource, TestOmitPositions, TestFunctionQuery, ExitableDirectoryReaderTest, TestExactSharedStatsCache, TestDownShardTolerantSearch, TestRawResponseWriter, SolrShardReporterTest, TestManagedSchemaAPI, SpellingQueryConverterTest, TestInfoStreamLogging, ShardSplitTest, TestCloudSchemaless, StatsReloadRaceTest]
[junit4] Completed [152/702 (2!)] on J0 in 12.98s, 1 test, 1 failure <<< FAILURES!
[...truncated 45182 lines...]