You are viewing a plain text version of this content. The canonical link for it is here.
Posted to dev@lucene.apache.org by Policeman Jenkins Server <je...@thetaphi.de> on 2016/01/29 11:26:49 UTC

[JENKINS] Lucene-Solr-5.x-Windows (64bit/jdk1.8.0_72) - Build # 5447 - Failure!

Build: http://jenkins.thetaphi.de/job/Lucene-Solr-5.x-Windows/5447/
Java: 64bit/jdk1.8.0_72 -XX:-UseCompressedOops -XX:+UseSerialGC

3 tests failed.
FAILED:  org.apache.solr.cloud.CollectionsAPIDistributedZkTest.test

Error Message:
Error from server at http://127.0.0.1:65073: Error handling 'status' action 

Stack Trace:
org.apache.solr.client.solrj.impl.HttpSolrClient$RemoteSolrException: Error from server at http://127.0.0.1:65073: Error handling 'status' action 
	at __randomizedtesting.SeedInfo.seed([4395CD5CDB68E563:CBC1F2867594889B]:0)
	at org.apache.solr.client.solrj.impl.HttpSolrClient.executeMethod(HttpSolrClient.java:576)
	at org.apache.solr.client.solrj.impl.HttpSolrClient.request(HttpSolrClient.java:240)
	at org.apache.solr.client.solrj.impl.HttpSolrClient.request(HttpSolrClient.java:229)
	at org.apache.solr.client.solrj.SolrRequest.process(SolrRequest.java:150)
	at org.apache.solr.client.solrj.SolrRequest.process(SolrRequest.java:167)
	at org.apache.solr.client.solrj.request.CoreAdminRequest.getStatus(CoreAdminRequest.java:553)
	at org.apache.solr.cloud.CollectionsAPIDistributedZkTest.collectStartTimes(CollectionsAPIDistributedZkTest.java:976)
	at org.apache.solr.cloud.CollectionsAPIDistributedZkTest.waitForReloads(CollectionsAPIDistributedZkTest.java:935)
	at org.apache.solr.cloud.CollectionsAPIDistributedZkTest.testCollectionsAPI(CollectionsAPIDistributedZkTest.java:742)
	at org.apache.solr.cloud.CollectionsAPIDistributedZkTest.test(CollectionsAPIDistributedZkTest.java:160)
	at sun.reflect.NativeMethodAccessorImpl.invoke0(Native Method)
	at sun.reflect.NativeMethodAccessorImpl.invoke(NativeMethodAccessorImpl.java:62)
	at sun.reflect.DelegatingMethodAccessorImpl.invoke(DelegatingMethodAccessorImpl.java:43)
	at java.lang.reflect.Method.invoke(Method.java:498)
	at com.carrotsearch.randomizedtesting.RandomizedRunner.invoke(RandomizedRunner.java:1764)
	at com.carrotsearch.randomizedtesting.RandomizedRunner$8.evaluate(RandomizedRunner.java:871)
	at com.carrotsearch.randomizedtesting.RandomizedRunner$9.evaluate(RandomizedRunner.java:907)
	at com.carrotsearch.randomizedtesting.RandomizedRunner$10.evaluate(RandomizedRunner.java:921)
	at org.apache.solr.BaseDistributedSearchTestCase$ShardsRepeatRule$ShardsFixedStatement.callStatement(BaseDistributedSearchTestCase.java:965)
	at org.apache.solr.BaseDistributedSearchTestCase$ShardsRepeatRule$ShardsStatement.evaluate(BaseDistributedSearchTestCase.java:940)
	at com.carrotsearch.randomizedtesting.rules.SystemPropertiesRestoreRule$1.evaluate(SystemPropertiesRestoreRule.java:57)
	at org.apache.lucene.util.TestRuleSetupTeardownChained$1.evaluate(TestRuleSetupTeardownChained.java:50)
	at org.apache.lucene.util.AbstractBeforeAfterRule$1.evaluate(AbstractBeforeAfterRule.java:46)
	at org.apache.lucene.util.TestRuleThreadAndTestName$1.evaluate(TestRuleThreadAndTestName.java:49)
	at org.apache.lucene.util.TestRuleIgnoreAfterMaxFailures$1.evaluate(TestRuleIgnoreAfterMaxFailures.java:65)
	at org.apache.lucene.util.TestRuleMarkFailure$1.evaluate(TestRuleMarkFailure.java:48)
	at com.carrotsearch.randomizedtesting.rules.StatementAdapter.evaluate(StatementAdapter.java:36)
	at com.carrotsearch.randomizedtesting.ThreadLeakControl$StatementRunner.run(ThreadLeakControl.java:367)
	at com.carrotsearch.randomizedtesting.ThreadLeakControl.forkTimeoutingTask(ThreadLeakControl.java:809)
	at com.carrotsearch.randomizedtesting.ThreadLeakControl$3.evaluate(ThreadLeakControl.java:460)
	at com.carrotsearch.randomizedtesting.RandomizedRunner.runSingleTest(RandomizedRunner.java:880)
	at com.carrotsearch.randomizedtesting.RandomizedRunner$5.evaluate(RandomizedRunner.java:781)
	at com.carrotsearch.randomizedtesting.RandomizedRunner$6.evaluate(RandomizedRunner.java:816)
	at com.carrotsearch.randomizedtesting.RandomizedRunner$7.evaluate(RandomizedRunner.java:827)
	at com.carrotsearch.randomizedtesting.rules.StatementAdapter.evaluate(StatementAdapter.java:36)
	at com.carrotsearch.randomizedtesting.rules.SystemPropertiesRestoreRule$1.evaluate(SystemPropertiesRestoreRule.java:57)
	at org.apache.lucene.util.AbstractBeforeAfterRule$1.evaluate(AbstractBeforeAfterRule.java:46)
	at com.carrotsearch.randomizedtesting.rules.StatementAdapter.evaluate(StatementAdapter.java:36)
	at org.apache.lucene.util.TestRuleStoreClassName$1.evaluate(TestRuleStoreClassName.java:42)
	at com.carrotsearch.randomizedtesting.rules.NoShadowingOrOverridesOnMethodsRule$1.evaluate(NoShadowingOrOverridesOnMethodsRule.java:40)
	at com.carrotsearch.randomizedtesting.rules.NoShadowingOrOverridesOnMethodsRule$1.evaluate(NoShadowingOrOverridesOnMethodsRule.java:40)
	at com.carrotsearch.randomizedtesting.rules.StatementAdapter.evaluate(StatementAdapter.java:36)
	at com.carrotsearch.randomizedtesting.rules.StatementAdapter.evaluate(StatementAdapter.java:36)
	at com.carrotsearch.randomizedtesting.rules.StatementAdapter.evaluate(StatementAdapter.java:36)
	at org.apache.lucene.util.TestRuleAssertionsRequired$1.evaluate(TestRuleAssertionsRequired.java:54)
	at org.apache.lucene.util.TestRuleMarkFailure$1.evaluate(TestRuleMarkFailure.java:48)
	at org.apache.lucene.util.TestRuleIgnoreAfterMaxFailures$1.evaluate(TestRuleIgnoreAfterMaxFailures.java:65)
	at org.apache.lucene.util.TestRuleIgnoreTestSuites$1.evaluate(TestRuleIgnoreTestSuites.java:55)
	at com.carrotsearch.randomizedtesting.rules.StatementAdapter.evaluate(StatementAdapter.java:36)
	at com.carrotsearch.randomizedtesting.ThreadLeakControl$StatementRunner.run(ThreadLeakControl.java:367)
	at java.lang.Thread.run(Thread.java:745)


FAILED:  junit.framework.TestSuite.org.apache.solr.cloud.CollectionsAPIDistributedZkTest

Error Message:
6 threads leaked from SUITE scope at org.apache.solr.cloud.CollectionsAPIDistributedZkTest:     1) Thread[id=6095, name=TEST-CollectionsAPIDistributedZkTest.test-seed#[4395CD5CDB68E563]-EventThread, state=WAITING, group=TGRP-CollectionsAPIDistributedZkTest]         at sun.misc.Unsafe.park(Native Method)         at java.util.concurrent.locks.LockSupport.park(LockSupport.java:175)         at java.util.concurrent.locks.AbstractQueuedSynchronizer$ConditionObject.await(AbstractQueuedSynchronizer.java:2039)         at java.util.concurrent.LinkedBlockingQueue.take(LinkedBlockingQueue.java:442)         at org.apache.zookeeper.ClientCnxn$EventThread.run(ClientCnxn.java:494)    2) Thread[id=6094, name=TEST-CollectionsAPIDistributedZkTest.test-seed#[4395CD5CDB68E563]-SendThread(127.0.0.1:65057), state=TIMED_WAITING, group=TGRP-CollectionsAPIDistributedZkTest]         at java.lang.Thread.sleep(Native Method)         at org.apache.zookeeper.client.StaticHostProvider.next(StaticHostProvider.java:101)         at org.apache.zookeeper.ClientCnxn$SendThread.startConnect(ClientCnxn.java:940)         at org.apache.zookeeper.ClientCnxn$SendThread.run(ClientCnxn.java:1003)    3) Thread[id=6257, name=zkCallback-979-thread-3, state=TIMED_WAITING, group=TGRP-CollectionsAPIDistributedZkTest]         at sun.misc.Unsafe.park(Native Method)         at java.util.concurrent.locks.LockSupport.parkNanos(LockSupport.java:215)         at java.util.concurrent.SynchronousQueue$TransferStack.awaitFulfill(SynchronousQueue.java:460)         at java.util.concurrent.SynchronousQueue$TransferStack.transfer(SynchronousQueue.java:362)         at java.util.concurrent.SynchronousQueue.poll(SynchronousQueue.java:941)         at java.util.concurrent.ThreadPoolExecutor.getTask(ThreadPoolExecutor.java:1066)         at java.util.concurrent.ThreadPoolExecutor.runWorker(ThreadPoolExecutor.java:1127)         at java.util.concurrent.ThreadPoolExecutor$Worker.run(ThreadPoolExecutor.java:617)         at java.lang.Thread.run(Thread.java:745)    4) Thread[id=6258, name=zkCallback-979-thread-4, state=TIMED_WAITING, group=TGRP-CollectionsAPIDistributedZkTest]         at sun.misc.Unsafe.park(Native Method)         at java.util.concurrent.locks.LockSupport.parkNanos(LockSupport.java:215)         at java.util.concurrent.SynchronousQueue$TransferStack.awaitFulfill(SynchronousQueue.java:460)         at java.util.concurrent.SynchronousQueue$TransferStack.transfer(SynchronousQueue.java:362)         at java.util.concurrent.SynchronousQueue.poll(SynchronousQueue.java:941)         at java.util.concurrent.ThreadPoolExecutor.getTask(ThreadPoolExecutor.java:1066)         at java.util.concurrent.ThreadPoolExecutor.runWorker(ThreadPoolExecutor.java:1127)         at java.util.concurrent.ThreadPoolExecutor$Worker.run(ThreadPoolExecutor.java:617)         at java.lang.Thread.run(Thread.java:745)    5) Thread[id=6096, name=zkCallback-979-thread-1, state=TIMED_WAITING, group=TGRP-CollectionsAPIDistributedZkTest]         at sun.misc.Unsafe.park(Native Method)         at java.util.concurrent.locks.LockSupport.parkNanos(LockSupport.java:215)         at java.util.concurrent.SynchronousQueue$TransferStack.awaitFulfill(SynchronousQueue.java:460)         at java.util.concurrent.SynchronousQueue$TransferStack.transfer(SynchronousQueue.java:362)         at java.util.concurrent.SynchronousQueue.poll(SynchronousQueue.java:941)         at java.util.concurrent.ThreadPoolExecutor.getTask(ThreadPoolExecutor.java:1066)         at java.util.concurrent.ThreadPoolExecutor.runWorker(ThreadPoolExecutor.java:1127)         at java.util.concurrent.ThreadPoolExecutor$Worker.run(ThreadPoolExecutor.java:617)         at java.lang.Thread.run(Thread.java:745)    6) Thread[id=6237, name=zkCallback-979-thread-2, state=TIMED_WAITING, group=TGRP-CollectionsAPIDistributedZkTest]         at sun.misc.Unsafe.park(Native Method)         at java.util.concurrent.locks.LockSupport.parkNanos(LockSupport.java:215)         at java.util.concurrent.SynchronousQueue$TransferStack.awaitFulfill(SynchronousQueue.java:460)         at java.util.concurrent.SynchronousQueue$TransferStack.transfer(SynchronousQueue.java:362)         at java.util.concurrent.SynchronousQueue.poll(SynchronousQueue.java:941)         at java.util.concurrent.ThreadPoolExecutor.getTask(ThreadPoolExecutor.java:1066)         at java.util.concurrent.ThreadPoolExecutor.runWorker(ThreadPoolExecutor.java:1127)         at java.util.concurrent.ThreadPoolExecutor$Worker.run(ThreadPoolExecutor.java:617)         at java.lang.Thread.run(Thread.java:745)

Stack Trace:
com.carrotsearch.randomizedtesting.ThreadLeakError: 6 threads leaked from SUITE scope at org.apache.solr.cloud.CollectionsAPIDistributedZkTest: 
   1) Thread[id=6095, name=TEST-CollectionsAPIDistributedZkTest.test-seed#[4395CD5CDB68E563]-EventThread, state=WAITING, group=TGRP-CollectionsAPIDistributedZkTest]
        at sun.misc.Unsafe.park(Native Method)
        at java.util.concurrent.locks.LockSupport.park(LockSupport.java:175)
        at java.util.concurrent.locks.AbstractQueuedSynchronizer$ConditionObject.await(AbstractQueuedSynchronizer.java:2039)
        at java.util.concurrent.LinkedBlockingQueue.take(LinkedBlockingQueue.java:442)
        at org.apache.zookeeper.ClientCnxn$EventThread.run(ClientCnxn.java:494)
   2) Thread[id=6094, name=TEST-CollectionsAPIDistributedZkTest.test-seed#[4395CD5CDB68E563]-SendThread(127.0.0.1:65057), state=TIMED_WAITING, group=TGRP-CollectionsAPIDistributedZkTest]
        at java.lang.Thread.sleep(Native Method)
        at org.apache.zookeeper.client.StaticHostProvider.next(StaticHostProvider.java:101)
        at org.apache.zookeeper.ClientCnxn$SendThread.startConnect(ClientCnxn.java:940)
        at org.apache.zookeeper.ClientCnxn$SendThread.run(ClientCnxn.java:1003)
   3) Thread[id=6257, name=zkCallback-979-thread-3, state=TIMED_WAITING, group=TGRP-CollectionsAPIDistributedZkTest]
        at sun.misc.Unsafe.park(Native Method)
        at java.util.concurrent.locks.LockSupport.parkNanos(LockSupport.java:215)
        at java.util.concurrent.SynchronousQueue$TransferStack.awaitFulfill(SynchronousQueue.java:460)
        at java.util.concurrent.SynchronousQueue$TransferStack.transfer(SynchronousQueue.java:362)
        at java.util.concurrent.SynchronousQueue.poll(SynchronousQueue.java:941)
        at java.util.concurrent.ThreadPoolExecutor.getTask(ThreadPoolExecutor.java:1066)
        at java.util.concurrent.ThreadPoolExecutor.runWorker(ThreadPoolExecutor.java:1127)
        at java.util.concurrent.ThreadPoolExecutor$Worker.run(ThreadPoolExecutor.java:617)
        at java.lang.Thread.run(Thread.java:745)
   4) Thread[id=6258, name=zkCallback-979-thread-4, state=TIMED_WAITING, group=TGRP-CollectionsAPIDistributedZkTest]
        at sun.misc.Unsafe.park(Native Method)
        at java.util.concurrent.locks.LockSupport.parkNanos(LockSupport.java:215)
        at java.util.concurrent.SynchronousQueue$TransferStack.awaitFulfill(SynchronousQueue.java:460)
        at java.util.concurrent.SynchronousQueue$TransferStack.transfer(SynchronousQueue.java:362)
        at java.util.concurrent.SynchronousQueue.poll(SynchronousQueue.java:941)
        at java.util.concurrent.ThreadPoolExecutor.getTask(ThreadPoolExecutor.java:1066)
        at java.util.concurrent.ThreadPoolExecutor.runWorker(ThreadPoolExecutor.java:1127)
        at java.util.concurrent.ThreadPoolExecutor$Worker.run(ThreadPoolExecutor.java:617)
        at java.lang.Thread.run(Thread.java:745)
   5) Thread[id=6096, name=zkCallback-979-thread-1, state=TIMED_WAITING, group=TGRP-CollectionsAPIDistributedZkTest]
        at sun.misc.Unsafe.park(Native Method)
        at java.util.concurrent.locks.LockSupport.parkNanos(LockSupport.java:215)
        at java.util.concurrent.SynchronousQueue$TransferStack.awaitFulfill(SynchronousQueue.java:460)
        at java.util.concurrent.SynchronousQueue$TransferStack.transfer(SynchronousQueue.java:362)
        at java.util.concurrent.SynchronousQueue.poll(SynchronousQueue.java:941)
        at java.util.concurrent.ThreadPoolExecutor.getTask(ThreadPoolExecutor.java:1066)
        at java.util.concurrent.ThreadPoolExecutor.runWorker(ThreadPoolExecutor.java:1127)
        at java.util.concurrent.ThreadPoolExecutor$Worker.run(ThreadPoolExecutor.java:617)
        at java.lang.Thread.run(Thread.java:745)
   6) Thread[id=6237, name=zkCallback-979-thread-2, state=TIMED_WAITING, group=TGRP-CollectionsAPIDistributedZkTest]
        at sun.misc.Unsafe.park(Native Method)
        at java.util.concurrent.locks.LockSupport.parkNanos(LockSupport.java:215)
        at java.util.concurrent.SynchronousQueue$TransferStack.awaitFulfill(SynchronousQueue.java:460)
        at java.util.concurrent.SynchronousQueue$TransferStack.transfer(SynchronousQueue.java:362)
        at java.util.concurrent.SynchronousQueue.poll(SynchronousQueue.java:941)
        at java.util.concurrent.ThreadPoolExecutor.getTask(ThreadPoolExecutor.java:1066)
        at java.util.concurrent.ThreadPoolExecutor.runWorker(ThreadPoolExecutor.java:1127)
        at java.util.concurrent.ThreadPoolExecutor$Worker.run(ThreadPoolExecutor.java:617)
        at java.lang.Thread.run(Thread.java:745)
	at __randomizedtesting.SeedInfo.seed([4395CD5CDB68E563]:0)


FAILED:  junit.framework.TestSuite.org.apache.solr.cloud.CollectionsAPIDistributedZkTest

Error Message:
There are still zombie threads that couldn't be terminated:    1) Thread[id=6094, name=TEST-CollectionsAPIDistributedZkTest.test-seed#[4395CD5CDB68E563]-SendThread(127.0.0.1:65057), state=TIMED_WAITING, group=TGRP-CollectionsAPIDistributedZkTest]         at java.lang.Thread.sleep(Native Method)         at org.apache.zookeeper.client.StaticHostProvider.next(StaticHostProvider.java:101)         at org.apache.zookeeper.ClientCnxn$SendThread.startConnect(ClientCnxn.java:940)         at org.apache.zookeeper.ClientCnxn$SendThread.run(ClientCnxn.java:1003)    2) Thread[id=6257, name=zkCallback-979-thread-3, state=TIMED_WAITING, group=TGRP-CollectionsAPIDistributedZkTest]         at sun.misc.Unsafe.park(Native Method)         at java.util.concurrent.locks.LockSupport.parkNanos(LockSupport.java:215)         at java.util.concurrent.SynchronousQueue$TransferStack.awaitFulfill(SynchronousQueue.java:460)         at java.util.concurrent.SynchronousQueue$TransferStack.transfer(SynchronousQueue.java:362)         at java.util.concurrent.SynchronousQueue.poll(SynchronousQueue.java:941)         at java.util.concurrent.ThreadPoolExecutor.getTask(ThreadPoolExecutor.java:1066)         at java.util.concurrent.ThreadPoolExecutor.runWorker(ThreadPoolExecutor.java:1127)         at java.util.concurrent.ThreadPoolExecutor$Worker.run(ThreadPoolExecutor.java:617)         at java.lang.Thread.run(Thread.java:745)    3) Thread[id=6258, name=zkCallback-979-thread-4, state=TIMED_WAITING, group=TGRP-CollectionsAPIDistributedZkTest]         at sun.misc.Unsafe.park(Native Method)         at java.util.concurrent.locks.LockSupport.parkNanos(LockSupport.java:215)         at java.util.concurrent.SynchronousQueue$TransferStack.awaitFulfill(SynchronousQueue.java:460)         at java.util.concurrent.SynchronousQueue$TransferStack.transfer(SynchronousQueue.java:362)         at java.util.concurrent.SynchronousQueue.poll(SynchronousQueue.java:941)         at java.util.concurrent.ThreadPoolExecutor.getTask(ThreadPoolExecutor.java:1066)         at java.util.concurrent.ThreadPoolExecutor.runWorker(ThreadPoolExecutor.java:1127)         at java.util.concurrent.ThreadPoolExecutor$Worker.run(ThreadPoolExecutor.java:617)         at java.lang.Thread.run(Thread.java:745)    4) Thread[id=6096, name=zkCallback-979-thread-1, state=TIMED_WAITING, group=TGRP-CollectionsAPIDistributedZkTest]         at sun.misc.Unsafe.park(Native Method)         at java.util.concurrent.locks.LockSupport.parkNanos(LockSupport.java:215)         at java.util.concurrent.SynchronousQueue$TransferStack.awaitFulfill(SynchronousQueue.java:460)         at java.util.concurrent.SynchronousQueue$TransferStack.transfer(SynchronousQueue.java:362)         at java.util.concurrent.SynchronousQueue.poll(SynchronousQueue.java:941)         at java.util.concurrent.ThreadPoolExecutor.getTask(ThreadPoolExecutor.java:1066)         at java.util.concurrent.ThreadPoolExecutor.runWorker(ThreadPoolExecutor.java:1127)         at java.util.concurrent.ThreadPoolExecutor$Worker.run(ThreadPoolExecutor.java:617)         at java.lang.Thread.run(Thread.java:745)    5) Thread[id=6237, name=zkCallback-979-thread-2, state=TIMED_WAITING, group=TGRP-CollectionsAPIDistributedZkTest]         at sun.misc.Unsafe.park(Native Method)         at java.util.concurrent.locks.LockSupport.parkNanos(LockSupport.java:215)         at java.util.concurrent.SynchronousQueue$TransferStack.awaitFulfill(SynchronousQueue.java:460)         at java.util.concurrent.SynchronousQueue$TransferStack.transfer(SynchronousQueue.java:362)         at java.util.concurrent.SynchronousQueue.poll(SynchronousQueue.java:941)         at java.util.concurrent.ThreadPoolExecutor.getTask(ThreadPoolExecutor.java:1066)         at java.util.concurrent.ThreadPoolExecutor.runWorker(ThreadPoolExecutor.java:1127)         at java.util.concurrent.ThreadPoolExecutor$Worker.run(ThreadPoolExecutor.java:617)         at java.lang.Thread.run(Thread.java:745)

Stack Trace:
com.carrotsearch.randomizedtesting.ThreadLeakError: There are still zombie threads that couldn't be terminated:
   1) Thread[id=6094, name=TEST-CollectionsAPIDistributedZkTest.test-seed#[4395CD5CDB68E563]-SendThread(127.0.0.1:65057), state=TIMED_WAITING, group=TGRP-CollectionsAPIDistributedZkTest]
        at java.lang.Thread.sleep(Native Method)
        at org.apache.zookeeper.client.StaticHostProvider.next(StaticHostProvider.java:101)
        at org.apache.zookeeper.ClientCnxn$SendThread.startConnect(ClientCnxn.java:940)
        at org.apache.zookeeper.ClientCnxn$SendThread.run(ClientCnxn.java:1003)
   2) Thread[id=6257, name=zkCallback-979-thread-3, state=TIMED_WAITING, group=TGRP-CollectionsAPIDistributedZkTest]
        at sun.misc.Unsafe.park(Native Method)
        at java.util.concurrent.locks.LockSupport.parkNanos(LockSupport.java:215)
        at java.util.concurrent.SynchronousQueue$TransferStack.awaitFulfill(SynchronousQueue.java:460)
        at java.util.concurrent.SynchronousQueue$TransferStack.transfer(SynchronousQueue.java:362)
        at java.util.concurrent.SynchronousQueue.poll(SynchronousQueue.java:941)
        at java.util.concurrent.ThreadPoolExecutor.getTask(ThreadPoolExecutor.java:1066)
        at java.util.concurrent.ThreadPoolExecutor.runWorker(ThreadPoolExecutor.java:1127)
        at java.util.concurrent.ThreadPoolExecutor$Worker.run(ThreadPoolExecutor.java:617)
        at java.lang.Thread.run(Thread.java:745)
   3) Thread[id=6258, name=zkCallback-979-thread-4, state=TIMED_WAITING, group=TGRP-CollectionsAPIDistributedZkTest]
        at sun.misc.Unsafe.park(Native Method)
        at java.util.concurrent.locks.LockSupport.parkNanos(LockSupport.java:215)
        at java.util.concurrent.SynchronousQueue$TransferStack.awaitFulfill(SynchronousQueue.java:460)
        at java.util.concurrent.SynchronousQueue$TransferStack.transfer(SynchronousQueue.java:362)
        at java.util.concurrent.SynchronousQueue.poll(SynchronousQueue.java:941)
        at java.util.concurrent.ThreadPoolExecutor.getTask(ThreadPoolExecutor.java:1066)
        at java.util.concurrent.ThreadPoolExecutor.runWorker(ThreadPoolExecutor.java:1127)
        at java.util.concurrent.ThreadPoolExecutor$Worker.run(ThreadPoolExecutor.java:617)
        at java.lang.Thread.run(Thread.java:745)
   4) Thread[id=6096, name=zkCallback-979-thread-1, state=TIMED_WAITING, group=TGRP-CollectionsAPIDistributedZkTest]
        at sun.misc.Unsafe.park(Native Method)
        at java.util.concurrent.locks.LockSupport.parkNanos(LockSupport.java:215)
        at java.util.concurrent.SynchronousQueue$TransferStack.awaitFulfill(SynchronousQueue.java:460)
        at java.util.concurrent.SynchronousQueue$TransferStack.transfer(SynchronousQueue.java:362)
        at java.util.concurrent.SynchronousQueue.poll(SynchronousQueue.java:941)
        at java.util.concurrent.ThreadPoolExecutor.getTask(ThreadPoolExecutor.java:1066)
        at java.util.concurrent.ThreadPoolExecutor.runWorker(ThreadPoolExecutor.java:1127)
        at java.util.concurrent.ThreadPoolExecutor$Worker.run(ThreadPoolExecutor.java:617)
        at java.lang.Thread.run(Thread.java:745)
   5) Thread[id=6237, name=zkCallback-979-thread-2, state=TIMED_WAITING, group=TGRP-CollectionsAPIDistributedZkTest]
        at sun.misc.Unsafe.park(Native Method)
        at java.util.concurrent.locks.LockSupport.parkNanos(LockSupport.java:215)
        at java.util.concurrent.SynchronousQueue$TransferStack.awaitFulfill(SynchronousQueue.java:460)
        at java.util.concurrent.SynchronousQueue$TransferStack.transfer(SynchronousQueue.java:362)
        at java.util.concurrent.SynchronousQueue.poll(SynchronousQueue.java:941)
        at java.util.concurrent.ThreadPoolExecutor.getTask(ThreadPoolExecutor.java:1066)
        at java.util.concurrent.ThreadPoolExecutor.runWorker(ThreadPoolExecutor.java:1127)
        at java.util.concurrent.ThreadPoolExecutor$Worker.run(ThreadPoolExecutor.java:617)
        at java.lang.Thread.run(Thread.java:745)
	at __randomizedtesting.SeedInfo.seed([4395CD5CDB68E563]:0)




Build Log:
[...truncated 10927 lines...]
   [junit4] Suite: org.apache.solr.cloud.CollectionsAPIDistributedZkTest
   [junit4]   2> Creating dataDir: C:\Users\JenkinsSlave\workspace\Lucene-Solr-5.x-Windows\solr\build\solr-core\test\J1\temp\solr.cloud.CollectionsAPIDistributedZkTest_4395CD5CDB68E563-001\init-core-data-001
   [junit4]   2> 697223 INFO  (SUITE-CollectionsAPIDistributedZkTest-seed#[4395CD5CDB68E563]-worker) [    ] o.a.s.SolrTestCaseJ4 Randomized ssl (false) and clientAuth (false)
   [junit4]   2> 697223 INFO  (SUITE-CollectionsAPIDistributedZkTest-seed#[4395CD5CDB68E563]-worker) [    ] o.a.s.BaseDistributedSearchTestCase Setting hostContext system property: /
   [junit4]   2> 697226 INFO  (TEST-CollectionsAPIDistributedZkTest.test-seed#[4395CD5CDB68E563]) [    ] o.a.s.c.ZkTestServer STARTING ZK TEST SERVER
   [junit4]   2> 697226 INFO  (Thread-2344) [    ] o.a.s.c.ZkTestServer client port:0.0.0.0/0.0.0.0:0
   [junit4]   2> 697226 INFO  (Thread-2344) [    ] o.a.s.c.ZkTestServer Starting server
   [junit4]   2> 697326 INFO  (TEST-CollectionsAPIDistributedZkTest.test-seed#[4395CD5CDB68E563]) [    ] o.a.s.c.ZkTestServer start zk server on port:65057
   [junit4]   2> 697326 INFO  (TEST-CollectionsAPIDistributedZkTest.test-seed#[4395CD5CDB68E563]) [    ] o.a.s.c.c.SolrZkClient Using default ZkCredentialsProvider
   [junit4]   2> 697327 INFO  (TEST-CollectionsAPIDistributedZkTest.test-seed#[4395CD5CDB68E563]) [    ] o.a.s.c.c.ConnectionManager Waiting for client to connect to ZooKeeper
   [junit4]   2> 697331 INFO  (zkCallback-941-thread-1) [    ] o.a.s.c.c.ConnectionManager Watcher org.apache.solr.common.cloud.ConnectionManager@30bf0708 name:ZooKeeperConnection Watcher:127.0.0.1:65057 got event WatchedEvent state:SyncConnected type:None path:null path:null type:None
   [junit4]   2> 697331 INFO  (TEST-CollectionsAPIDistributedZkTest.test-seed#[4395CD5CDB68E563]) [    ] o.a.s.c.c.ConnectionManager Client is connected to ZooKeeper
   [junit4]   2> 697331 INFO  (TEST-CollectionsAPIDistributedZkTest.test-seed#[4395CD5CDB68E563]) [    ] o.a.s.c.c.SolrZkClient Using default ZkACLProvider
   [junit4]   2> 697331 INFO  (TEST-CollectionsAPIDistributedZkTest.test-seed#[4395CD5CDB68E563]) [    ] o.a.s.c.c.SolrZkClient makePath: /solr
   [junit4]   2> 697334 INFO  (TEST-CollectionsAPIDistributedZkTest.test-seed#[4395CD5CDB68E563]) [    ] o.a.s.c.c.SolrZkClient Using default ZkCredentialsProvider
   [junit4]   2> 697335 INFO  (TEST-CollectionsAPIDistributedZkTest.test-seed#[4395CD5CDB68E563]) [    ] o.a.s.c.c.ConnectionManager Waiting for client to connect to ZooKeeper
   [junit4]   2> 697335 WARN  (NIOServerCxn.Factory:0.0.0.0/0.0.0.0:0) [    ] o.a.z.s.NIOServerCnxn caught end of stream exception
   [junit4]   2> EndOfStreamException: Unable to read additional data from client sessionid 0x1528cdfc1d10000, likely client has closed socket
   [junit4]   2> 	at org.apache.zookeeper.server.NIOServerCnxn.doIO(NIOServerCnxn.java:228)
   [junit4]   2> 	at org.apache.zookeeper.server.NIOServerCnxnFactory.run(NIOServerCnxnFactory.java:208)
   [junit4]   2> 	at java.lang.Thread.run(Thread.java:745)
   [junit4]   2> 697338 INFO  (zkCallback-942-thread-1) [    ] o.a.s.c.c.ConnectionManager Watcher org.apache.solr.common.cloud.ConnectionManager@4b923710 name:ZooKeeperConnection Watcher:127.0.0.1:65057/solr got event WatchedEvent state:SyncConnected type:None path:null path:null type:None
   [junit4]   2> 697338 INFO  (TEST-CollectionsAPIDistributedZkTest.test-seed#[4395CD5CDB68E563]) [    ] o.a.s.c.c.ConnectionManager Client is connected to ZooKeeper
   [junit4]   2> 697338 INFO  (TEST-CollectionsAPIDistributedZkTest.test-seed#[4395CD5CDB68E563]) [    ] o.a.s.c.c.SolrZkClient Using default ZkACLProvider
   [junit4]   2> 697339 INFO  (TEST-CollectionsAPIDistributedZkTest.test-seed#[4395CD5CDB68E563]) [    ] o.a.s.c.c.SolrZkClient makePath: /collections/collection1
   [junit4]   2> 697346 INFO  (TEST-CollectionsAPIDistributedZkTest.test-seed#[4395CD5CDB68E563]) [    ] o.a.s.c.c.SolrZkClient makePath: /collections/collection1/shards
   [junit4]   2> 697348 INFO  (TEST-CollectionsAPIDistributedZkTest.test-seed#[4395CD5CDB68E563]) [    ] o.a.s.c.c.SolrZkClient makePath: /collections/control_collection
   [junit4]   2> 697355 INFO  (TEST-CollectionsAPIDistributedZkTest.test-seed#[4395CD5CDB68E563]) [    ] o.a.s.c.c.SolrZkClient makePath: /collections/control_collection/shards
   [junit4]   2> 697356 INFO  (TEST-CollectionsAPIDistributedZkTest.test-seed#[4395CD5CDB68E563]) [    ] o.a.s.c.AbstractZkTestCase put C:\Users\JenkinsSlave\workspace\Lucene-Solr-5.x-Windows\solr\core\src\test-files\solr\collection1\conf\solrconfig-tlog.xml to /configs/conf1/solrconfig.xml
   [junit4]   2> 697356 INFO  (TEST-CollectionsAPIDistributedZkTest.test-seed#[4395CD5CDB68E563]) [    ] o.a.s.c.c.SolrZkClient makePath: /configs/conf1/solrconfig.xml
   [junit4]   2> 697358 INFO  (TEST-CollectionsAPIDistributedZkTest.test-seed#[4395CD5CDB68E563]) [    ] o.a.s.c.AbstractZkTestCase put C:\Users\JenkinsSlave\workspace\Lucene-Solr-5.x-Windows\solr\core\src\test-files\solr\collection1\conf\schema.xml to /configs/conf1/schema.xml
   [junit4]   2> 697358 INFO  (TEST-CollectionsAPIDistributedZkTest.test-seed#[4395CD5CDB68E563]) [    ] o.a.s.c.c.SolrZkClient makePath: /configs/conf1/schema.xml
   [junit4]   2> 697361 INFO  (TEST-CollectionsAPIDistributedZkTest.test-seed#[4395CD5CDB68E563]) [    ] o.a.s.c.AbstractZkTestCase put C:\Users\JenkinsSlave\workspace\Lucene-Solr-5.x-Windows\solr\core\src\test-files\solr\collection1\conf\solrconfig.snippet.randomindexconfig.xml to /configs/conf1/solrconfig.snippet.randomindexconfig.xml
   [junit4]   2> 697361 INFO  (TEST-CollectionsAPIDistributedZkTest.test-seed#[4395CD5CDB68E563]) [    ] o.a.s.c.c.SolrZkClient makePath: /configs/conf1/solrconfig.snippet.randomindexconfig.xml
   [junit4]   2> 697363 INFO  (TEST-CollectionsAPIDistributedZkTest.test-seed#[4395CD5CDB68E563]) [    ] o.a.s.c.AbstractZkTestCase put C:\Users\JenkinsSlave\workspace\Lucene-Solr-5.x-Windows\solr\core\src\test-files\solr\collection1\conf\stopwords.txt to /configs/conf1/stopwords.txt
   [junit4]   2> 697363 INFO  (TEST-CollectionsAPIDistributedZkTest.test-seed#[4395CD5CDB68E563]) [    ] o.a.s.c.c.SolrZkClient makePath: /configs/conf1/stopwords.txt
   [junit4]   2> 697365 INFO  (TEST-CollectionsAPIDistributedZkTest.test-seed#[4395CD5CDB68E563]) [    ] o.a.s.c.AbstractZkTestCase put C:\Users\JenkinsSlave\workspace\Lucene-Solr-5.x-Windows\solr\core\src\test-files\solr\collection1\conf\protwords.txt to /configs/conf1/protwords.txt
   [junit4]   2> 697365 INFO  (TEST-CollectionsAPIDistributedZkTest.test-seed#[4395CD5CDB68E563]) [    ] o.a.s.c.c.SolrZkClient makePath: /configs/conf1/protwords.txt
   [junit4]   2> 697367 INFO  (TEST-CollectionsAPIDistributedZkTest.test-seed#[4395CD5CDB68E563]) [    ] o.a.s.c.AbstractZkTestCase put C:\Users\JenkinsSlave\workspace\Lucene-Solr-5.x-Windows\solr\core\src\test-files\solr\collection1\conf\currency.xml to /configs/conf1/currency.xml
   [junit4]   2> 697367 INFO  (TEST-CollectionsAPIDistributedZkTest.test-seed#[4395CD5CDB68E563]) [    ] o.a.s.c.c.SolrZkClient makePath: /configs/conf1/currency.xml
   [junit4]   2> 697368 INFO  (TEST-CollectionsAPIDistributedZkTest.test-seed#[4395CD5CDB68E563]) [    ] o.a.s.c.AbstractZkTestCase put C:\Users\JenkinsSlave\workspace\Lucene-Solr-5.x-Windows\solr\core\src\test-files\solr\collection1\conf\enumsConfig.xml to /configs/conf1/enumsConfig.xml
   [junit4]   2> 697369 INFO  (TEST-CollectionsAPIDistributedZkTest.test-seed#[4395CD5CDB68E563]) [    ] o.a.s.c.c.SolrZkClient makePath: /configs/conf1/enumsConfig.xml
   [junit4]   2> 697371 INFO  (TEST-CollectionsAPIDistributedZkTest.test-seed#[4395CD5CDB68E563]) [    ] o.a.s.c.AbstractZkTestCase put C:\Users\JenkinsSlave\workspace\Lucene-Solr-5.x-Windows\solr\core\src\test-files\solr\collection1\conf\open-exchange-rates.json to /configs/conf1/open-exchange-rates.json
   [junit4]   2> 697371 INFO  (TEST-CollectionsAPIDistributedZkTest.test-seed#[4395CD5CDB68E563]) [    ] o.a.s.c.c.SolrZkClient makePath: /configs/conf1/open-exchange-rates.json
   [junit4]   2> 697373 INFO  (TEST-CollectionsAPIDistributedZkTest.test-seed#[4395CD5CDB68E563]) [    ] o.a.s.c.AbstractZkTestCase put C:\Users\JenkinsSlave\workspace\Lucene-Solr-5.x-Windows\solr\core\src\test-files\solr\collection1\conf\mapping-ISOLatin1Accent.txt to /configs/conf1/mapping-ISOLatin1Accent.txt
   [junit4]   2> 697373 INFO  (TEST-CollectionsAPIDistributedZkTest.test-seed#[4395CD5CDB68E563]) [    ] o.a.s.c.c.SolrZkClient makePath: /configs/conf1/mapping-ISOLatin1Accent.txt
   [junit4]   2> 697374 INFO  (TEST-CollectionsAPIDistributedZkTest.test-seed#[4395CD5CDB68E563]) [    ] o.a.s.c.AbstractZkTestCase put C:\Users\JenkinsSlave\workspace\Lucene-Solr-5.x-Windows\solr\core\src\test-files\solr\collection1\conf\old_synonyms.txt to /configs/conf1/old_synonyms.txt
   [junit4]   2> 697375 INFO  (TEST-CollectionsAPIDistributedZkTest.test-seed#[4395CD5CDB68E563]) [    ] o.a.s.c.c.SolrZkClient makePath: /configs/conf1/old_synonyms.txt
   [junit4]   2> 697376 INFO  (TEST-CollectionsAPIDistributedZkTest.test-seed#[4395CD5CDB68E563]) [    ] o.a.s.c.AbstractZkTestCase put C:\Users\JenkinsSlave\workspace\Lucene-Solr-5.x-Windows\solr\core\src\test-files\solr\collection1\conf\synonyms.txt to /configs/conf1/synonyms.txt
   [junit4]   2> 697377 INFO  (TEST-CollectionsAPIDistributedZkTest.test-seed#[4395CD5CDB68E563]) [    ] o.a.s.c.c.SolrZkClient makePath: /configs/conf1/synonyms.txt
   [junit4]   2> 697379 WARN  (NIOServerCxn.Factory:0.0.0.0/0.0.0.0:0) [    ] o.a.z.s.NIOServerCnxn caught end of stream exception
   [junit4]   2> EndOfStreamException: Unable to read additional data from client sessionid 0x1528cdfc1d10001, likely client has closed socket
   [junit4]   2> 	at org.apache.zookeeper.server.NIOServerCnxn.doIO(NIOServerCnxn.java:228)
   [junit4]   2> 	at org.apache.zookeeper.server.NIOServerCnxnFactory.run(NIOServerCnxnFactory.java:208)
   [junit4]   2> 	at java.lang.Thread.run(Thread.java:745)
   [junit4]   2> 697381 INFO  (TEST-CollectionsAPIDistributedZkTest.test-seed#[4395CD5CDB68E563]) [    ] o.a.s.c.c.SolrZkClient Using default ZkCredentialsProvider
   [junit4]   2> 697382 INFO  (TEST-CollectionsAPIDistributedZkTest.test-seed#[4395CD5CDB68E563]) [    ] o.a.s.c.c.ConnectionManager Waiting for client to connect to ZooKeeper
   [junit4]   2> 697383 INFO  (zkCallback-943-thread-1) [    ] o.a.s.c.c.ConnectionManager Watcher org.apache.solr.common.cloud.ConnectionManager@4b056d5a name:ZooKeeperConnection Watcher:127.0.0.1:65057 got event WatchedEvent state:SyncConnected type:None path:null path:null type:None
   [junit4]   2> 697383 INFO  (TEST-CollectionsAPIDistributedZkTest.test-seed#[4395CD5CDB68E563]) [    ] o.a.s.c.c.ConnectionManager Client is connected to ZooKeeper
   [junit4]   2> 697383 INFO  (TEST-CollectionsAPIDistributedZkTest.test-seed#[4395CD5CDB68E563]) [    ] o.a.s.c.c.SolrZkClient Using default ZkACLProvider
   [junit4]   2> 697383 INFO  (TEST-CollectionsAPIDistributedZkTest.test-seed#[4395CD5CDB68E563]) [    ] o.a.s.c.c.SolrZkClient makePath: /solr
   [junit4]   2> 697385 INFO  (TEST-CollectionsAPIDistributedZkTest.test-seed#[4395CD5CDB68E563]) [    ] o.a.s.c.c.SolrZkClient Using default ZkCredentialsProvider
   [junit4]   2> 697387 INFO  (TEST-CollectionsAPIDistributedZkTest.test-seed#[4395CD5CDB68E563]) [    ] o.a.s.c.c.ConnectionManager Waiting for client to connect to ZooKeeper
   [junit4]   2> 697388 INFO  (zkCallback-944-thread-1) [    ] o.a.s.c.c.ConnectionManager Watcher org.apache.solr.common.cloud.ConnectionManager@7d58c0e3 name:ZooKeeperConnection Watcher:127.0.0.1:65057/solr got event WatchedEvent state:SyncConnected type:None path:null path:null type:None
   [junit4]   2> 697388 INFO  (TEST-CollectionsAPIDistributedZkTest.test-seed#[4395CD5CDB68E563]) [    ] o.a.s.c.c.ConnectionManager Client is connected to ZooKeeper
   [junit4]   2> 697388 INFO  (TEST-CollectionsAPIDistributedZkTest.test-seed#[4395CD5CDB68E563]) [    ] o.a.s.c.c.SolrZkClient Using default ZkACLProvider
   [junit4]   2> 697389 INFO  (TEST-CollectionsAPIDistributedZkTest.test-seed#[4395CD5CDB68E563]) [    ] o.a.s.c.AbstractZkTestCase put C:\Users\JenkinsSlave\workspace\Lucene-Solr-5.x-Windows\solr\core\src\test-files\solr\collection1\conf\solrconfig-tlog.xml to /configs/conf2/solrconfig.xml
   [junit4]   2> 697389 INFO  (TEST-CollectionsAPIDistributedZkTest.test-seed#[4395CD5CDB68E563]) [    ] o.a.s.c.c.SolrZkClient makePath: /configs/conf2/solrconfig.xml
   [junit4]   2> 697390 INFO  (TEST-CollectionsAPIDistributedZkTest.test-seed#[4395CD5CDB68E563]) [    ] o.a.s.c.AbstractZkTestCase put C:\Users\JenkinsSlave\workspace\Lucene-Solr-5.x-Windows\solr\core\src\test-files\solr\collection1\conf\schema.xml to /configs/conf2/schema.xml
   [junit4]   2> 697391 INFO  (TEST-CollectionsAPIDistributedZkTest.test-seed#[4395CD5CDB68E563]) [    ] o.a.s.c.c.SolrZkClient makePath: /configs/conf2/schema.xml
   [junit4]   2> 697392 INFO  (TEST-CollectionsAPIDistributedZkTest.test-seed#[4395CD5CDB68E563]) [    ] o.a.s.c.AbstractZkTestCase put C:\Users\JenkinsSlave\workspace\Lucene-Solr-5.x-Windows\solr\core\src\test-files\solr\collection1\conf\enumsConfig.xml to /configs/conf2/enumsConfig.xml
   [junit4]   2> 697392 INFO  (TEST-CollectionsAPIDistributedZkTest.test-seed#[4395CD5CDB68E563]) [    ] o.a.s.c.c.SolrZkClient makePath: /configs/conf2/enumsConfig.xml
   [junit4]   2> 697394 INFO  (TEST-CollectionsAPIDistributedZkTest.test-seed#[4395CD5CDB68E563]) [    ] o.a.s.c.AbstractZkTestCase put C:\Users\JenkinsSlave\workspace\Lucene-Solr-5.x-Windows\solr\core\src\test-files\solr\collection1\conf\solrconfig.snippet.randomindexconfig.xml to /configs/conf2/solrconfig.snippet.randomindexconfig.xml
   [junit4]   2> 697395 INFO  (TEST-CollectionsAPIDistributedZkTest.test-seed#[4395CD5CDB68E563]) [    ] o.a.s.c.c.SolrZkClient makePath: /configs/conf2/solrconfig.snippet.randomindexconfig.xml
   [junit4]   2> 697397 INFO  (TEST-CollectionsAPIDistributedZkTest.test-seed#[4395CD5CDB68E563]) [    ] o.a.s.c.AbstractZkTestCase put C:\Users\JenkinsSlave\workspace\Lucene-Solr-5.x-Windows\solr\core\src\test-files\solr\collection1\conf\stopwords.txt to /configs/conf2/stopwords.txt
   [junit4]   2> 697397 INFO  (TEST-CollectionsAPIDistributedZkTest.test-seed#[4395CD5CDB68E563]) [    ] o.a.s.c.c.SolrZkClient makePath: /configs/conf2/stopwords.txt
   [junit4]   2> 697398 INFO  (TEST-CollectionsAPIDistributedZkTest.test-seed#[4395CD5CDB68E563]) [    ] o.a.s.c.AbstractZkTestCase put C:\Users\JenkinsSlave\workspace\Lucene-Solr-5.x-Windows\solr\core\src\test-files\solr\collection1\conf\protwords.txt to /configs/conf2/protwords.txt
   [junit4]   2> 697398 INFO  (TEST-CollectionsAPIDistributedZkTest.test-seed#[4395CD5CDB68E563]) [    ] o.a.s.c.c.SolrZkClient makePath: /configs/conf2/protwords.txt
   [junit4]   2> 697398 INFO  (TEST-CollectionsAPIDistributedZkTest.test-seed#[4395CD5CDB68E563]) [    ] o.a.s.c.AbstractZkTestCase put C:\Users\JenkinsSlave\workspace\Lucene-Solr-5.x-Windows\solr\core\src\test-files\solr\collection1\conf\currency.xml to /configs/conf2/currency.xml
   [junit4]   2> 697399 INFO  (TEST-CollectionsAPIDistributedZkTest.test-seed#[4395CD5CDB68E563]) [    ] o.a.s.c.c.SolrZkClient makePath: /configs/conf2/currency.xml
   [junit4]   2> 697400 INFO  (TEST-CollectionsAPIDistributedZkTest.test-seed#[4395CD5CDB68E563]) [    ] o.a.s.c.AbstractZkTestCase put C:\Users\JenkinsSlave\workspace\Lucene-Solr-5.x-Windows\solr\core\src\test-files\solr\collection1\conf\open-exchange-rates.json to /configs/conf2/open-exchange-rates.json
   [junit4]   2> 697400 INFO  (TEST-CollectionsAPIDistributedZkTest.test-seed#[4395CD5CDB68E563]) [    ] o.a.s.c.c.SolrZkClient makePath: /configs/conf2/open-exchange-rates.json
   [junit4]   2> 697401 INFO  (TEST-CollectionsAPIDistributedZkTest.test-seed#[4395CD5CDB68E563]) [    ] o.a.s.c.AbstractZkTestCase put C:\Users\JenkinsSlave\workspace\Lucene-Solr-5.x-Windows\solr\core\src\test-files\solr\collection1\conf\mapping-ISOLatin1Accent.txt to /configs/conf2/mapping-ISOLatin1Accent.txt
   [junit4]   2> 697402 INFO  (TEST-CollectionsAPIDistributedZkTest.test-seed#[4395CD5CDB68E563]) [    ] o.a.s.c.c.SolrZkClient makePath: /configs/conf2/mapping-ISOLatin1Accent.txt
   [junit4]   2> 697404 INFO  (TEST-CollectionsAPIDistributedZkTest.test-seed#[4395CD5CDB68E563]) [    ] o.a.s.c.AbstractZkTestCase put C:\Users\JenkinsSlave\workspace\Lucene-Solr-5.x-Windows\solr\core\src\test-files\solr\collection1\conf\old_synonyms.txt to /configs/conf2/old_synonyms.txt
   [junit4]   2> 697404 INFO  (TEST-CollectionsAPIDistributedZkTest.test-seed#[4395CD5CDB68E563]) [    ] o.a.s.c.c.SolrZkClient makePath: /configs/conf2/old_synonyms.txt
   [junit4]   2> 697406 INFO  (TEST-CollectionsAPIDistributedZkTest.test-seed#[4395CD5CDB68E563]) [    ] o.a.s.c.AbstractZkTestCase put C:\Users\JenkinsSlave\workspace\Lucene-Solr-5.x-Windows\solr\core\src\test-files\solr\collection1\conf\synonyms.txt to /configs/conf2/synonyms.txt
   [junit4]   2> 697406 INFO  (TEST-CollectionsAPIDistributedZkTest.test-seed#[4395CD5CDB68E563]) [    ] o.a.s.c.c.SolrZkClient makePath: /configs/conf2/synonyms.txt
   [junit4]   2> 697407 INFO  (TEST-CollectionsAPIDistributedZkTest.test-seed#[4395CD5CDB68E563]) [    ] o.a.s.c.AbstractZkTestCase put C:\Users\JenkinsSlave\workspace\Lucene-Solr-5.x-Windows\solr\core\src\test-files\solr\collection1\conf\elevate.xml to /configs/conf2/elevate.xml
   [junit4]   2> 697408 INFO  (TEST-CollectionsAPIDistributedZkTest.test-seed#[4395CD5CDB68E563]) [    ] o.a.s.c.c.SolrZkClient makePath: /configs/conf2/elevate.xml
   [junit4]   2> 697410 WARN  (NIOServerCxn.Factory:0.0.0.0/0.0.0.0:0) [    ] o.a.z.s.NIOServerCnxn caught end of stream exception
   [junit4]   2> EndOfStreamException: Unable to read additional data from client sessionid 0x1528cdfc1d10003, likely client has closed socket
   [junit4]   2> 	at org.apache.zookeeper.server.NIOServerCnxn.doIO(NIOServerCnxn.java:228)
   [junit4]   2> 	at org.apache.zookeeper.server.NIOServerCnxnFactory.run(NIOServerCnxnFactory.java:208)
   [junit4]   2> 	at java.lang.Thread.run(Thread.java:745)
   [junit4]   2> 697915 INFO  (TEST-CollectionsAPIDistributedZkTest.test-seed#[4395CD5CDB68E563]) [    ] o.a.s.SolrTestCaseJ4 Writing core.properties file to C:\Users\JenkinsSlave\workspace\Lucene-Solr-5.x-Windows\solr\build\solr-core\test\J1\temp\solr.cloud.CollectionsAPIDistributedZkTest_4395CD5CDB68E563-001\control-001\cores\collection1
   [junit4]   2> 697919 INFO  (TEST-CollectionsAPIDistributedZkTest.test-seed#[4395CD5CDB68E563]) [    ] o.e.j.s.Server jetty-9.2.13.v20150730
   [junit4]   2> 697922 INFO  (TEST-CollectionsAPIDistributedZkTest.test-seed#[4395CD5CDB68E563]) [    ] o.e.j.s.h.ContextHandler Started o.e.j.s.ServletContextHandler@3fd30660{/,null,AVAILABLE}
   [junit4]   2> 697923 INFO  (TEST-CollectionsAPIDistributedZkTest.test-seed#[4395CD5CDB68E563]) [    ] o.e.j.s.ServerConnector Started ServerConnector@213abb4{HTTP/1.1}{127.0.0.1:65073}
   [junit4]   2> 697923 INFO  (TEST-CollectionsAPIDistributedZkTest.test-seed#[4395CD5CDB68E563]) [    ] o.e.j.s.Server Started @703179ms
   [junit4]   2> 697923 INFO  (TEST-CollectionsAPIDistributedZkTest.test-seed#[4395CD5CDB68E563]) [    ] o.a.s.c.s.e.JettySolrRunner Jetty properties: {solr.data.dir=C:\Users\JenkinsSlave\workspace\Lucene-Solr-5.x-Windows\solr\build\solr-core\test\J1\temp\solr.cloud.CollectionsAPIDistributedZkTest_4395CD5CDB68E563-001\tempDir-001/control/data, hostContext=/, hostPort=65073, coreRootDirectory=C:\Users\JenkinsSlave\workspace\Lucene-Solr-5.x-Windows\solr\build\solr-core\test\J1\..\..\..\..\..\..\..\..\..\Users\JenkinsSlave\workspace\Lucene-Solr-5.x-Windows\solr\build\solr-core\test\J1\temp\solr.cloud.CollectionsAPIDistributedZkTest_4395CD5CDB68E563-001\control-001\cores}
   [junit4]   2> 697923 INFO  (TEST-CollectionsAPIDistributedZkTest.test-seed#[4395CD5CDB68E563]) [    ] o.a.s.s.SolrDispatchFilter SolrDispatchFilter.init(): sun.misc.Launcher$AppClassLoader@73d16e93
   [junit4]   2> 697924 INFO  (TEST-CollectionsAPIDistributedZkTest.test-seed#[4395CD5CDB68E563]) [    ] o.a.s.c.SolrResourceLoader new SolrResourceLoader for directory: 'C:\Users\JenkinsSlave\workspace\Lucene-Solr-5.x-Windows\solr\build\solr-core\test\J1\temp\solr.cloud.CollectionsAPIDistributedZkTest_4395CD5CDB68E563-001\control-001'
   [junit4]   2> 697924 INFO  (TEST-CollectionsAPIDistributedZkTest.test-seed#[4395CD5CDB68E563]) [    ] o.a.s.c.SolrResourceLoader JNDI not configured for solr (NoInitialContextEx)
   [junit4]   2> 697924 INFO  (TEST-CollectionsAPIDistributedZkTest.test-seed#[4395CD5CDB68E563]) [    ] o.a.s.c.SolrResourceLoader solr home defaulted to 'solr/' (could not find system property or JNDI)
   [junit4]   2> 697925 INFO  (TEST-CollectionsAPIDistributedZkTest.test-seed#[4395CD5CDB68E563]) [    ] o.a.s.c.c.SolrZkClient Using default ZkCredentialsProvider
   [junit4]   2> 697926 INFO  (TEST-CollectionsAPIDistributedZkTest.test-seed#[4395CD5CDB68E563]) [    ] o.a.s.c.c.ConnectionManager Waiting for client to connect to ZooKeeper
   [junit4]   2> 697927 INFO  (zkCallback-945-thread-1) [    ] o.a.s.c.c.ConnectionManager Watcher org.apache.solr.common.cloud.ConnectionManager@260e90e1 name:ZooKeeperConnection Watcher:127.0.0.1:65057/solr got event WatchedEvent state:SyncConnected type:None path:null path:null type:None
   [junit4]   2> 697927 INFO  (TEST-CollectionsAPIDistributedZkTest.test-seed#[4395CD5CDB68E563]) [    ] o.a.s.c.c.ConnectionManager Client is connected to ZooKeeper
   [junit4]   2> 697927 INFO  (TEST-CollectionsAPIDistributedZkTest.test-seed#[4395CD5CDB68E563]) [    ] o.a.s.c.c.SolrZkClient Using default ZkACLProvider
   [junit4]   2> 697928 INFO  (TEST-CollectionsAPIDistributedZkTest.test-seed#[4395CD5CDB68E563]) [    ] o.a.s.s.SolrDispatchFilter Loading solr.xml from SolrHome (not found in ZooKeeper)
   [junit4]   2> 697928 INFO  (TEST-CollectionsAPIDistributedZkTest.test-seed#[4395CD5CDB68E563]) [    ] o.a.s.c.SolrXmlConfig Loading container configuration from C:\Users\JenkinsSlave\workspace\Lucene-Solr-5.x-Windows\solr\build\solr-core\test\J1\temp\solr.cloud.CollectionsAPIDistributedZkTest_4395CD5CDB68E563-001\control-001\solr.xml
   [junit4]   2> 697935 INFO  (TEST-CollectionsAPIDistributedZkTest.test-seed#[4395CD5CDB68E563]) [    ] o.a.s.c.CorePropertiesLocator Config-defined core root directory: C:\Users\JenkinsSlave\workspace\Lucene-Solr-5.x-Windows\solr\build\solr-core\test\J1\..\..\..\..\..\..\..\..\..\Users\JenkinsSlave\workspace\Lucene-Solr-5.x-Windows\solr\build\solr-core\test\J1\temp\solr.cloud.CollectionsAPIDistributedZkTest_4395CD5CDB68E563-001\control-001\cores
   [junit4]   2> 697935 INFO  (TEST-CollectionsAPIDistributedZkTest.test-seed#[4395CD5CDB68E563]) [    ] o.a.s.c.CoreContainer New CoreContainer 591827714
   [junit4]   2> 697935 INFO  (TEST-CollectionsAPIDistributedZkTest.test-seed#[4395CD5CDB68E563]) [    ] o.a.s.c.CoreContainer Loading cores into CoreContainer [instanceDir=C:\Users\JenkinsSlave\workspace\Lucene-Solr-5.x-Windows\solr\build\solr-core\test\J1\temp\solr.cloud.CollectionsAPIDistributedZkTest_4395CD5CDB68E563-001\control-001]
   [junit4]   2> 697935 WARN  (TEST-CollectionsAPIDistributedZkTest.test-seed#[4395CD5CDB68E563]) [    ] o.a.s.c.CoreContainer Couldn't add files from C:\Users\JenkinsSlave\workspace\Lucene-Solr-5.x-Windows\solr\build\solr-core\test\J1\temp\solr.cloud.CollectionsAPIDistributedZkTest_4395CD5CDB68E563-001\control-001\lib to classpath: C:\Users\JenkinsSlave\workspace\Lucene-Solr-5.x-Windows\solr\build\solr-core\test\J1\temp\solr.cloud.CollectionsAPIDistributedZkTest_4395CD5CDB68E563-001\control-001\lib
   [junit4]   2> 697936 INFO  (TEST-CollectionsAPIDistributedZkTest.test-seed#[4395CD5CDB68E563]) [    ] o.a.s.h.c.HttpShardHandlerFactory created with socketTimeout : 90000,urlScheme : ,connTimeout : 15000,maxConnectionsPerHost : 20,maxConnections : 10000,corePoolSize : 0,maximumPoolSize : 2147483647,maxThreadIdleTime : 5,sizeOfQueue : -1,fairnessPolicy : false,useRetries : false,
   [junit4]   2> 697938 INFO  (TEST-CollectionsAPIDistributedZkTest.test-seed#[4395CD5CDB68E563]) [    ] o.a.s.u.UpdateShardHandler Creating UpdateShardHandler HTTP client with params: socketTimeout=340000&connTimeout=45000&retry=true
   [junit4]   2> 697939 INFO  (TEST-CollectionsAPIDistributedZkTest.test-seed#[4395CD5CDB68E563]) [    ] o.a.s.l.LogWatcher SLF4J impl is org.slf4j.impl.Log4jLoggerFactory
   [junit4]   2> 697939 INFO  (TEST-CollectionsAPIDistributedZkTest.test-seed#[4395CD5CDB68E563]) [    ] o.a.s.l.LogWatcher Registering Log Listener [Log4j (org.slf4j.impl.Log4jLoggerFactory)]
   [junit4]   2> 697939 INFO  (TEST-CollectionsAPIDistributedZkTest.test-seed#[4395CD5CDB68E563]) [    ] o.a.s.c.ZkContainer Zookeeper client=127.0.0.1:65057/solr
   [junit4]   2> 697939 INFO  (TEST-CollectionsAPIDistributedZkTest.test-seed#[4395CD5CDB68E563]) [    ] o.a.s.c.ZkController zkHost includes chroot
   [junit4]   2> 697939 INFO  (TEST-CollectionsAPIDistributedZkTest.test-seed#[4395CD5CDB68E563]) [    ] o.a.s.c.c.SolrZkClient Using default ZkCredentialsProvider
   [junit4]   2> 697940 INFO  (TEST-CollectionsAPIDistributedZkTest.test-seed#[4395CD5CDB68E563]) [    ] o.a.s.c.c.ConnectionManager Waiting for client to connect to ZooKeeper
   [junit4]   2> 697941 INFO  (zkCallback-948-thread-1) [    ] o.a.s.c.c.ConnectionManager Watcher org.apache.solr.common.cloud.ConnectionManager@5a6711fd name:ZooKeeperConnection Watcher:127.0.0.1:65057 got event WatchedEvent state:SyncConnected type:None path:null path:null type:None
   [junit4]   2> 697941 INFO  (TEST-CollectionsAPIDistributedZkTest.test-seed#[4395CD5CDB68E563]) [    ] o.a.s.c.c.ConnectionManager Client is connected to ZooKeeper
   [junit4]   2> 697942 INFO  (TEST-CollectionsAPIDistributedZkTest.test-seed#[4395CD5CDB68E563]) [    ] o.a.s.c.c.SolrZkClient Using default ZkACLProvider
   [junit4]   2> 697943 WARN  (NIOServerCxn.Factory:0.0.0.0/0.0.0.0:0) [    ] o.a.z.s.NIOServerCnxn caught end of stream exception
   [junit4]   2> EndOfStreamException: Unable to read additional data from client sessionid 0x1528cdfc1d10005, likely client has closed socket
   [junit4]   2> 	at org.apache.zookeeper.server.NIOServerCnxn.doIO(NIOServerCnxn.java:228)
   [junit4]   2> 	at org.apache.zookeeper.server.NIOServerCnxnFactory.run(NIOServerCnxnFactory.java:208)
   [junit4]   2> 	at java.lang.Thread.run(Thread.java:745)
   [junit4]   2> 697944 INFO  (TEST-CollectionsAPIDistributedZkTest.test-seed#[4395CD5CDB68E563]) [n:127.0.0.1:65073_    ] o.a.s.c.c.ConnectionManager Waiting for client to connect to ZooKeeper
   [junit4]   2> 697945 INFO  (zkCallback-949-thread-1-processing-n:127.0.0.1:65073_) [n:127.0.0.1:65073_    ] o.a.s.c.c.ConnectionManager Watcher org.apache.solr.common.cloud.ConnectionManager@5d3b5ed1 name:ZooKeeperConnection Watcher:127.0.0.1:65057/solr got event WatchedEvent state:SyncConnected type:None path:null path:null type:None
   [junit4]   2> 697945 INFO  (TEST-CollectionsAPIDistributedZkTest.test-seed#[4395CD5CDB68E563]) [n:127.0.0.1:65073_    ] o.a.s.c.c.ConnectionManager Client is connected to ZooKeeper
   [junit4]   2> 697946 INFO  (TEST-CollectionsAPIDistributedZkTest.test-seed#[4395CD5CDB68E563]) [n:127.0.0.1:65073_    ] o.a.s.c.c.SolrZkClient makePath: /overseer/queue
   [junit4]   2> 697947 INFO  (TEST-CollectionsAPIDistributedZkTest.test-seed#[4395CD5CDB68E563]) [n:127.0.0.1:65073_    ] o.a.s.c.c.SolrZkClient makePath: /overseer/collection-queue-work
   [junit4]   2> 697949 INFO  (TEST-CollectionsAPIDistributedZkTest.test-seed#[4395CD5CDB68E563]) [n:127.0.0.1:65073_    ] o.a.s.c.c.SolrZkClient makePath: /overseer/collection-map-running
   [junit4]   2> 697950 INFO  (TEST-CollectionsAPIDistributedZkTest.test-seed#[4395CD5CDB68E563]) [n:127.0.0.1:65073_    ] o.a.s.c.c.SolrZkClient makePath: /overseer/collection-map-completed
   [junit4]   2> 697951 INFO  (TEST-CollectionsAPIDistributedZkTest.test-seed#[4395CD5CDB68E563]) [n:127.0.0.1:65073_    ] o.a.s.c.c.SolrZkClient makePath: /overseer/collection-map-failure
   [junit4]   2> 697954 INFO  (TEST-CollectionsAPIDistributedZkTest.test-seed#[4395CD5CDB68E563]) [n:127.0.0.1:65073_    ] o.a.s.c.c.SolrZkClient makePath: /live_nodes
   [junit4]   2> 697955 INFO  (TEST-CollectionsAPIDistributedZkTest.test-seed#[4395CD5CDB68E563]) [n:127.0.0.1:65073_    ] o.a.s.c.c.SolrZkClient makePath: /aliases.json
   [junit4]   2> 697956 INFO  (TEST-CollectionsAPIDistributedZkTest.test-seed#[4395CD5CDB68E563]) [n:127.0.0.1:65073_    ] o.a.s.c.c.SolrZkClient makePath: /clusterstate.json
   [junit4]   2> 697957 INFO  (TEST-CollectionsAPIDistributedZkTest.test-seed#[4395CD5CDB68E563]) [n:127.0.0.1:65073_    ] o.a.s.c.c.SolrZkClient makePath: /security.json
   [junit4]   2> 697958 INFO  (TEST-CollectionsAPIDistributedZkTest.test-seed#[4395CD5CDB68E563]) [n:127.0.0.1:65073_    ] o.a.s.c.ZkController Register node as live in ZooKeeper:/live_nodes/127.0.0.1:65073_
   [junit4]   2> 697958 INFO  (TEST-CollectionsAPIDistributedZkTest.test-seed#[4395CD5CDB68E563]) [n:127.0.0.1:65073_    ] o.a.s.c.c.SolrZkClient makePath: /live_nodes/127.0.0.1:65073_
   [junit4]   2> 697960 INFO  (TEST-CollectionsAPIDistributedZkTest.test-seed#[4395CD5CDB68E563]) [n:127.0.0.1:65073_    ] o.a.s.c.c.SolrZkClient makePath: /overseer_elect
   [junit4]   2> 697960 INFO  (TEST-CollectionsAPIDistributedZkTest.test-seed#[4395CD5CDB68E563]) [n:127.0.0.1:65073_    ] o.a.s.c.c.SolrZkClient makePath: /overseer_elect/election
   [junit4]   2> 697962 INFO  (TEST-CollectionsAPIDistributedZkTest.test-seed#[4395CD5CDB68E563]) [n:127.0.0.1:65073_    ] o.a.s.c.Overseer Overseer (id=null) closing
   [junit4]   2> 697962 INFO  (TEST-CollectionsAPIDistributedZkTest.test-seed#[4395CD5CDB68E563]) [n:127.0.0.1:65073_    ] o.a.s.c.LeaderElector Joined leadership election with path: /overseer_elect/election/95293434785497094-127.0.0.1:65073_-n_0000000000
   [junit4]   2> 697963 INFO  (TEST-CollectionsAPIDistributedZkTest.test-seed#[4395CD5CDB68E563]) [n:127.0.0.1:65073_    ] o.a.s.c.OverseerElectionContext I am going to be the leader 127.0.0.1:65073_
   [junit4]   2> 697963 INFO  (TEST-CollectionsAPIDistributedZkTest.test-seed#[4395CD5CDB68E563]) [n:127.0.0.1:65073_    ] o.a.s.c.c.SolrZkClient makePath: /overseer_elect/leader
   [junit4]   2> 697964 INFO  (TEST-CollectionsAPIDistributedZkTest.test-seed#[4395CD5CDB68E563]) [n:127.0.0.1:65073_    ] o.a.s.c.Overseer Overseer (id=95293434785497094-127.0.0.1:65073_-n_0000000000) starting
   [junit4]   2> 697966 INFO  (TEST-CollectionsAPIDistributedZkTest.test-seed#[4395CD5CDB68E563]) [n:127.0.0.1:65073_    ] o.a.s.c.c.SolrZkClient makePath: /overseer/queue-work
   [junit4]   2> 697975 INFO  (TEST-CollectionsAPIDistributedZkTest.test-seed#[4395CD5CDB68E563]) [n:127.0.0.1:65073_    ] o.a.s.c.OverseerAutoReplicaFailoverThread Starting OverseerAutoReplicaFailoverThread autoReplicaFailoverWorkLoopDelay=10000 autoReplicaFailoverWaitAfterExpiration=10000 autoReplicaFailoverBadNodeExpiration=60000
   [junit4]   2> 697976 INFO  (TEST-CollectionsAPIDistributedZkTest.test-seed#[4395CD5CDB68E563]) [n:127.0.0.1:65073_    ] o.a.s.c.c.ZkStateReader Updating cluster state from ZooKeeper... 
   [junit4]   2> 697976 INFO  (OverseerCollectionConfigSetProcessor-95293434785497094-127.0.0.1:65073_-n_0000000000) [n:127.0.0.1:65073_    ] o.a.s.c.OverseerTaskProcessor Process current queue of overseer operations
   [junit4]   2> 697976 INFO  (OverseerStateUpdate-95293434785497094-127.0.0.1:65073_-n_0000000000) [n:127.0.0.1:65073_    ] o.a.s.c.Overseer Starting to work on the main queue
   [junit4]   2> 697988 INFO  (TEST-CollectionsAPIDistributedZkTest.test-seed#[4395CD5CDB68E563]) [n:127.0.0.1:65073_    ] o.a.s.c.CoreContainer Security conf doesn't exist. Skipping setup for authorization module.
   [junit4]   2> 697988 INFO  (TEST-CollectionsAPIDistributedZkTest.test-seed#[4395CD5CDB68E563]) [n:127.0.0.1:65073_    ] o.a.s.c.CoreContainer No authentication plugin used.
   [junit4]   2> 697991 INFO  (TEST-CollectionsAPIDistributedZkTest.test-seed#[4395CD5CDB68E563]) [n:127.0.0.1:65073_    ] o.a.s.c.CorePropertiesLocator Looking for core definitions underneath C:\Users\JenkinsSlave\workspace\Lucene-Solr-5.x-Windows\solr\build\solr-core\test\J1\..\..\..\..\..\..\..\..\..\Users\JenkinsSlave\workspace\Lucene-Solr-5.x-Windows\solr\build\solr-core\test\J1\temp\solr.cloud.CollectionsAPIDistributedZkTest_4395CD5CDB68E563-001\control-001\cores
   [junit4]   2> 697993 INFO  (TEST-CollectionsAPIDistributedZkTest.test-seed#[4395CD5CDB68E563]) [n:127.0.0.1:65073_    ] o.a.s.c.CoreDescriptor Created CoreDescriptor: {name=collection1, config=solrconfig.xml, transient=false, schema=schema.xml, loadOnStartup=true, configSetProperties=configsetprops.json, collection=control_collection, coreNodeName=, dataDir=data\, shard=}
   [junit4]   2> 697993 INFO  (TEST-CollectionsAPIDistributedZkTest.test-seed#[4395CD5CDB68E563]) [n:127.0.0.1:65073_    ] o.a.s.c.CorePropertiesLocator Found core collection1 in C:\Users\JenkinsSlave\workspace\Lucene-Solr-5.x-Windows\solr\build\solr-core\test\J1\..\..\..\..\..\..\..\..\..\Users\JenkinsSlave\workspace\Lucene-Solr-5.x-Windows\solr\build\solr-core\test\J1\temp\solr.cloud.CollectionsAPIDistributedZkTest_4395CD5CDB68E563-001\control-001\cores\collection1
   [junit4]   2> 697994 INFO  (TEST-CollectionsAPIDistributedZkTest.test-seed#[4395CD5CDB68E563]) [n:127.0.0.1:65073_    ] o.a.s.c.CorePropertiesLocator Found 1 core definitions
   [junit4]   2> 697994 INFO  (TEST-CollectionsAPIDistributedZkTest.test-seed#[4395CD5CDB68E563]) [n:127.0.0.1:65073_    ] o.a.s.s.SolrDispatchFilter user.dir=C:\Users\JenkinsSlave\workspace\Lucene-Solr-5.x-Windows\solr\build\solr-core\test\J1
   [junit4]   2> 697994 INFO  (TEST-CollectionsAPIDistributedZkTest.test-seed#[4395CD5CDB68E563]) [n:127.0.0.1:65073_    ] o.a.s.s.SolrDispatchFilter SolrDispatchFilter.init() done
   [junit4]   2> 697994 INFO  (coreLoadExecutor-2189-thread-1-processing-n:127.0.0.1:65073_) [n:127.0.0.1:65073_ c:control_collection   x:collection1] o.a.s.c.ZkController publishing state=down
   [junit4]   2> 697994 INFO  (coreLoadExecutor-2189-thread-1-processing-n:127.0.0.1:65073_) [n:127.0.0.1:65073_ c:control_collection   x:collection1] o.a.s.c.ZkController numShards not found on descriptor - reading it from system property
   [junit4]   2> 697996 INFO  (OverseerStateUpdate-95293434785497094-127.0.0.1:65073_-n_0000000000) [n:127.0.0.1:65073_    ] o.a.s.c.Overseer processMessage: queueSize: 1, message = {
   [junit4]   2>   "core":"collection1",
   [junit4]   2>   "roles":null,
   [junit4]   2>   "base_url":"http://127.0.0.1:65073",
   [junit4]   2>   "node_name":"127.0.0.1:65073_",
   [junit4]   2>   "numShards":"1",
   [junit4]   2>   "state":"down",
   [junit4]   2>   "shard":null,
   [junit4]   2>   "collection":"control_collection",
   [junit4]   2>   "operation":"state"} current state version: 0
   [junit4]   2> 697996 INFO  (coreLoadExecutor-2189-thread-1-processing-n:127.0.0.1:65073_) [n:127.0.0.1:65073_ c:control_collection   x:collection1] o.a.s.c.ZkController look for our core node name
   [junit4]   2> 697997 INFO  (OverseerStateUpdate-95293434785497094-127.0.0.1:65073_-n_0000000000) [n:127.0.0.1:65073_    ] o.a.s.c.o.ReplicaMutator Update state numShards=1 message={
   [junit4]   2>   "core":"collection1",
   [junit4]   2>   "roles":null,
   [junit4]   2>   "base_url":"http://127.0.0.1:65073",
   [junit4]   2>   "node_name":"127.0.0.1:65073_",
   [junit4]   2>   "numShards":"1",
   [junit4]   2>   "state":"down",
   [junit4]   2>   "shard":null,
   [junit4]   2>   "collection":"control_collection",
   [junit4]   2>   "operation":"state"}
   [junit4]   2> 697997 INFO  (OverseerStateUpdate-95293434785497094-127.0.0.1:65073_-n_0000000000) [n:127.0.0.1:65073_    ] o.a.s.c.o.ClusterStateMutator building a new cName: control_collection
   [junit4]   2> 697998 INFO  (OverseerStateUpdate-95293434785497094-127.0.0.1:65073_-n_0000000000) [n:127.0.0.1:65073_    ] o.a.s.c.o.ReplicaMutator Assigning new node to shard shard=shard1
   [junit4]   2> 697999 INFO  (zkCallback-949-thread-1-processing-n:127.0.0.1:65073_) [n:127.0.0.1:65073_    ] o.a.s.c.c.ZkStateReader A cluster state change: [WatchedEvent state:SyncConnected type:NodeDataChanged path:/clusterstate.json], has occurred - updating... (live nodes size: [1])
   [junit4]   2> 698997 INFO  (coreLoadExecutor-2189-thread-1-processing-n:127.0.0.1:65073_) [n:127.0.0.1:65073_ c:control_collection   x:collection1] o.a.s.c.ZkController waiting to find shard id in clusterstate for collection1
   [junit4]   2> 698997 INFO  (coreLoadExecutor-2189-thread-1-processing-n:127.0.0.1:65073_) [n:127.0.0.1:65073_ c:control_collection   x:collection1] o.a.s.c.ZkController Check for collection zkNode:control_collection
   [junit4]   2> 698997 INFO  (coreLoadExecutor-2189-thread-1-processing-n:127.0.0.1:65073_) [n:127.0.0.1:65073_ c:control_collection   x:collection1] o.a.s.c.ZkController Collection zkNode exists
   [junit4]   2> 698997 INFO  (coreLoadExecutor-2189-thread-1-processing-n:127.0.0.1:65073_) [n:127.0.0.1:65073_ c:control_collection   x:collection1] o.a.s.c.c.ZkStateReader Load collection config from: [/collections/control_collection]
   [junit4]   2> 698998 INFO  (coreLoadExecutor-2189-thread-1-processing-n:127.0.0.1:65073_) [n:127.0.0.1:65073_ c:control_collection   x:collection1] o.a.s.c.c.ZkStateReader path=[/collections/control_collection] [configName]=[conf1] specified config exists in ZooKeeper
   [junit4]   2> 698998 INFO  (coreLoadExecutor-2189-thread-1-processing-n:127.0.0.1:65073_) [n:127.0.0.1:65073_ c:control_collection   x:collection1] o.a.s.c.SolrResourceLoader new SolrResourceLoader for directory: 'C:\Users\JenkinsSlave\workspace\Lucene-Solr-5.x-Windows\solr\build\solr-core\test\J1\temp\solr.cloud.CollectionsAPIDistributedZkTest_4395CD5CDB68E563-001\control-001\cores\collection1'
   [junit4]   2> 698998 INFO  (coreLoadExecutor-2189-thread-1-processing-n:127.0.0.1:65073_) [n:127.0.0.1:65073_ c:control_collection   x:collection1] o.a.s.c.SolrResourceLoader JNDI not configured for solr (NoInitialContextEx)
   [junit4]   2> 698998 INFO  (coreLoadExecutor-2189-thread-1-processing-n:127.0.0.1:65073_) [n:127.0.0.1:65073_ c:control_collection   x:collection1] o.a.s.c.SolrResourceLoader solr home defaulted to 'solr/' (could not find system property or JNDI)
   [junit4]   2> 699000 INFO  (coreLoadExecutor-2189-thread-1-processing-n:127.0.0.1:65073_) [n:127.0.0.1:65073_ c:control_collection   x:collection1] o.a.s.c.Config loaded config solrconfig.xml with version 0 
   [junit4]   2> 699007 INFO  (coreLoadExecutor-2189-thread-1-processing-n:127.0.0.1:65073_) [n:127.0.0.1:65073_ c:control_collection   x:collection1] o.a.s.c.SolrConfig current version of requestparams : -1
   [junit4]   2> 699009 INFO  (coreLoadExecutor-2189-thread-1-processing-n:127.0.0.1:65073_) [n:127.0.0.1:65073_ c:control_collection   x:collection1] o.a.s.c.SolrConfig Using Lucene MatchVersion: 5.5.0
   [junit4]   2> 699023 INFO  (coreLoadExecutor-2189-thread-1-processing-n:127.0.0.1:65073_) [n:127.0.0.1:65073_ c:control_collection   x:collection1] o.a.s.c.SolrConfig Loaded SolrConfig: solrconfig.xml
   [junit4]   2> 699026 INFO  (coreLoadExecutor-2189-thread-1-processing-n:127.0.0.1:65073_) [n:127.0.0.1:65073_ c:control_collection   x:collection1] o.a.s.s.IndexSchema [collection1] Schema name=test
   [junit4]   2> 699097 INFO  (coreLoadExecutor-2189-thread-1-processing-n:127.0.0.1:65073_) [n:127.0.0.1:65073_ c:control_collection   x:collection1] o.a.s.s.OpenExchangeRatesOrgProvider Initialized with rates=open-exchange-rates.json, refreshInterval=1440.
   [junit4]   2> 699104 INFO  (coreLoadExecutor-2189-thread-1-processing-n:127.0.0.1:65073_) [n:127.0.0.1:65073_ c:control_collection   x:collection1] o.a.s.s.IndexSchema default search field in schema is text
   [junit4]   2> 699105 INFO  (coreLoadExecutor-2189-thread-1-processing-n:127.0.0.1:65073_) [n:127.0.0.1:65073_ c:control_collection   x:collection1] o.a.s.s.IndexSchema unique key field: id
   [junit4]   2> 699112 INFO  (coreLoadExecutor-2189-thread-1-processing-n:127.0.0.1:65073_) [n:127.0.0.1:65073_ c:control_collection   x:collection1] o.a.s.s.FileExchangeRateProvider Reloading exchange rates from file currency.xml
   [junit4]   2> 699114 INFO  (coreLoadExecutor-2189-thread-1-processing-n:127.0.0.1:65073_) [n:127.0.0.1:65073_ c:control_collection   x:collection1] o.a.s.s.FileExchangeRateProvider Reloading exchange rates from file currency.xml
   [junit4]   2> 699116 INFO  (coreLoadExecutor-2189-thread-1-processing-n:127.0.0.1:65073_) [n:127.0.0.1:65073_ c:control_collection   x:collection1] o.a.s.s.OpenExchangeRatesOrgProvider Reloading exchange rates from open-exchange-rates.json
   [junit4]   2> 699117 INFO  (coreLoadExecutor-2189-thread-1-processing-n:127.0.0.1:65073_) [n:127.0.0.1:65073_ c:control_collection   x:collection1] o.a.s.s.OpenExchangeRatesOrgProvider Reloading exchange rates from open-exchange-rates.json
   [junit4]   2> 699120 INFO  (coreLoadExecutor-2189-thread-1-processing-n:127.0.0.1:65073_) [n:127.0.0.1:65073_ c:control_collection   x:collection1] o.a.s.c.ConfigSetProperties Did not find ConfigSet properties, assuming default properties: Can't find resource 'configsetprops.json' in classpath or '/configs/conf1', cwd=C:\Users\JenkinsSlave\workspace\Lucene-Solr-5.x-Windows\solr\build\solr-core\test\J1
   [junit4]   2> 699120 INFO  (coreLoadExecutor-2189-thread-1-processing-n:127.0.0.1:65073_) [n:127.0.0.1:65073_ c:control_collection   x:collection1] o.a.s.c.CoreContainer Creating SolrCore 'collection1' using configuration from collection control_collection
   [junit4]   2> 699120 INFO  (coreLoadExecutor-2189-thread-1-processing-n:127.0.0.1:65073_) [n:127.0.0.1:65073_ c:control_collection s:shard1 r:core_node1 x:collection1] o.a.s.c.SolrCore org.apache.solr.core.MockDirectoryFactory
   [junit4]   2> 699121 INFO  (coreLoadExecutor-2189-thread-1-processing-n:127.0.0.1:65073_) [n:127.0.0.1:65073_ c:control_collection s:shard1 r:core_node1 x:collection1] o.a.s.c.SolrCore [[collection1] ] Opening new SolrCore at [C:\Users\JenkinsSlave\workspace\Lucene-Solr-5.x-Windows\solr\build\solr-core\test\J1\temp\solr.cloud.CollectionsAPIDistributedZkTest_4395CD5CDB68E563-001\control-001\cores\collection1], dataDir=[C:\Users\JenkinsSlave\workspace\Lucene-Solr-5.x-Windows\solr\build\solr-core\test\J1\..\..\..\..\..\..\..\..\..\Users\JenkinsSlave\workspace\Lucene-Solr-5.x-Windows\solr\build\solr-core\test\J1\temp\solr.cloud.CollectionsAPIDistributedZkTest_4395CD5CDB68E563-001\control-001\cores\collection1\data\]
   [junit4]   2> 699121 INFO  (coreLoadExecutor-2189-thread-1-processing-n:127.0.0.1:65073_) [n:127.0.0.1:65073_ c:control_collection s:shard1 r:core_node1 x:collection1] o.a.s.c.JmxMonitoredMap JMX monitoring is enabled. Adding Solr mbeans to JMX Server: com.sun.jmx.mbeanserver.JmxMBeanServer@7d1ad6f0
   [junit4]   2> 699121 INFO  (coreLoadExecutor-2189-thread-1-processing-n:127.0.0.1:65073_) [n:127.0.0.1:65073_ c:control_collection s:shard1 r:core_node1 x:collection1] o.a.s.c.CachingDirectoryFactory return new directory for C:\Users\JenkinsSlave\workspace\Lucene-Solr-5.x-Windows\solr\build\solr-core\test\J1\..\..\..\..\..\..\..\..\..\Users\JenkinsSlave\workspace\Lucene-Solr-5.x-Windows\solr\build\solr-core\test\J1\temp\solr.cloud.CollectionsAPIDistributedZkTest_4395CD5CDB68E563-001\control-001\cores\collection1\data\
   [junit4]   2> 699121 INFO  (coreLoadExecutor-2189-thread-1-processing-n:127.0.0.1:65073_) [n:127.0.0.1:65073_ c:control_collection s:shard1 r:core_node1 x:collection1] o.a.s.c.SolrCore New index directory detected: old=null new=C:\Users\JenkinsSlave\workspace\Lucene-Solr-5.x-Windows\solr\build\solr-core\test\J1\..\..\..\..\..\..\..\..\..\Users\JenkinsSlave\workspace\Lucene-Solr-5.x-Windows\solr\build\solr-core\test\J1\temp\solr.cloud.CollectionsAPIDistributedZkTest_4395CD5CDB68E563-001\control-001\cores\collection1\data\index/
   [junit4]   2> 699121 WARN  (coreLoadExecutor-2189-thread-1-processing-n:127.0.0.1:65073_) [n:127.0.0.1:65073_ c:control_collection s:shard1 r:core_node1 x:collection1] o.a.s.c.SolrCore [collection1] Solr index directory 'C:\Users\JenkinsSlave\workspace\Lucene-Solr-5.x-Windows\solr\build\solr-core\test\J1\..\..\..\..\..\..\..\..\..\Users\JenkinsSlave\workspace\Lucene-Solr-5.x-Windows\solr\build\solr-core\test\J1\temp\solr.cloud.CollectionsAPIDistributedZkTest_4395CD5CDB68E563-001\control-001\cores\collection1\data\index' doesn't exist. Creating new index...
   [junit4]   2> 699122 INFO  (coreLoadExecutor-2189-thread-1-processing-n:127.0.0.1:65073_) [n:127.0.0.1:65073_ c:control_collection s:shard1 r:core_node1 x:collection1] o.a.s.c.CachingDirectoryFactory return new directory for C:\Users\JenkinsSlave\workspace\Lucene-Solr-5.x-Windows\solr\build\solr-core\test\J1\..\..\..\..\..\..\..\..\..\Users\JenkinsSlave\workspace\Lucene-Solr-5.x-Windows\solr\build\solr-core\test\J1\temp\solr.cloud.CollectionsAPIDistributedZkTest_4395CD5CDB68E563-001\control-001\cores\collection1\data\index
   [junit4]   2> 699122 INFO  (coreLoadExecutor-2189-thread-1-processing-n:127.0.0.1:65073_) [n:127.0.0.1:65073_ c:control_collection s:shard1 r:core_node1 x:collection1] o.a.s.u.RandomMergePolicy RandomMergePolicy wrapping class org.apache.lucene.index.TieredMergePolicy: [TieredMergePolicy: maxMergeAtOnce=40, maxMergeAtOnceExplicit=31, maxMergedSegmentMB=75.5517578125, floorSegmentMB=0.7587890625, forceMergeDeletesPctAllowed=22.56890386774574, segmentsPerTier=11.0, maxCFSSegmentSizeMB=8.796093022207999E12, noCFSRatio=1.0
   [junit4]   2> 699123 INFO  (coreLoadExecutor-2189-thread-1-processing-n:127.0.0.1:65073_) [n:127.0.0.1:65073_ c:control_collection s:shard1 r:core_node1 x:collection1] o.a.s.c.SolrDeletionPolicy SolrDeletionPolicy.onCommit: commits: num=1
   [junit4]   2> 	commit{dir=MockDirectoryWrapper(RAMDirectory@2ae423b9 lockFactory=org.apache.lucene.store.SingleInstanceLockFactory@1cdc6be2),segFN=segments_1,generation=1}
   [junit4]   2> 699123 INFO  (coreLoadExecutor-2189-thread-1-processing-n:127.0.0.1:65073_) [n:127.0.0.1:65073_ c:control_collection s:shard1 r:core_node1 x:collection1] o.a.s.c.SolrDeletionPolicy newest commit generation = 1
   [junit4]   2> 699123 INFO  (OldIndexDirectoryCleanupThreadForCore-collection1) [n:127.0.0.1:65073_ c:control_collection s:shard1 r:core_node1 x:collection1] o.a.s.c.SolrCore Looking for old index directories to cleanup for core collection1 in C:\Users\JenkinsSlave\workspace\Lucene-Solr-5.x-Windows\solr\build\solr-core\test\J1\..\..\..\..\..\..\..\..\..\Users\JenkinsSlave\workspace\Lucene-Solr-5.x-Windows\solr\build\solr-core\test\J1\temp\solr.cloud.CollectionsAPIDistributedZkTest_4395CD5CDB68E563-001\control-001\cores\collection1\data\
   [junit4]   2> 699123 WARN  (OldIndexDirectoryCleanupThreadForCore-collection1) [n:127.0.0.1:65073_ c:control_collection s:shard1 r:core_node1 x:collection1] o.a.s.c.DirectoryFactory C:\Users\JenkinsSlave\workspace\Lucene-Solr-5.x-Windows\solr\build\solr-core\test\J1\..\..\..\..\..\..\..\..\..\Users\JenkinsSlave\workspace\Lucene-Solr-5.x-Windows\solr\build\solr-core\test\J1\temp\solr.cloud.CollectionsAPIDistributedZkTest_4395CD5CDB68E563-001\control-001\cores\collection1\data\ does not point to a valid data directory; skipping clean-up of old index directories.
   [junit4]   2> 699125 INFO  (coreLoadExecutor-2189-thread-1-processing-n:127.0.0.1:65073_) [n:127.0.0.1:65073_ c:control_collection s:shard1 r:core_node1 x:collection1] o.a.s.u.p.UpdateRequestProcessorChain creating updateRequestProcessorChain "nodistrib"
   [junit4]   2> 699125 INFO  (coreLoadExecutor-2189-thread-1-processing-n:127.0.0.1:65073_) [n:127.0.0.1:65073_ c:control_collection s:shard1 r:core_node1 x:collection1] o.a.s.u.p.UpdateRequestProcessorChain creating updateRequestProcessorChain "dedupe"
   [junit4]   2> 699125 INFO  (coreLoadExecutor-2189-thread-1-processing-n:127.0.0.1:65073_) [n:127.0.0.1:65073_ c:control_collection s:shard1 r:core_node1 x:collection1] o.a.s.u.p.UpdateRequestProcessorChain inserting DistributedUpdateProcessorFactory into updateRequestProcessorChain "dedupe"
   [junit4]   2> 699125 INFO  (coreLoadExecutor-2189-thread-1-processing-n:127.0.0.1:65073_) [n:127.0.0.1:65073_ c:control_collection s:shard1 r:core_node1 x:collection1] o.a.s.u.p.UpdateRequestProcessorChain creating updateRequestProcessorChain "stored_sig"
   [junit4]   2> 699125 INFO  (coreLoadExecutor-2189-thread-1-processing-n:127.0.0.1:65073_) [n:127.0.0.1:65073_ c:control_collection s:shard1 r:core_node1 x:collection1] o.a.s.u.p.UpdateRequestProcessorChain inserting DistributedUpdateProcessorFactory into updateRequestProcessorChain "stored_sig"
   [junit4]   2> 699125 INFO  (coreLoadExecutor-2189-thread-1-processing-n:127.0.0.1:65073_) [n:127.0.0.1:65073_ c:control_collection s:shard1 r:core_node1 x:collection1] o.a.s.u.p.UpdateRequestProcessorChain creating updateRequestProcessorChain "distrib-dup-test-chain-explicit"
   [junit4]   2> 699125 INFO  (coreLoadExecutor-2189-thread-1-processing-n:127.0.0.1:65073_) [n:127.0.0.1:65073_ c:control_collection s:shard1 r:core_node1 x:collection1] o.a.s.u.p.UpdateRequestProcessorChain creating updateRequestProcessorChain "distrib-dup-test-chain-implicit"
   [junit4]   2> 699125 INFO  (coreLoadExecutor-2189-thread-1-processing-n:127.0.0.1:65073_) [n:127.0.0.1:65073_ c:control_collection s:shard1 r:core_node1 x:collection1] o.a.s.u.p.UpdateRequestProcessorChain inserting DistributedUpdateProcessorFactory into updateRequestProcessorChain "distrib-dup-test-chain-implicit"
   [junit4]   2> 699125 INFO  (coreLoadExecutor-2189-thread-1-processing-n:127.0.0.1:65073_) [n:127.0.0.1:65073_ c:control_collection s:shard1 r:core_node1 x:collection1] o.a.s.c.SolrCore no updateRequestProcessorChain defined as default, creating implicit default
   [junit4]   2> 699126 WARN  (coreLoadExecutor-2189-thread-1-processing-n:127.0.0.1:65073_) [n:127.0.0.1:65073_ c:control_collection s:shard1 r:core_node1 x:collection1] o.a.s.c.RequestHandlers INVALID paramSet a in requestHandler {type = requestHandler,name = /dump,class = DumpRequestHandler,args = {defaults={a=A,b=B}}}
   [junit4]   2> 699129 INFO  (coreLoadExecutor-2189-thread-1-processing-n:127.0.0.1:65073_) [n:127.0.0.1:65073_ c:control_collection s:shard1 r:core_node1 x:collection1] o.a.s.h.l.XMLLoader xsltCacheLifetimeSeconds=60
   [junit4]   2> 699130 INFO  (coreLoadExecutor-2189-thread-1-processing-n:127.0.0.1:65073_) [n:127.0.0.1:65073_ c:control_collection s:shard1 r:core_node1 x:collection1] o.a.s.h.l.XMLLoader xsltCacheLifetimeSeconds=60
   [junit4]   2> 699131 INFO  (coreLoadExecutor-2189-thread-1-processing-n:127.0.0.1:65073_) [n:127.0.0.1:65073_ c:control_collection s:shard1 r:core_node1 x:collection1] o.a.s.h.l.XMLLoader xsltCacheLifetimeSeconds=60
   [junit4]   2> 699131 INFO  (coreLoadExecutor-2189-thread-1-processing-n:127.0.0.1:65073_) [n:127.0.0.1:65073_ c:control_collection s:shard1 r:core_node1 x:collection1] o.a.s.h.l.XMLLoader xsltCacheLifetimeSeconds=60
   [junit4]   2> 699133 INFO  (coreLoadExecutor-2189-thread-1-processing-n:127.0.0.1:65073_) [n:127.0.0.1:65073_ c:control_collection s:shard1 r:core_node1 x:collection1] o.a.s.c.RequestHandlers Registered paths: /admin/mbeans,standard,/dump,/update/csv,/update/json/docs,/admin/luke,/admin/segments,/get,/admin/system,/replication,/admin/properties,/config,/schema,/admin/plugins,/admin/logging,/update/json,/admin/threads,/admin/ping,/update,/admin/file
   [junit4]   2> 699134 INFO  (coreLoadExecutor-2189-thread-1-processing-n:127.0.0.1:65073_) [n:127.0.0.1:65073_ c:control_collection s:shard1 r:core_node1 x:collection1] o.a.s.c.SolrCore Using default statsCache cache: org.apache.solr.search.stats.LocalStatsCache
   [junit4]   2> 699136 INFO  (coreLoadExecutor-2189-thread-1-processing-n:127.0.0.1:65073_) [n:127.0.0.1:65073_ c:control_collection s:shard1 r:core_node1 x:collection1] o.a.s.u.UpdateHandler Using UpdateLog implementation: org.apache.solr.update.UpdateLog
   [junit4]   2> 699136 INFO  (coreLoadExecutor-2189-thread-1-processing-n:127.0.0.1:65073_) [n:127.0.0.1:65073_ c:control_collection s:shard1 r:core_node1 x:collection1] o.a.s.u.UpdateLog Initializing UpdateLog: dataDir= defaultSyncLevel=FLUSH numRecordsToKeep=100 maxNumLogsToKeep=10 numVersionBuckets=65536
   [junit4]   2> 699137 INFO  (coreLoadExecutor-2189-thread-1-processing-n:127.0.0.1:65073_) [n:127.0.0.1:65073_ c:control_collection s:shard1 r:core_node1 x:collection1] o.a.s.u.CommitTracker Hard AutoCommit: disabled
   [junit4]   2> 699137 INFO  (coreLoadExecutor-2189-thread-1-processing-n:127.0.0.1:65073_) [n:127.0.0.1:65073_ c:control_collection s:shard1 r:core_node1 x:collection1] o.a.s.u.CommitTracker Soft AutoCommit: disabled
   [junit4]   2> 699137 INFO  (coreLoadExecutor-2189-thread-1-processing-n:127.0.0.1:65073_) [n:127.0.0.1:65073_ c:control_collection s:shard1 r:core_node1 x:collection1] o.a.s.u.RandomMergePolicy RandomMergePolicy wrapping class org.apache.lucene.index.LogDocMergePolicy: [LogDocMergePolicy: minMergeSize=1000, mergeFactor=41, maxMergeSize=9223372036854775807, maxMergeSizeForForcedMerge=9223372036854775807, calibrateSizeByDeletes=false, maxMergeDocs=2147483647, maxCFSSegmentSizeMB=8.796093022207999E12, noCFSRatio=0.8501714675326297]
   [junit4]   2> 699138 INFO  (coreLoadExecutor-2189-thread-1-processing-n:127.0.0.1:65073_) [n:127.0.0.1:65073_ c:control_collection s:shard1 r:core_node1 x:collection1] o.a.s.c.SolrDeletionPolicy SolrDeletionPolicy.onInit: commits: num=1
   [junit4]   2> 	commit{dir=MockDirectoryWrapper(RAMDirectory@2ae423b9 lockFactory=org.apache.lucene.store.SingleInstanceLockFactory@1cdc6be2),segFN=segments_1,generation=1}
   [junit4]   2> 699138 INFO  (coreLoadExecutor-2189-thread-1-processing-n:127.0.0.1:65073_) [n:127.0.0.1:65073_ c:control_collection s:shard1 r:core_node1 x:collection1] o.a.s.c.SolrDeletionPolicy newest commit generation = 1
   [junit4]   2> 699138 INFO  (coreLoadExecutor-2189-thread-1-processing-n:127.0.0.1:65073_) [n:127.0.0.1:65073_ c:control_collection s:shard1 r:core_node1 x:collection1] o.a.s.s.SolrIndexSearcher Opening Searcher@11b02c77[collection1] main
   [junit4]   2> 699138 INFO  (coreLoadExecutor-2189-thread-1-processing-n:127.0.0.1:65073_) [n:127.0.0.1:65073_ c:control_collection s:shard1 r:core_node1 x:collection1] o.a.s.c.c.ZkStateReader Load collection config from: [/collections/control_collection]
   [junit4]   2> 699139 INFO  (coreLoadExecutor-2189-thread-1-processing-n:127.0.0.1:65073_) [n:127.0.0.1:65073_ c:control_collection s:shard1 r:core_node1 x:collection1] o.a.s.c.c.ZkStateReader path=[/collections/control_collection] [configName]=[conf1] specified config exists in ZooKeeper
   [junit4]   2> 699139 INFO  (coreLoadExecutor-2189-thread-1-processing-n:127.0.0.1:65073_) [n:127.0.0.1:65073_ c:control_collection s:shard1 r:core_node1 x:collection1] o.a.s.r.ManagedResourceStorage Setting up ZooKeeper-based storage for the RestManager with znodeBase: /configs/conf1
   [junit4]   2> 699139 INFO  (coreLoadExecutor-2189-thread-1-processing-n:127.0.0.1:65073_) [n:127.0.0.1:65073_ c:control_collection s:shard1 r:core_node1 x:collection1] o.a.s.r.ManagedResourceStorage Configured ZooKeeperStorageIO with znodeBase: /configs/conf1
   [junit4]   2> 699139 INFO  (coreLoadExecutor-2189-thread-1-processing-n:127.0.0.1:65073_) [n:127.0.0.1:65073_ c:control_collection s:shard1 r:core_node1 x:collection1] o.a.s.r.RestManager Initializing RestManager with initArgs: {}
   [junit4]   2> 699139 INFO  (coreLoadExecutor-2189-thread-1-processing-n:127.0.0.1:65073_) [n:127.0.0.1:65073_ c:control_collection s:shard1 r:core_node1 x:collection1] o.a.s.r.ManagedResourceStorage Reading _rest_managed.json using ZooKeeperStorageIO:path=/configs/conf1
   [junit4]   2> 699140 INFO  (coreLoadExecutor-2189-thread-1-processing-n:127.0.0.1:65073_) [n:127.0.0.1:65073_ c:control_collection s:shard1 r:core_node1 x:collection1] o.a.s.r.ManagedResourceStorage No data found for znode /configs/conf1/_rest_managed.json
   [junit4]   2> 699140 INFO  (coreLoadExecutor-2189-thread-1-processing-n:127.0.0.1:65073_) [n:127.0.0.1:65073_ c:control_collection s:shard1 r:core_node1 x:collection1] o.a.s.r.ManagedResourceStorage Loaded null at path _rest_managed.json using ZooKeeperStorageIO:path=/configs/conf1
   [junit4]   2> 699140 INFO  (coreLoadExecutor-2189-thread-1-processing-n:127.0.0.1:65073_) [n:127.0.0.1:65073_ c:control_collection s:shard1 r:core_node1 x:collection1] o.a.s.r.RestManager Initializing 0 registered ManagedResources
   [junit4]   2> 699140 INFO  (coreLoadExecutor-2189-thread-1-processing-n:127.0.0.1:65073_) [n:127.0.0.1:65073_ c:control_collection s:shard1 r:core_node1 x:collection1] o.a.s.h.ReplicationHandler Commits will be reserved for  10000
   [junit4]   2> 699140 INFO  (coreLoadExecutor-2189-thread-1-processing-n:127.0.0.1:65073_) [n:127.0.0.1:65073_ c:control_collection s:shard1 r:core_node1 x:collection1] o.a.s.u.UpdateLog Looking up max value of version field to seed version buckets
   [junit4]   2> 699140 INFO  (coreLoadExecutor-2189-thread-1-processing-n:127.0.0.1:65073_) [n:127.0.0.1:65073_ c:control_collection s:shard1 r:core_node1 x:collection1] o.a.s.u.VersionInfo Refreshing highest value of _version_ for 65536 version buckets from index
   [junit4]   2> 699140 INFO  (coreLoadExecutor-2189-thread-1-processing-n:127.0.0.1:65073_) [n:127.0.0.1:65073_ c:control_collection s:shard1 r:core_node1 x:collection1] o.a.s.u.VersionInfo No terms found for _version_, cannot seed version bucket highest value from index
   [junit4]   2> 699140 INFO  (coreLoadExecutor-2189-thread-1-processing-n:127.0.0.1:65073_) [n:127.0.0.1:65073_ c:control_collection s:shard1 r:core_node1 x:collection1] o.a.s.u.UpdateLog Could not find max version in index or recent updates, using new clock 1524694958570733568
   [junit4]   2> 699142 INFO  (coreLoadExecutor-2189-thread-1-processing-n:127.0.0.1:65073_) [n:127.0.0.1:65073_ c:control_collection s:shard1 r:core_node1 x:collection1] o.a.s.u.UpdateLog Took 1.0ms to seed version buckets with highest version 1524694958570733568
   [junit4]   2> 699142 INFO  (coreLoadExecutor-2189-thread-1-processing-n:127.0.0.1:65073_) [n:127.0.0.1:65073_ c:control_collection s:shard1 r:core_node1 x:collection1] o.a.s.c.ZkController watch zkdir /configs/conf1
   [junit4]   2> 699142 INFO  (searcherExecutor-2190-thread-1-processing-n:127.0.0.1:65073_ x:collection1 s:shard1 c:control_collection r:core_node1) [n:127.0.0.1:65073_ c:control_collection s:shard1 r:core_node1 x:collection1] o.a.s.c.SolrCore [collection1] Registered new searcher Searcher@11b02c77[collection1] main{ExitableDirectoryReader(UninvertingDirectoryReader())}
   [junit4]   2> 699143 INFO  (coreLoadExecutor-2189-thread-1-processing-n:127.0.0.1:65073_) [n:127.0.0.1:65073_ c:control_collection s:shard1 r:core_node1 x:collection1] o.a.s.c.CoreContainer registering core: collection1
   [junit4]   2> 699143 INFO  (coreZkRegister-2183-thread-1-processing-n:127.0.0.1:65073_ x:collection1 s:shard1 c:control_collection r:core_node1) [n:127.0.0.1:65073_ c:control_collection s:shard1 r:core_node1 x:collection1] o.a.s.c.ZkController Register replica - core:collection1 address:http://127.0.0.1:65073 collection:control_collection shard:shard1
   [junit4]   2> 699144 INFO  (coreZkRegister-2183-thread-1-processing-n:127.0.0.1:65073_ x:collection1 s:shard1 c:control_collection r:core_node1) [n:127.0.0.1:65073_ c:control_collection s:shard1 r:core_node1 x:collection1] o.a.s.c.c.SolrZkClient makePath: /collections/control_collection/leader_elect/shard1/election
   [junit4]   2> 699147 INFO  (coreZkRegister-2183-thread-1-processing-n:127.0.0.1:65073_ x:collection1 s:shard1 c:control_collection r:core_node1) [n:127.0.0.1:65073_ c:control_collection s:shard1 r:core_node1 x:collection1] o.a.s.c.LeaderElector Joined leadership election with path: /collections/control_collection/leader_elect/shard1/election/95293434785497094-core_node1-n_0000000000
   [junit4]   2> 699148 INFO  (coreZkRegister-2183-thread-1-processing-n:127.0.0.1:65073_ x:collection1 s:shard1 c:control_collection r:core_node1) [n:127.0.0.1:65073_ c:control_collection s:shard1 r:core_node1 x:collection1] o.a.s.c.ShardLeaderElectionContext Running the leader process for shard=shard1 and weAreReplacement=false and leaderVoteWait=180000
   [junit4]   2> 699148 INFO  (coreZkRegister-2183-thread-1-processing-n:127.0.0.1:65073_ x:collection1 s:shard1 c:control_collection r:core_node1) [n:127.0.0.1:65073_ c:control_collection s:shard1 r:core_node1 x:collection1] o.a.s.c.ShardLeaderElectionContext Enough replicas found to continue.
   [junit4]   2> 699148 INFO  (coreZkRegister-2183-thread-1-processing-n:127.0.0.1:65073_ x:collection1 s:shard1 c:control_collection r:core_node1) [n:127.0.0.1:65073_ c:control_collection s:shard1 r:core_node1 x:collection1] o.a.s.c.ShardLeaderElectionContext I may be the new leader - try and sync
   [junit4]   2> 699148 INFO  (coreZkRegister-2183-thread-1-processing-n:127.0.0.1:65073_ x:collection1 s:shard1 c:control_collection r:core_node1) [n:127.0.0.1:65073_ c:control_collection s:shard1 r:core_node1 x:collection1] o.a.s.c.SyncStrategy Sync replicas to http://127.0.0.1:65073/collection1/
   [junit4]   2> 699148 INFO  (coreZkRegister-2183-thread-1-processing-n:127.0.0.1:65073_ x:collection1 s:shard1 c:control_collection r:core_node1) [n:127.0.0.1:65073_ c:control_collection s:shard1 r:core_node1 x:collection1] o.a.s.c.SyncStrategy Sync Success - now sync replicas to me
   [junit4]   2> 699148 INFO  (coreZkRegister-2183-thread-1-processing-n:127.0.0.1:65073_ x:collection1 s:shard1 c:control_collection r:core_node1) [n:127.0.0.1:65073_ c:control_collection s:shard1 r:core_node1 x:collection1] o.a.s.c.SyncStrategy http://127.0.0.1:65073/collection1/ has no replicas
   [junit4]   2> 699148 INFO  (OverseerStateUpdate-95293434785497094-127.0.0.1:65073_-n_0000000000) [n:127.0.0.1:65073_    ] o.a.s.c.Overseer processMessage: queueSize: 1, message = {
   [junit4]   2>   "operation":"leader",
   [junit4]   2>   "shard":"shard1",
   [junit4]   2>   "collection":"control_collection"} current state version: 1
   [junit4]   2> 699149 INFO  (coreZkRegister-2183-thread-1-processing-n:127.0.0.1:65073_ x:collection1 s:shard1 c:control_collection r:core_node1) [n:127.0.0.1:65073_ c:control_collection s:shard1 r:core_node1 x:collection1] o.a.s.c.c.SolrZkClient makePath: /collections/control_collection/leaders/shard1
   [junit4]   2> 699151 INFO  (coreZkRegister-2183-thread-1-processing-n:127.0.0.1:65073_ x:collection1 s:shard1 c:control_collection r:core_node1) [n:127.0.0.1:65073_ c:control_collection s:shard1 r:core_node1 x:collection1] o.a.s.c.ShardLeaderElectionContextBase Creating leader registration node
   [junit4]   2> 699153 INFO  (coreZkRegister-2183-thread-1-processing-n:127.0.0.1:65073_ x:collection1 s:shard1 c:control_collection r:core_node1) [n:127.0.0.1:65073_ c:control_collection s:shard1 r:core_node1 x:collection1] o.a.s.c.ShardLeaderElectionContext I am the new leader: http://127.0.0.1:65073/collection1/ shard1
   [junit4]   2> 699153 INFO  (OverseerStateUpdate-95293434785497094-127.0.0.1:65073_-n_0000000000) [n:127.0.0.1:65073_    ] o.a.s.c.Overseer processMessage: queueSize: 1, message = {
   [junit4]   2>   "operation":"leader",
   [junit4]   2>   "shard":"shard1",
   [junit4]   2>   "collection":"control_collection",
   [junit4]   2>   "base_url":"http://127.0.0.1:65073",
   [junit4]   2>   "core":"collection1",
   [junit4]   2>   "state":"active"} current state version: 1
   [junit4]   2> 699257 INFO  (zkCallback-949-thread-1-processing-n:127.0.0.1:65073_) [n:127.0.0.1:65073_    ] o.a.s.c.c.ZkStateReader A cluster state change: [WatchedEvent state:SyncConnected type:NodeDataChanged path:/clusterstate.json], has occurred - updating... (live nodes size: [1])
   [junit4]   2> 699306 INFO  (coreZkRegister-2183-thread-1-processing-n:127.0.0.1:65073_ x:collection1 s:shard1 c:control_collection r:core_node1) [n:127.0.0.1:65073_ c:control_collection s:shard1 r:core_node1 x:collection1] o.a.s.c.ZkController We are http://127.0.0.1:65073/collection1/ and leader is http://127.0.0.1:65073/collection1/
   [junit4]   2> 699306 INFO  (coreZkRegister-2183-thread-1-processing-n:127.0.0.1:65073_ x:collection1 s:shard1 c:control_collection r:core_node1) [n:127.0.0.1:65073_ c:control_collection s:shard1 r:core_node1 x:collection1] o.a.s.c.ZkController No LogReplay needed for core=collection1 baseURL=http://127.0.0.1:65073
   [junit4]   2> 699306 INFO  (coreZkRegister-2183-thread-1-processing-n:127.0.0.1:65073_ x:collection1 s:shard1 c:control_collection r:core_node1) [n:127.0.0.1:65073_ c:control_collection s:shard1 r:core_node1 x:collection1] o.a.s.c.ZkController I am the leader, no recovery necessary
   [junit4]   2> 699306 INFO  (coreZkRegister-2183-thread-1-processing-n:127.0.0.1:65073_ x:collection1 s:shard1 c:control_collection r:core_node1) [n:127.0.0.1:65073_ c:control_collection s:shard1 r:core_node1 x:collection1] o.a.s.c.ZkController publishing state=active
   [junit4]   2> 699306 INFO  (coreZkRegister-2183-thread-1-processing-n:127.0.0.1:65073_ x:collection1 s:shard1 c:control_collection r:core_node1) [n:127.0.0.1:65073_ c:control_collection s:shard1 r:core_node1 x:collection1] o.a.s.c.ZkController numShards not found on descriptor - reading it from system property
   [junit4]   2> 699307 INFO  (OverseerStateUpdate-95293434785497094-127.0.0.1:65073_-n_0000000000) [n:127.0.0.1:65073_    ] o.a.s.c.Overseer processMessage: queueSize: 1, message = {
   [junit4]   2>   "core":"collection1",
   [junit4]   2>   "core_node_name":"core_node1",
   [junit4]   2>   "roles":null,
   [junit4]   2>   "base_url":"http://127.0.0.1:65073",
   [junit4]   2>   "node_name":"127.0.0.1:65073_",
   [junit4]   2>   "numShards":"1",
   [junit4]   2>   "state":"active",
   [junit4]   2>   "shard":"shard1",
   [junit4]   2>   "collection":"control_collection",
   [junit4]   2>   "operation":"state"} current state version: 2
   [junit4]   2> 699308 INFO  (OverseerStateUpdate-95293434785497094-127.0.0.1:65073_-n_0000000000) [n:127.0.0.1:65073_    ] o.a.s.c.o.ReplicaMutator Update state numShards=1 message={
   [junit4]   2>   "core":"collection1",
   [junit4]   2>   "core_node_name":"core_node1",
   [ju

[...truncated too long message...]

362)
   [junit4]    >         at java.util.concurrent.SynchronousQueue.poll(SynchronousQueue.java:941)
   [junit4]    >         at java.util.concurrent.ThreadPoolExecutor.getTask(ThreadPoolExecutor.java:1066)
   [junit4]    >         at java.util.concurrent.ThreadPoolExecutor.runWorker(ThreadPoolExecutor.java:1127)
   [junit4]    >         at java.util.concurrent.ThreadPoolExecutor$Worker.run(ThreadPoolExecutor.java:617)
   [junit4]    >         at java.lang.Thread.run(Thread.java:745)
   [junit4]    >    4) Thread[id=6258, name=zkCallback-979-thread-4, state=TIMED_WAITING, group=TGRP-CollectionsAPIDistributedZkTest]
   [junit4]    >         at sun.misc.Unsafe.park(Native Method)
   [junit4]    >         at java.util.concurrent.locks.LockSupport.parkNanos(LockSupport.java:215)
   [junit4]    >         at java.util.concurrent.SynchronousQueue$TransferStack.awaitFulfill(SynchronousQueue.java:460)
   [junit4]    >         at java.util.concurrent.SynchronousQueue$TransferStack.transfer(SynchronousQueue.java:362)
   [junit4]    >         at java.util.concurrent.SynchronousQueue.poll(SynchronousQueue.java:941)
   [junit4]    >         at java.util.concurrent.ThreadPoolExecutor.getTask(ThreadPoolExecutor.java:1066)
   [junit4]    >         at java.util.concurrent.ThreadPoolExecutor.runWorker(ThreadPoolExecutor.java:1127)
   [junit4]    >         at java.util.concurrent.ThreadPoolExecutor$Worker.run(ThreadPoolExecutor.java:617)
   [junit4]    >         at java.lang.Thread.run(Thread.java:745)
   [junit4]    >    5) Thread[id=6096, name=zkCallback-979-thread-1, state=TIMED_WAITING, group=TGRP-CollectionsAPIDistributedZkTest]
   [junit4]    >         at sun.misc.Unsafe.park(Native Method)
   [junit4]    >         at java.util.concurrent.locks.LockSupport.parkNanos(LockSupport.java:215)
   [junit4]    >         at java.util.concurrent.SynchronousQueue$TransferStack.awaitFulfill(SynchronousQueue.java:460)
   [junit4]    >         at java.util.concurrent.SynchronousQueue$TransferStack.transfer(SynchronousQueue.java:362)
   [junit4]    >         at java.util.concurrent.SynchronousQueue.poll(SynchronousQueue.java:941)
   [junit4]    >         at java.util.concurrent.ThreadPoolExecutor.getTask(ThreadPoolExecutor.java:1066)
   [junit4]    >         at java.util.concurrent.ThreadPoolExecutor.runWorker(ThreadPoolExecutor.java:1127)
   [junit4]    >         at java.util.concurrent.ThreadPoolExecutor$Worker.run(ThreadPoolExecutor.java:617)
   [junit4]    >         at java.lang.Thread.run(Thread.java:745)
   [junit4]    >    6) Thread[id=6237, name=zkCallback-979-thread-2, state=TIMED_WAITING, group=TGRP-CollectionsAPIDistributedZkTest]
   [junit4]    >         at sun.misc.Unsafe.park(Native Method)
   [junit4]    >         at java.util.concurrent.locks.LockSupport.parkNanos(LockSupport.java:215)
   [junit4]    >         at java.util.concurrent.SynchronousQueue$TransferStack.awaitFulfill(SynchronousQueue.java:460)
   [junit4]    >         at java.util.concurrent.SynchronousQueue$TransferStack.transfer(SynchronousQueue.java:362)
   [junit4]    >         at java.util.concurrent.SynchronousQueue.poll(SynchronousQueue.java:941)
   [junit4]    >         at java.util.concurrent.ThreadPoolExecutor.getTask(ThreadPoolExecutor.java:1066)
   [junit4]    >         at java.util.concurrent.ThreadPoolExecutor.runWorker(ThreadPoolExecutor.java:1127)
   [junit4]    >         at java.util.concurrent.ThreadPoolExecutor$Worker.run(ThreadPoolExecutor.java:617)
   [junit4]    >         at java.lang.Thread.run(Thread.java:745)
   [junit4]    > 	at __randomizedtesting.SeedInfo.seed([4395CD5CDB68E563]:0)Throwable #2: com.carrotsearch.randomizedtesting.ThreadLeakError: There are still zombie threads that couldn't be terminated:
   [junit4]    >    1) Thread[id=6094, name=TEST-CollectionsAPIDistributedZkTest.test-seed#[4395CD5CDB68E563]-SendThread(127.0.0.1:65057), state=TIMED_WAITING, group=TGRP-CollectionsAPIDistributedZkTest]
   [junit4]    >         at java.lang.Thread.sleep(Native Method)
   [junit4]    >         at org.apache.zookeeper.client.StaticHostProvider.next(StaticHostProvider.java:101)
   [junit4]    >         at org.apache.zookeeper.ClientCnxn$SendThread.startConnect(ClientCnxn.java:940)
   [junit4]    >         at org.apache.zookeeper.ClientCnxn$SendThread.run(ClientCnxn.java:1003)
   [junit4]    >    2) Thread[id=6257, name=zkCallback-979-thread-3, state=TIMED_WAITING, group=TGRP-CollectionsAPIDistributedZkTest]
   [junit4]    >         at sun.misc.Unsafe.park(Native Method)
   [junit4]    >         at java.util.concurrent.locks.LockSupport.parkNanos(LockSupport.java:215)
   [junit4]    >         at java.util.concurrent.SynchronousQueue$TransferStack.awaitFulfill(SynchronousQueue.java:460)
   [junit4]    >         at java.util.concurrent.SynchronousQueue$TransferStack.transfer(SynchronousQueue.java:362)
   [junit4]    >         at java.util.concurrent.SynchronousQueue.poll(SynchronousQueue.java:941)
   [junit4]    >         at java.util.concurrent.ThreadPoolExecutor.getTask(ThreadPoolExecutor.java:1066)
   [junit4]    >         at java.util.concurrent.ThreadPoolExecutor.runWorker(ThreadPoolExecutor.java:1127)
   [junit4]    >         at java.util.concurrent.ThreadPoolExecutor$Worker.run(ThreadPoolExecutor.java:617)
   [junit4]    >         at java.lang.Thread.run(Thread.java:745)
   [junit4]    >    3) Thread[id=6258, name=zkCallback-979-thread-4, state=TIMED_WAITING, group=TGRP-CollectionsAPIDistributedZkTest]
   [junit4]    >         at sun.misc.Unsafe.park(Native Method)
   [junit4]    >         at java.util.concurrent.locks.LockSupport.parkNanos(LockSupport.java:215)
   [junit4]    >         at java.util.concurrent.SynchronousQueue$TransferStack.awaitFulfill(SynchronousQueue.java:460)
   [junit4]    >         at java.util.concurrent.SynchronousQueue$TransferStack.transfer(SynchronousQueue.java:362)
   [junit4]    >         at java.util.concurrent.SynchronousQueue.poll(SynchronousQueue.java:941)
   [junit4]    >         at java.util.concurrent.ThreadPoolExecutor.getTask(ThreadPoolExecutor.java:1066)
   [junit4]    >         at java.util.concurrent.ThreadPoolExecutor.runWorker(ThreadPoolExecutor.java:1127)
   [junit4]    >         at java.util.concurrent.ThreadPoolExecutor$Worker.run(ThreadPoolExecutor.java:617)
   [junit4]    >         at java.lang.Thread.run(Thread.java:745)
   [junit4]    >    4) Thread[id=6096, name=zkCallback-979-thread-1, state=TIMED_WAITING, group=TGRP-CollectionsAPIDistributedZkTest]
   [junit4]    >         at sun.misc.Unsafe.park(Native Method)
   [junit4]    >         at java.util.concurrent.locks.LockSupport.parkNanos(LockSupport.java:215)
   [junit4]    >         at java.util.concurrent.SynchronousQueue$TransferStack.awaitFulfill(SynchronousQueue.java:460)
   [junit4]    >         at java.util.concurrent.SynchronousQueue$TransferStack.transfer(SynchronousQueue.java:362)
   [junit4]    >         at java.util.concurrent.SynchronousQueue.poll(SynchronousQueue.java:941)
   [junit4]    >         at java.util.concurrent.ThreadPoolExecutor.getTask(ThreadPoolExecutor.java:1066)
   [junit4]    >         at java.util.concurrent.ThreadPoolExecutor.runWorker(ThreadPoolExecutor.java:1127)
   [junit4]    >         at java.util.concurrent.ThreadPoolExecutor$Worker.run(ThreadPoolExecutor.java:617)
   [junit4]    >         at java.lang.Thread.run(Thread.java:745)
   [junit4]    >    5) Thread[id=6237, name=zkCallback-979-thread-2, state=TIMED_WAITING, group=TGRP-CollectionsAPIDistributedZkTest]
   [junit4]    >         at sun.misc.Unsafe.park(Native Method)
   [junit4]    >         at java.util.concurrent.locks.LockSupport.parkNanos(LockSupport.java:215)
   [junit4]    >         at java.util.concurrent.SynchronousQueue$TransferStack.awaitFulfill(SynchronousQueue.java:460)
   [junit4]    >         at java.util.concurrent.SynchronousQueue$TransferStack.transfer(SynchronousQueue.java:362)
   [junit4]    >         at java.util.concurrent.SynchronousQueue.poll(SynchronousQueue.java:941)
   [junit4]    >         at java.util.concurrent.ThreadPoolExecutor.getTask(ThreadPoolExecutor.java:1066)
   [junit4]    >         at java.util.concurrent.ThreadPoolExecutor.runWorker(ThreadPoolExecutor.java:1127)
   [junit4]    >         at java.util.concurrent.ThreadPoolExecutor$Worker.run(ThreadPoolExecutor.java:617)
   [junit4]    >         at java.lang.Thread.run(Thread.java:745)
   [junit4]    > 	at __randomizedtesting.SeedInfo.seed([4395CD5CDB68E563]:0)
   [junit4] Completed [134/566 (1!)] on J1 in 77.62s, 1 test, 3 errors <<< FAILURES!

[...truncated 1332 lines...]
BUILD FAILED
C:\Users\JenkinsSlave\workspace\Lucene-Solr-5.x-Windows\build.xml:750: The following error occurred while executing this line:
C:\Users\JenkinsSlave\workspace\Lucene-Solr-5.x-Windows\build.xml:694: The following error occurred while executing this line:
C:\Users\JenkinsSlave\workspace\Lucene-Solr-5.x-Windows\build.xml:59: The following error occurred while executing this line:
C:\Users\JenkinsSlave\workspace\Lucene-Solr-5.x-Windows\solr\build.xml:233: The following error occurred while executing this line:
C:\Users\JenkinsSlave\workspace\Lucene-Solr-5.x-Windows\solr\common-build.xml:534: The following error occurred while executing this line:
C:\Users\JenkinsSlave\workspace\Lucene-Solr-5.x-Windows\lucene\common-build.xml:1477: The following error occurred while executing this line:
C:\Users\JenkinsSlave\workspace\Lucene-Solr-5.x-Windows\lucene\common-build.xml:1033: There were test failures: 566 suites (7 ignored), 2268 tests, 2 suite-level errors, 1 error, 1405 ignored (30 assumptions) [seed: 4395CD5CDB68E563]

Total time: 47 minutes 51 seconds
Build step 'Invoke Ant' marked build as failure
Archiving artifacts
[WARNINGS] Skipping publisher since build result is FAILURE
Recording test results
Email was triggered for: Failure - Any
Sending email for trigger: Failure - Any