You are viewing a plain text version of this content. The canonical link for it is here.
Posted to dev@lucene.apache.org by Policeman Jenkins Server <je...@thetaphi.de> on 2015/10/21 21:00:09 UTC

[JENKINS-EA] Lucene-Solr-trunk-Linux (32bit/jdk1.9.0-ea-b85) - Build # 14613 - Failure!

Build: http://jenkins.thetaphi.de/job/Lucene-Solr-trunk-Linux/14613/
Java: 32bit/jdk1.9.0-ea-b85 -server -XX:+UseParallelGC

4 tests failed.
FAILED:  junit.framework.TestSuite.org.apache.solr.core.TestLazyCores

Error Message:
ERROR: SolrIndexSearcher opens=51 closes=50

Stack Trace:
java.lang.AssertionError: ERROR: SolrIndexSearcher opens=51 closes=50
	at __randomizedtesting.SeedInfo.seed([CC93F3E2F22D4A7E]:0)
	at org.junit.Assert.fail(Assert.java:93)
	at org.apache.solr.SolrTestCaseJ4.endTrackingSearchers(SolrTestCaseJ4.java:468)
	at org.apache.solr.SolrTestCaseJ4.afterClass(SolrTestCaseJ4.java:234)
	at sun.reflect.NativeMethodAccessorImpl.invoke0(Native Method)
	at sun.reflect.NativeMethodAccessorImpl.invoke(NativeMethodAccessorImpl.java:62)
	at sun.reflect.DelegatingMethodAccessorImpl.invoke(DelegatingMethodAccessorImpl.java:43)
	at java.lang.reflect.Method.invoke(Method.java:520)
	at com.carrotsearch.randomizedtesting.RandomizedRunner.invoke(RandomizedRunner.java:1665)
	at com.carrotsearch.randomizedtesting.RandomizedRunner$7.evaluate(RandomizedRunner.java:827)
	at com.carrotsearch.randomizedtesting.rules.StatementAdapter.evaluate(StatementAdapter.java:36)
	at com.carrotsearch.randomizedtesting.rules.SystemPropertiesRestoreRule$1.evaluate(SystemPropertiesRestoreRule.java:57)
	at org.apache.lucene.util.AbstractBeforeAfterRule$1.evaluate(AbstractBeforeAfterRule.java:46)
	at com.carrotsearch.randomizedtesting.rules.StatementAdapter.evaluate(StatementAdapter.java:36)
	at org.apache.lucene.util.TestRuleStoreClassName$1.evaluate(TestRuleStoreClassName.java:42)
	at com.carrotsearch.randomizedtesting.rules.NoShadowingOrOverridesOnMethodsRule$1.evaluate(NoShadowingOrOverridesOnMethodsRule.java:39)
	at com.carrotsearch.randomizedtesting.rules.NoShadowingOrOverridesOnMethodsRule$1.evaluate(NoShadowingOrOverridesOnMethodsRule.java:39)
	at com.carrotsearch.randomizedtesting.rules.StatementAdapter.evaluate(StatementAdapter.java:36)
	at com.carrotsearch.randomizedtesting.rules.StatementAdapter.evaluate(StatementAdapter.java:36)
	at com.carrotsearch.randomizedtesting.rules.StatementAdapter.evaluate(StatementAdapter.java:36)
	at org.apache.lucene.util.TestRuleAssertionsRequired$1.evaluate(TestRuleAssertionsRequired.java:54)
	at org.apache.lucene.util.TestRuleMarkFailure$1.evaluate(TestRuleMarkFailure.java:48)
	at org.apache.lucene.util.TestRuleIgnoreAfterMaxFailures$1.evaluate(TestRuleIgnoreAfterMaxFailures.java:65)
	at org.apache.lucene.util.TestRuleIgnoreTestSuites$1.evaluate(TestRuleIgnoreTestSuites.java:55)
	at com.carrotsearch.randomizedtesting.rules.StatementAdapter.evaluate(StatementAdapter.java:36)
	at com.carrotsearch.randomizedtesting.ThreadLeakControl$StatementRunner.run(ThreadLeakControl.java:367)
	at java.lang.Thread.run(Thread.java:747)


FAILED:  junit.framework.TestSuite.org.apache.solr.core.TestLazyCores

Error Message:
file handle leaks: [FileChannel(/home/jenkins/workspace/Lucene-Solr-trunk-Linux/solr/build/solr-core/test/J0/temp/solr.core.TestLazyCores_CC93F3E2F22D4A7E-001/index-MMapDirectory-016/write.lock)]

Stack Trace:
java.lang.RuntimeException: file handle leaks: [FileChannel(/home/jenkins/workspace/Lucene-Solr-trunk-Linux/solr/build/solr-core/test/J0/temp/solr.core.TestLazyCores_CC93F3E2F22D4A7E-001/index-MMapDirectory-016/write.lock)]
	at org.apache.lucene.mockfile.LeakFS.onClose(LeakFS.java:64)
	at org.apache.lucene.mockfile.FilterFileSystem.close(FilterFileSystem.java:78)
	at org.apache.lucene.mockfile.FilterFileSystem.close(FilterFileSystem.java:79)
	at org.apache.lucene.util.TestRuleTemporaryFilesCleanup.afterAlways(TestRuleTemporaryFilesCleanup.java:227)
	at com.carrotsearch.randomizedtesting.rules.TestRuleAdapter$1.afterAlways(TestRuleAdapter.java:31)
	at com.carrotsearch.randomizedtesting.rules.StatementAdapter.evaluate(StatementAdapter.java:43)
	at com.carrotsearch.randomizedtesting.rules.StatementAdapter.evaluate(StatementAdapter.java:36)
	at org.apache.lucene.util.TestRuleAssertionsRequired$1.evaluate(TestRuleAssertionsRequired.java:54)
	at org.apache.lucene.util.TestRuleMarkFailure$1.evaluate(TestRuleMarkFailure.java:48)
	at org.apache.lucene.util.TestRuleIgnoreAfterMaxFailures$1.evaluate(TestRuleIgnoreAfterMaxFailures.java:65)
	at org.apache.lucene.util.TestRuleIgnoreTestSuites$1.evaluate(TestRuleIgnoreTestSuites.java:55)
	at com.carrotsearch.randomizedtesting.rules.StatementAdapter.evaluate(StatementAdapter.java:36)
	at com.carrotsearch.randomizedtesting.ThreadLeakControl$StatementRunner.run(ThreadLeakControl.java:367)
	at java.lang.Thread.run(Thread.java:747)
Caused by: java.lang.Exception
	at org.apache.lucene.mockfile.LeakFS.onOpen(LeakFS.java:47)
	at org.apache.lucene.mockfile.HandleTrackingFS.callOpenHook(HandleTrackingFS.java:82)
	at org.apache.lucene.mockfile.HandleTrackingFS.newFileChannel(HandleTrackingFS.java:198)
	at org.apache.lucene.mockfile.HandleTrackingFS.newFileChannel(HandleTrackingFS.java:167)
	at java.nio.channels.FileChannel.open(FileChannel.java:287)
	at java.nio.channels.FileChannel.open(FileChannel.java:335)
	at org.apache.lucene.store.NativeFSLockFactory.obtainFSLock(NativeFSLockFactory.java:113)
	at org.apache.lucene.store.FSLockFactory.obtainLock(FSLockFactory.java:41)
	at org.apache.lucene.store.BaseDirectory.obtainLock(BaseDirectory.java:62)
	at org.apache.lucene.store.FilterDirectory.obtainLock(FilterDirectory.java:99)
	at org.apache.lucene.store.MockDirectoryWrapper.obtainLock(MockDirectoryWrapper.java:1014)
	at org.apache.lucene.index.IndexWriter.<init>(IndexWriter.java:761)
	at org.apache.solr.update.SolrIndexWriter.<init>(SolrIndexWriter.java:78)
	at org.apache.solr.update.SolrIndexWriter.create(SolrIndexWriter.java:65)
	at org.apache.solr.update.DefaultSolrCoreState.createMainIndexWriter(DefaultSolrCoreState.java:231)
	at org.apache.solr.update.DefaultSolrCoreState.getIndexWriter(DefaultSolrCoreState.java:105)
	at org.apache.solr.core.SolrCore.openNewSearcher(SolrCore.java:1642)
	at org.apache.solr.core.SolrCore.getSearcher(SolrCore.java:1784)
	at org.apache.solr.core.SolrCore.initSearcher(SolrCore.java:927)
	at org.apache.solr.core.SolrCore.<init>(SolrCore.java:804)
	at org.apache.solr.core.SolrCore.<init>(SolrCore.java:672)
	at org.apache.solr.core.CoreContainer.create(CoreContainer.java:729)
	at org.apache.solr.core.CoreContainer$1.call(CoreContainer.java:449)
	at org.apache.solr.core.CoreContainer$1.call(CoreContainer.java:440)
	at java.util.concurrent.FutureTask.run(FutureTask.java:265)
	at org.apache.solr.common.util.ExecutorUtil$MDCAwareThreadPoolExecutor$1.run(ExecutorUtil.java:231)
	at java.util.concurrent.ThreadPoolExecutor.runWorker(ThreadPoolExecutor.java:1142)
	at java.util.concurrent.ThreadPoolExecutor$Worker.run(ThreadPoolExecutor.java:617)
	... 1 more


FAILED:  junit.framework.TestSuite.org.apache.solr.core.TestLazyCores

Error Message:
1 thread leaked from SUITE scope at org.apache.solr.core.TestLazyCores:     1) Thread[id=178, name=searcherExecutor-187-thread-1, state=WAITING, group=TGRP-TestLazyCores]         at sun.misc.Unsafe.park(Native Method)         at java.util.concurrent.locks.LockSupport.park(LockSupport.java:175)         at java.util.concurrent.locks.AbstractQueuedSynchronizer$ConditionObject.await(AbstractQueuedSynchronizer.java:2039)         at java.util.concurrent.LinkedBlockingQueue.take(LinkedBlockingQueue.java:442)         at java.util.concurrent.ThreadPoolExecutor.getTask(ThreadPoolExecutor.java:1067)         at java.util.concurrent.ThreadPoolExecutor.runWorker(ThreadPoolExecutor.java:1127)         at java.util.concurrent.ThreadPoolExecutor$Worker.run(ThreadPoolExecutor.java:617)         at java.lang.Thread.run(Thread.java:747)

Stack Trace:
com.carrotsearch.randomizedtesting.ThreadLeakError: 1 thread leaked from SUITE scope at org.apache.solr.core.TestLazyCores: 
   1) Thread[id=178, name=searcherExecutor-187-thread-1, state=WAITING, group=TGRP-TestLazyCores]
        at sun.misc.Unsafe.park(Native Method)
        at java.util.concurrent.locks.LockSupport.park(LockSupport.java:175)
        at java.util.concurrent.locks.AbstractQueuedSynchronizer$ConditionObject.await(AbstractQueuedSynchronizer.java:2039)
        at java.util.concurrent.LinkedBlockingQueue.take(LinkedBlockingQueue.java:442)
        at java.util.concurrent.ThreadPoolExecutor.getTask(ThreadPoolExecutor.java:1067)
        at java.util.concurrent.ThreadPoolExecutor.runWorker(ThreadPoolExecutor.java:1127)
        at java.util.concurrent.ThreadPoolExecutor$Worker.run(ThreadPoolExecutor.java:617)
        at java.lang.Thread.run(Thread.java:747)
	at __randomizedtesting.SeedInfo.seed([CC93F3E2F22D4A7E]:0)


FAILED:  junit.framework.TestSuite.org.apache.solr.core.TestLazyCores

Error Message:
There are still zombie threads that couldn't be terminated:    1) Thread[id=178, name=searcherExecutor-187-thread-1, state=WAITING, group=TGRP-TestLazyCores]         at sun.misc.Unsafe.park(Native Method)         at java.util.concurrent.locks.LockSupport.park(LockSupport.java:175)         at java.util.concurrent.locks.AbstractQueuedSynchronizer$ConditionObject.await(AbstractQueuedSynchronizer.java:2039)         at java.util.concurrent.LinkedBlockingQueue.take(LinkedBlockingQueue.java:442)         at java.util.concurrent.ThreadPoolExecutor.getTask(ThreadPoolExecutor.java:1067)         at java.util.concurrent.ThreadPoolExecutor.runWorker(ThreadPoolExecutor.java:1127)         at java.util.concurrent.ThreadPoolExecutor$Worker.run(ThreadPoolExecutor.java:617)         at java.lang.Thread.run(Thread.java:747)

Stack Trace:
com.carrotsearch.randomizedtesting.ThreadLeakError: There are still zombie threads that couldn't be terminated:
   1) Thread[id=178, name=searcherExecutor-187-thread-1, state=WAITING, group=TGRP-TestLazyCores]
        at sun.misc.Unsafe.park(Native Method)
        at java.util.concurrent.locks.LockSupport.park(LockSupport.java:175)
        at java.util.concurrent.locks.AbstractQueuedSynchronizer$ConditionObject.await(AbstractQueuedSynchronizer.java:2039)
        at java.util.concurrent.LinkedBlockingQueue.take(LinkedBlockingQueue.java:442)
        at java.util.concurrent.ThreadPoolExecutor.getTask(ThreadPoolExecutor.java:1067)
        at java.util.concurrent.ThreadPoolExecutor.runWorker(ThreadPoolExecutor.java:1127)
        at java.util.concurrent.ThreadPoolExecutor$Worker.run(ThreadPoolExecutor.java:617)
        at java.lang.Thread.run(Thread.java:747)
	at __randomizedtesting.SeedInfo.seed([CC93F3E2F22D4A7E]:0)




Build Log:
[...truncated 9436 lines...]
   [junit4] Suite: org.apache.solr.core.TestLazyCores
   [junit4]   2> Creating dataDir: /home/jenkins/workspace/Lucene-Solr-trunk-Linux/solr/build/solr-core/test/J0/temp/solr.core.TestLazyCores_CC93F3E2F22D4A7E-001/init-core-data-001
   [junit4]   2> 8187 INFO  (SUITE-TestLazyCores-seed#[CC93F3E2F22D4A7E]-worker) [    ] o.a.s.SolrTestCaseJ4 Randomized ssl (false) and clientAuth (true)
   [junit4]   2> 8189 INFO  (TEST-TestLazyCores.testLazySearch-seed#[CC93F3E2F22D4A7E]) [    ] o.a.s.SolrTestCaseJ4 ###Starting testLazySearch
   [junit4]   2> 8231 INFO  (TEST-TestLazyCores.testLazySearch-seed#[CC93F3E2F22D4A7E]) [    ] o.a.s.c.SolrResourceLoader new SolrResourceLoader for directory: '/home/jenkins/workspace/Lucene-Solr-trunk-Linux/solr/build/solr-core/test/J0/temp/solr.core.TestLazyCores_CC93F3E2F22D4A7E-001/tempDir-001/'
   [junit4]   2> 8236 INFO  (TEST-TestLazyCores.testLazySearch-seed#[CC93F3E2F22D4A7E]) [    ] o.a.s.c.SolrResourceLoader JNDI not configured for solr (NoInitialContextEx)
   [junit4]   2> 8236 INFO  (TEST-TestLazyCores.testLazySearch-seed#[CC93F3E2F22D4A7E]) [    ] o.a.s.c.SolrResourceLoader solr home defaulted to 'solr/' (could not find system property or JNDI)
   [junit4]   2> 8361 INFO  (TEST-TestLazyCores.testLazySearch-seed#[CC93F3E2F22D4A7E]) [    ] o.a.s.c.CoreContainer New CoreContainer 30458002
   [junit4]   2> 8361 INFO  (TEST-TestLazyCores.testLazySearch-seed#[CC93F3E2F22D4A7E]) [    ] o.a.s.c.CoreContainer Loading cores into CoreContainer [instanceDir=/home/jenkins/workspace/Lucene-Solr-trunk-Linux/solr/build/solr-core/test/J0/temp/solr.core.TestLazyCores_CC93F3E2F22D4A7E-001/tempDir-001/]
   [junit4]   2> 8361 INFO  (TEST-TestLazyCores.testLazySearch-seed#[CC93F3E2F22D4A7E]) [    ] o.a.s.c.CoreContainer loading shared library: /home/jenkins/workspace/Lucene-Solr-trunk-Linux/solr/build/solr-core/test/J0/temp/solr.core.TestLazyCores_CC93F3E2F22D4A7E-001/tempDir-001/lib
   [junit4]   2> 8361 WARN  (TEST-TestLazyCores.testLazySearch-seed#[CC93F3E2F22D4A7E]) [    ] o.a.s.c.SolrResourceLoader Can't find (or read) directory to add to classloader: lib (resolved as: /home/jenkins/workspace/Lucene-Solr-trunk-Linux/solr/build/solr-core/test/J0/temp/solr.core.TestLazyCores_CC93F3E2F22D4A7E-001/tempDir-001/lib).
   [junit4]   2> 8385 INFO  (TEST-TestLazyCores.testLazySearch-seed#[CC93F3E2F22D4A7E]) [    ] o.a.s.h.c.HttpShardHandlerFactory created with socketTimeout : 600000,connTimeout : 60000,maxConnectionsPerHost : 20,maxConnections : 10000,corePoolSize : 0,maximumPoolSize : 2147483647,maxThreadIdleTime : 5,sizeOfQueue : -1,fairnessPolicy : false,useRetries : false,
   [junit4]   2> 8505 INFO  (TEST-TestLazyCores.testLazySearch-seed#[CC93F3E2F22D4A7E]) [    ] o.a.s.u.UpdateShardHandler Creating UpdateShardHandler HTTP client with params: socketTimeout=600000&connTimeout=60000&retry=true
   [junit4]   2> 8507 INFO  (TEST-TestLazyCores.testLazySearch-seed#[CC93F3E2F22D4A7E]) [    ] o.a.s.c.CoreContainer Allocating transient cache for 4 transient cores
   [junit4]   2> 8509 INFO  (TEST-TestLazyCores.testLazySearch-seed#[CC93F3E2F22D4A7E]) [    ] o.a.s.l.LogWatcher SLF4J impl is org.slf4j.impl.Log4jLoggerFactory
   [junit4]   2> 8510 INFO  (TEST-TestLazyCores.testLazySearch-seed#[CC93F3E2F22D4A7E]) [    ] o.a.s.l.LogWatcher Registering Log Listener [Log4j (org.slf4j.impl.Log4jLoggerFactory)]
   [junit4]   2> 8513 INFO  (TEST-TestLazyCores.testLazySearch-seed#[CC93F3E2F22D4A7E]) [    ] o.a.s.c.CoreContainer Security conf doesn't exist. Skipping setup for authorization module.
   [junit4]   2> 8513 INFO  (TEST-TestLazyCores.testLazySearch-seed#[CC93F3E2F22D4A7E]) [    ] o.a.s.c.CoreContainer No authentication plugin used.
   [junit4]   2> 8575 INFO  (TEST-TestLazyCores.testLazySearch-seed#[CC93F3E2F22D4A7E]) [    ] o.a.s.c.SolrCore Created CoreDescriptor: {name=collection1, config=solrconfig.xml, transient=false, schema=schema.xml, loadOnStartup=true, configSetProperties=configsetprops.json, instanceDir=collection1, absoluteInstDir=/home/jenkins/workspace/Lucene-Solr-trunk-Linux/solr/build/solr-core/test/J0/temp/solr.core.TestLazyCores_CC93F3E2F22D4A7E-001/tempDir-001/collection1/, dataDir=data/}
   [junit4]   2> 8576 INFO  (TEST-TestLazyCores.testLazySearch-seed#[CC93F3E2F22D4A7E]) [    ] o.a.s.c.SolrCore Created CoreDescriptor: {name=collectionLazy2, config=solrconfig.xml, transient=true, schema=schema.xml, loadOnStartup=true, configSetProperties=configsetprops.json, instanceDir=collection2, absoluteInstDir=/home/jenkins/workspace/Lucene-Solr-trunk-Linux/solr/build/solr-core/test/J0/temp/solr.core.TestLazyCores_CC93F3E2F22D4A7E-001/tempDir-001/collection2/, dataDir=data/}
   [junit4]   2> 8576 INFO  (TEST-TestLazyCores.testLazySearch-seed#[CC93F3E2F22D4A7E]) [    ] o.a.s.c.SolrCore Created CoreDescriptor: {name=collectionLazy3, config=solrconfig.xml, transient=on, schema=schema.xml, loadOnStartup=false, configSetProperties=configsetprops.json, instanceDir=collection3, absoluteInstDir=/home/jenkins/workspace/Lucene-Solr-trunk-Linux/solr/build/solr-core/test/J0/temp/solr.core.TestLazyCores_CC93F3E2F22D4A7E-001/tempDir-001/collection3/, dataDir=data/}
   [junit4]   2> 8576 INFO  (TEST-TestLazyCores.testLazySearch-seed#[CC93F3E2F22D4A7E]) [    ] o.a.s.c.SolrCore Created CoreDescriptor: {name=collectionLazy4, config=solrconfig.xml, transient=false, schema=schema.xml, loadOnStartup=false, configSetProperties=configsetprops.json, instanceDir=collection4, absoluteInstDir=/home/jenkins/workspace/Lucene-Solr-trunk-Linux/solr/build/solr-core/test/J0/temp/solr.core.TestLazyCores_CC93F3E2F22D4A7E-001/tempDir-001/collection4/, dataDir=data/}
   [junit4]   2> 8577 INFO  (TEST-TestLazyCores.testLazySearch-seed#[CC93F3E2F22D4A7E]) [    ] o.a.s.c.SolrCore Created CoreDescriptor: {name=collectionLazy5, config=solrconfig.xml, transient=false, schema=schema.xml, loadOnStartup=true, configSetProperties=configsetprops.json, instanceDir=collection5, absoluteInstDir=/home/jenkins/workspace/Lucene-Solr-trunk-Linux/solr/build/solr-core/test/J0/temp/solr.core.TestLazyCores_CC93F3E2F22D4A7E-001/tempDir-001/collection5/, dataDir=data/}
   [junit4]   2> 8577 INFO  (TEST-TestLazyCores.testLazySearch-seed#[CC93F3E2F22D4A7E]) [    ] o.a.s.c.SolrCore Created CoreDescriptor: {name=collectionLazy6, config=solrconfig.xml, transient=true, schema=schema.xml, loadOnStartup=false, configSetProperties=configsetprops.json, instanceDir=collection6, absoluteInstDir=/home/jenkins/workspace/Lucene-Solr-trunk-Linux/solr/build/solr-core/test/J0/temp/solr.core.TestLazyCores_CC93F3E2F22D4A7E-001/tempDir-001/collection6/, dataDir=data/}
   [junit4]   2> 8578 INFO  (TEST-TestLazyCores.testLazySearch-seed#[CC93F3E2F22D4A7E]) [    ] o.a.s.c.SolrCore Created CoreDescriptor: {name=collectionLazy7, config=solrconfig.xml, transient=true, schema=schema.xml, loadOnStartup=false, configSetProperties=configsetprops.json, instanceDir=collection7, absoluteInstDir=/home/jenkins/workspace/Lucene-Solr-trunk-Linux/solr/build/solr-core/test/J0/temp/solr.core.TestLazyCores_CC93F3E2F22D4A7E-001/tempDir-001/collection7/, dataDir=data/}
   [junit4]   2> 8578 INFO  (TEST-TestLazyCores.testLazySearch-seed#[CC93F3E2F22D4A7E]) [    ] o.a.s.c.SolrCore Created CoreDescriptor: {name=collectionLazy8, config=solrconfig.xml, transient=true, schema=schema.xml, loadOnStartup=false, configSetProperties=configsetprops.json, instanceDir=collection8, absoluteInstDir=/home/jenkins/workspace/Lucene-Solr-trunk-Linux/solr/build/solr-core/test/J0/temp/solr.core.TestLazyCores_CC93F3E2F22D4A7E-001/tempDir-001/collection8/, dataDir=data/}
   [junit4]   2> 8579 INFO  (TEST-TestLazyCores.testLazySearch-seed#[CC93F3E2F22D4A7E]) [    ] o.a.s.c.SolrCore Created CoreDescriptor: {name=collectionLazy9, config=solrconfig.xml, transient=true, schema=schema.xml, loadOnStartup=false, configSetProperties=configsetprops.json, instanceDir=collection9, absoluteInstDir=/home/jenkins/workspace/Lucene-Solr-trunk-Linux/solr/build/solr-core/test/J0/temp/solr.core.TestLazyCores_CC93F3E2F22D4A7E-001/tempDir-001/collection9/, dataDir=data/}
   [junit4]   2> 8582 INFO  (coreLoadExecutor-6-thread-1) [    ] o.a.s.c.SolrResourceLoader new SolrResourceLoader for directory: '/home/jenkins/workspace/Lucene-Solr-trunk-Linux/solr/build/solr-core/test/J0/temp/solr.core.TestLazyCores_CC93F3E2F22D4A7E-001/tempDir-001/collection1/'
   [junit4]   2> 8582 INFO  (coreLoadExecutor-6-thread-3) [    ] o.a.s.c.SolrResourceLoader new SolrResourceLoader for directory: '/home/jenkins/workspace/Lucene-Solr-trunk-Linux/solr/build/solr-core/test/J0/temp/solr.core.TestLazyCores_CC93F3E2F22D4A7E-001/tempDir-001/collection5/'
   [junit4]   2> 8582 INFO  (coreLoadExecutor-6-thread-2) [    ] o.a.s.c.SolrResourceLoader new SolrResourceLoader for directory: '/home/jenkins/workspace/Lucene-Solr-trunk-Linux/solr/build/solr-core/test/J0/temp/solr.core.TestLazyCores_CC93F3E2F22D4A7E-001/tempDir-001/collection2/'
   [junit4]   2> 8582 INFO  (coreLoadExecutor-6-thread-3) [    ] o.a.s.c.SolrResourceLoader JNDI not configured for solr (NoInitialContextEx)
   [junit4]   2> 8582 INFO  (coreLoadExecutor-6-thread-1) [    ] o.a.s.c.SolrResourceLoader JNDI not configured for solr (NoInitialContextEx)
   [junit4]   2> 8583 INFO  (coreLoadExecutor-6-thread-3) [    ] o.a.s.c.SolrResourceLoader solr home defaulted to 'solr/' (could not find system property or JNDI)
   [junit4]   2> 8583 INFO  (coreLoadExecutor-6-thread-2) [    ] o.a.s.c.SolrResourceLoader JNDI not configured for solr (NoInitialContextEx)
   [junit4]   2> 8583 INFO  (coreLoadExecutor-6-thread-1) [    ] o.a.s.c.SolrResourceLoader solr home defaulted to 'solr/' (could not find system property or JNDI)
   [junit4]   2> 8585 INFO  (coreLoadExecutor-6-thread-2) [    ] o.a.s.c.SolrResourceLoader solr home defaulted to 'solr/' (could not find system property or JNDI)
   [junit4]   2> 8661 INFO  (coreLoadExecutor-6-thread-2) [    ] o.a.s.c.SolrConfig current version of requestparams : -1
   [junit4]   2> 8661 INFO  (coreLoadExecutor-6-thread-1) [    ] o.a.s.c.SolrConfig current version of requestparams : -1
   [junit4]   2> 8662 INFO  (coreLoadExecutor-6-thread-3) [    ] o.a.s.c.SolrConfig current version of requestparams : -1
   [junit4]   2> 8738 INFO  (coreLoadExecutor-6-thread-2) [    ] o.a.s.c.SolrConfig Using Lucene MatchVersion: 6.0.0
   [junit4]   2> 8739 INFO  (coreLoadExecutor-6-thread-1) [    ] o.a.s.c.SolrConfig Using Lucene MatchVersion: 6.0.0
   [junit4]   2> 8740 INFO  (coreLoadExecutor-6-thread-3) [    ] o.a.s.c.SolrConfig Using Lucene MatchVersion: 6.0.0
   [junit4]   2> 8779 INFO  (coreLoadExecutor-6-thread-3) [    ] o.a.s.c.Config Loaded SolrConfig: solrconfig.xml
   [junit4]   2> 8779 INFO  (coreLoadExecutor-6-thread-1) [    ] o.a.s.c.Config Loaded SolrConfig: solrconfig.xml
   [junit4]   2> 8779 INFO  (coreLoadExecutor-6-thread-2) [    ] o.a.s.c.Config Loaded SolrConfig: solrconfig.xml
   [junit4]   2> 8786 INFO  (coreLoadExecutor-6-thread-3) [    ] o.a.s.s.IndexSchema Reading Solr Schema from /home/jenkins/workspace/Lucene-Solr-trunk-Linux/solr/build/solr-core/test/J0/temp/solr.core.TestLazyCores_CC93F3E2F22D4A7E-001/tempDir-001/collection5/conf/schema.xml
   [junit4]   2> 8786 INFO  (coreLoadExecutor-6-thread-1) [    ] o.a.s.s.IndexSchema Reading Solr Schema from /home/jenkins/workspace/Lucene-Solr-trunk-Linux/solr/build/solr-core/test/J0/temp/solr.core.TestLazyCores_CC93F3E2F22D4A7E-001/tempDir-001/collection1/conf/schema.xml
   [junit4]   2> 8786 INFO  (coreLoadExecutor-6-thread-2) [    ] o.a.s.s.IndexSchema Reading Solr Schema from /home/jenkins/workspace/Lucene-Solr-trunk-Linux/solr/build/solr-core/test/J0/temp/solr.core.TestLazyCores_CC93F3E2F22D4A7E-001/tempDir-001/collection2/conf/schema.xml
   [junit4]   2> 8794 INFO  (coreLoadExecutor-6-thread-3) [    ] o.a.s.s.IndexSchema [collectionLazy5] Schema name=tiny
   [junit4]   2> 8794 INFO  (coreLoadExecutor-6-thread-1) [    ] o.a.s.s.IndexSchema [collection1] Schema name=tiny
   [junit4]   2> 8794 INFO  (coreLoadExecutor-6-thread-2) [    ] o.a.s.s.IndexSchema [collectionLazy2] Schema name=tiny
   [junit4]   2> 8840 INFO  (coreLoadExecutor-6-thread-2) [    ] o.a.s.s.IndexSchema unique key field: id
   [junit4]   2> 8840 INFO  (coreLoadExecutor-6-thread-1) [    ] o.a.s.s.IndexSchema unique key field: id
   [junit4]   2> 8841 INFO  (coreLoadExecutor-6-thread-3) [    ] o.a.s.s.IndexSchema unique key field: id
   [junit4]   2> 8845 INFO  (coreLoadExecutor-6-thread-1) [    ] o.a.s.c.ConfigSetProperties Did not find ConfigSet properties, assuming default properties: Can't find resource 'configsetprops.json' in classpath or '/home/jenkins/workspace/Lucene-Solr-trunk-Linux/solr/build/solr-core/test/J0/temp/solr.core.TestLazyCores_CC93F3E2F22D4A7E-001/tempDir-001/collection1/conf'
   [junit4]   2> 8845 INFO  (coreLoadExecutor-6-thread-3) [    ] o.a.s.c.ConfigSetProperties Did not find ConfigSet properties, assuming default properties: Can't find resource 'configsetprops.json' in classpath or '/home/jenkins/workspace/Lucene-Solr-trunk-Linux/solr/build/solr-core/test/J0/temp/solr.core.TestLazyCores_CC93F3E2F22D4A7E-001/tempDir-001/collection5/conf'
   [junit4]   2> 8845 INFO  (coreLoadExecutor-6-thread-2) [    ] o.a.s.c.ConfigSetProperties Did not find ConfigSet properties, assuming default properties: Can't find resource 'configsetprops.json' in classpath or '/home/jenkins/workspace/Lucene-Solr-trunk-Linux/solr/build/solr-core/test/J0/temp/solr.core.TestLazyCores_CC93F3E2F22D4A7E-001/tempDir-001/collection2/conf'
   [junit4]   2> 8846 INFO  (coreLoadExecutor-6-thread-2) [    ] o.a.s.c.CoreContainer Creating SolrCore 'collectionLazy2' using configuration from instancedir /home/jenkins/workspace/Lucene-Solr-trunk-Linux/solr/build/solr-core/test/J0/temp/solr.core.TestLazyCores_CC93F3E2F22D4A7E-001/tempDir-001/collection2/
   [junit4]   2> 8846 INFO  (coreLoadExecutor-6-thread-1) [    ] o.a.s.c.CoreContainer Creating SolrCore 'collection1' using configuration from instancedir /home/jenkins/workspace/Lucene-Solr-trunk-Linux/solr/build/solr-core/test/J0/temp/solr.core.TestLazyCores_CC93F3E2F22D4A7E-001/tempDir-001/collection1/
   [junit4]   2> 8846 INFO  (coreLoadExecutor-6-thread-3) [    ] o.a.s.c.CoreContainer Creating SolrCore 'collectionLazy5' using configuration from instancedir /home/jenkins/workspace/Lucene-Solr-trunk-Linux/solr/build/solr-core/test/J0/temp/solr.core.TestLazyCores_CC93F3E2F22D4A7E-001/tempDir-001/collection5/
   [junit4]   2> 8847 INFO  (coreLoadExecutor-6-thread-1) [    x:collection1] o.a.s.c.SolrCore org.apache.solr.core.MockDirectoryFactory
   [junit4]   2> 8847 INFO  (coreLoadExecutor-6-thread-2) [    x:collectionLazy2] o.a.s.c.SolrCore org.apache.solr.core.MockDirectoryFactory
   [junit4]   2> 8847 INFO  (coreLoadExecutor-6-thread-3) [    x:collectionLazy5] o.a.s.c.SolrCore org.apache.solr.core.MockDirectoryFactory
   [junit4]   2> 8856 INFO  (coreLoadExecutor-6-thread-1) [    x:collection1] o.a.s.c.SolrCore [[collection1] ] Opening new SolrCore at [/home/jenkins/workspace/Lucene-Solr-trunk-Linux/solr/build/solr-core/test/J0/temp/solr.core.TestLazyCores_CC93F3E2F22D4A7E-001/tempDir-001/collection1/], dataDir=[null]
   [junit4]   2> 8856 INFO  (coreLoadExecutor-6-thread-2) [    x:collectionLazy2] o.a.s.c.SolrCore [[collectionLazy2] ] Opening new SolrCore at [/home/jenkins/workspace/Lucene-Solr-trunk-Linux/solr/build/solr-core/test/J0/temp/solr.core.TestLazyCores_CC93F3E2F22D4A7E-001/tempDir-001/collection2/], dataDir=[null]
   [junit4]   2> 8856 INFO  (coreLoadExecutor-6-thread-3) [    x:collectionLazy5] o.a.s.c.SolrCore [[collectionLazy5] ] Opening new SolrCore at [/home/jenkins/workspace/Lucene-Solr-trunk-Linux/solr/build/solr-core/test/J0/temp/solr.core.TestLazyCores_CC93F3E2F22D4A7E-001/tempDir-001/collection5/], dataDir=[null]
   [junit4]   2> 8856 INFO  (coreLoadExecutor-6-thread-2) [    x:collectionLazy2] o.a.s.c.SolrCore JMX monitoring not detected for core: collectionLazy2
   [junit4]   2> 8856 INFO  (coreLoadExecutor-6-thread-1) [    x:collection1] o.a.s.c.SolrCore JMX monitoring not detected for core: collection1
   [junit4]   2> 8856 INFO  (coreLoadExecutor-6-thread-3) [    x:collectionLazy5] o.a.s.c.SolrCore JMX monitoring not detected for core: collectionLazy5
   [junit4]   2> 8873 INFO  (coreLoadExecutor-6-thread-2) [    x:collectionLazy2] o.a.s.c.CachingDirectoryFactory return new directory for /home/jenkins/workspace/Lucene-Solr-trunk-Linux/solr/build/solr-core/test/J0/temp/solr.core.TestLazyCores_CC93F3E2F22D4A7E-001/tempDir-001/collection2/data
   [junit4]   2> 8873 INFO  (coreLoadExecutor-6-thread-1) [    x:collection1] o.a.s.c.CachingDirectoryFactory return new directory for /home/jenkins/workspace/Lucene-Solr-trunk-Linux/solr/build/solr-core/test/J0/temp/solr.core.TestLazyCores_CC93F3E2F22D4A7E-001/tempDir-001/collection1/data
   [junit4]   2> 8873 INFO  (coreLoadExecutor-6-thread-3) [    x:collectionLazy5] o.a.s.c.CachingDirectoryFactory return new directory for /home/jenkins/workspace/Lucene-Solr-trunk-Linux/solr/build/solr-core/test/J0/temp/solr.core.TestLazyCores_CC93F3E2F22D4A7E-001/tempDir-001/collection5/data
   [junit4]   2> 8873 INFO  (coreLoadExecutor-6-thread-1) [    x:collection1] o.a.s.c.SolrCore New index directory detected: old=null new=/home/jenkins/workspace/Lucene-Solr-trunk-Linux/solr/build/solr-core/test/J0/temp/solr.core.TestLazyCores_CC93F3E2F22D4A7E-001/tempDir-001/collection1/data/index/
   [junit4]   2> 8873 INFO  (coreLoadExecutor-6-thread-3) [    x:collectionLazy5] o.a.s.c.SolrCore New index directory detected: old=null new=/home/jenkins/workspace/Lucene-Solr-trunk-Linux/solr/build/solr-core/test/J0/temp/solr.core.TestLazyCores_CC93F3E2F22D4A7E-001/tempDir-001/collection5/data/index/
   [junit4]   2> 8873 INFO  (coreLoadExecutor-6-thread-2) [    x:collectionLazy2] o.a.s.c.SolrCore New index directory detected: old=null new=/home/jenkins/workspace/Lucene-Solr-trunk-Linux/solr/build/solr-core/test/J0/temp/solr.core.TestLazyCores_CC93F3E2F22D4A7E-001/tempDir-001/collection2/data/index/
   [junit4]   2> 8873 WARN  (coreLoadExecutor-6-thread-3) [    x:collectionLazy5] o.a.s.c.SolrCore [collectionLazy5] Solr index directory '/home/jenkins/workspace/Lucene-Solr-trunk-Linux/solr/build/solr-core/test/J0/temp/solr.core.TestLazyCores_CC93F3E2F22D4A7E-001/tempDir-001/collection5/data/index' doesn't exist. Creating new index...
   [junit4]   2> 8873 WARN  (coreLoadExecutor-6-thread-1) [    x:collection1] o.a.s.c.SolrCore [collection1] Solr index directory '/home/jenkins/workspace/Lucene-Solr-trunk-Linux/solr/build/solr-core/test/J0/temp/solr.core.TestLazyCores_CC93F3E2F22D4A7E-001/tempDir-001/collection1/data/index' doesn't exist. Creating new index...
   [junit4]   2> 8874 WARN  (coreLoadExecutor-6-thread-2) [    x:collectionLazy2] o.a.s.c.SolrCore [collectionLazy2] Solr index directory '/home/jenkins/workspace/Lucene-Solr-trunk-Linux/solr/build/solr-core/test/J0/temp/solr.core.TestLazyCores_CC93F3E2F22D4A7E-001/tempDir-001/collection2/data/index' doesn't exist. Creating new index...
   [junit4]   2> 8882 INFO  (coreLoadExecutor-6-thread-2) [    x:collectionLazy2] o.a.s.c.CachingDirectoryFactory return new directory for /home/jenkins/workspace/Lucene-Solr-trunk-Linux/solr/build/solr-core/test/J0/temp/solr.core.TestLazyCores_CC93F3E2F22D4A7E-001/tempDir-001/collection2/data/index
   [junit4]   2> 8882 INFO  (coreLoadExecutor-6-thread-1) [    x:collection1] o.a.s.c.CachingDirectoryFactory return new directory for /home/jenkins/workspace/Lucene-Solr-trunk-Linux/solr/build/solr-core/test/J0/temp/solr.core.TestLazyCores_CC93F3E2F22D4A7E-001/tempDir-001/collection1/data/index
   [junit4]   2> 8882 INFO  (coreLoadExecutor-6-thread-3) [    x:collectionLazy5] o.a.s.c.CachingDirectoryFactory return new directory for /home/jenkins/workspace/Lucene-Solr-trunk-Linux/solr/build/solr-core/test/J0/temp/solr.core.TestLazyCores_CC93F3E2F22D4A7E-001/tempDir-001/collection5/data/index
   [junit4]   2> 8891 INFO  (coreLoadExecutor-6-thread-1) [    x:collection1] o.a.s.u.RandomMergePolicy RandomMergePolicy wrapping class org.apache.lucene.index.AlcoholicMergePolicy: [AlcoholicMergePolicy: minMergeSize=0, mergeFactor=10, maxMergeSize=2045970989, maxMergeSizeForForcedMerge=9223372036854775807, calibrateSizeByDeletes=true, maxMergeDocs=2147483647, maxCFSSegmentSizeMB=8.796093022207999E12, noCFSRatio=0.1]
   [junit4]   2> 8891 INFO  (coreLoadExecutor-6-thread-3) [    x:collectionLazy5] o.a.s.u.RandomMergePolicy RandomMergePolicy wrapping class org.apache.lucene.index.AlcoholicMergePolicy: [AlcoholicMergePolicy: minMergeSize=0, mergeFactor=10, maxMergeSize=2045970989, maxMergeSizeForForcedMerge=9223372036854775807, calibrateSizeByDeletes=true, maxMergeDocs=2147483647, maxCFSSegmentSizeMB=8.796093022207999E12, noCFSRatio=0.1]
   [junit4]   2> 8891 INFO  (coreLoadExecutor-6-thread-2) [    x:collectionLazy2] o.a.s.u.RandomMergePolicy RandomMergePolicy wrapping class org.apache.lucene.index.AlcoholicMergePolicy: [AlcoholicMergePolicy: minMergeSize=0, mergeFactor=10, maxMergeSize=2045970989, maxMergeSizeForForcedMerge=9223372036854775807, calibrateSizeByDeletes=true, maxMergeDocs=2147483647, maxCFSSegmentSizeMB=8.796093022207999E12, noCFSRatio=0.1]
   [junit4]   2> 8940 INFO  (coreLoadExecutor-6-thread-1) [    x:collection1] o.a.s.c.SolrCore SolrDeletionPolicy.onCommit: commits: num=1
   [junit4]   2> 	commit{dir=MockDirectoryWrapper(MMapDirectory@/home/jenkins/workspace/Lucene-Solr-trunk-Linux/solr/build/solr-core/test/J0/temp/solr.core.TestLazyCores_CC93F3E2F22D4A7E-001/index-MMapDirectory-002 lockFactory=org.apache.lucene.store.NativeFSLockFactory@fce4f6),segFN=segments_1,generation=1}
   [junit4]   2> 8940 INFO  (coreLoadExecutor-6-thread-3) [    x:collectionLazy5] o.a.s.c.SolrCore SolrDeletionPolicy.onCommit: commits: num=1
   [junit4]   2> 	commit{dir=MockDirectoryWrapper(MMapDirectory@/home/jenkins/workspace/Lucene-Solr-trunk-Linux/solr/build/solr-core/test/J0/temp/solr.core.TestLazyCores_CC93F3E2F22D4A7E-001/index-MMapDirectory-003 lockFactory=org.apache.lucene.store.NativeFSLockFactory@fce4f6),segFN=segments_1,generation=1}
   [junit4]   2> 8940 INFO  (coreLoadExecutor-6-thread-2) [    x:collectionLazy2] o.a.s.c.SolrCore SolrDeletionPolicy.onCommit: commits: num=1
   [junit4]   2> 	commit{dir=MockDirectoryWrapper(MMapDirectory@/home/jenkins/workspace/Lucene-Solr-trunk-Linux/solr/build/solr-core/test/J0/temp/solr.core.TestLazyCores_CC93F3E2F22D4A7E-001/index-MMapDirectory-001 lockFactory=org.apache.lucene.store.NativeFSLockFactory@fce4f6),segFN=segments_1,generation=1}
   [junit4]   2> 8941 INFO  (coreLoadExecutor-6-thread-2) [    x:collectionLazy2] o.a.s.c.SolrCore newest commit generation = 1
   [junit4]   2> 8941 INFO  (coreLoadExecutor-6-thread-3) [    x:collectionLazy5] o.a.s.c.SolrCore newest commit generation = 1
   [junit4]   2> 8941 INFO  (coreLoadExecutor-6-thread-1) [    x:collection1] o.a.s.c.SolrCore newest commit generation = 1
   [junit4]   2> 8942 INFO  (OldIndexDirectoryCleanupThreadForCore-collectionLazy2) [    x:collectionLazy2] o.a.s.c.SolrCore Looking for old index directories to cleanup for core collectionLazy2 in /home/jenkins/workspace/Lucene-Solr-trunk-Linux/solr/build/solr-core/test/J0/temp/solr.core.TestLazyCores_CC93F3E2F22D4A7E-001/tempDir-001/collection2/data/
   [junit4]   2> 8942 INFO  (OldIndexDirectoryCleanupThreadForCore-collection1) [    x:collection1] o.a.s.c.SolrCore Looking for old index directories to cleanup for core collection1 in /home/jenkins/workspace/Lucene-Solr-trunk-Linux/solr/build/solr-core/test/J0/temp/solr.core.TestLazyCores_CC93F3E2F22D4A7E-001/tempDir-001/collection1/data/
   [junit4]   2> 8942 INFO  (OldIndexDirectoryCleanupThreadForCore-collectionLazy5) [    x:collectionLazy5] o.a.s.c.SolrCore Looking for old index directories to cleanup for core collectionLazy5 in /home/jenkins/workspace/Lucene-Solr-trunk-Linux/solr/build/solr-core/test/J0/temp/solr.core.TestLazyCores_CC93F3E2F22D4A7E-001/tempDir-001/collection5/data/
   [junit4]   2> 8942 WARN  (OldIndexDirectoryCleanupThreadForCore-collection1) [    x:collection1] o.a.s.c.DirectoryFactory /home/jenkins/workspace/Lucene-Solr-trunk-Linux/solr/build/solr-core/test/J0/temp/solr.core.TestLazyCores_CC93F3E2F22D4A7E-001/tempDir-001/collection1/data/ does not point to a valid data directory; skipping clean-up of old index directories.
   [junit4]   2> 8944 WARN  (OldIndexDirectoryCleanupThreadForCore-collectionLazy5) [    x:collectionLazy5] o.a.s.c.DirectoryFactory /home/jenkins/workspace/Lucene-Solr-trunk-Linux/solr/build/solr-core/test/J0/temp/solr.core.TestLazyCores_CC93F3E2F22D4A7E-001/tempDir-001/collection5/data/ does not point to a valid data directory; skipping clean-up of old index directories.
   [junit4]   2> 8942 WARN  (OldIndexDirectoryCleanupThreadForCore-collectionLazy2) [    x:collectionLazy2] o.a.s.c.DirectoryFactory /home/jenkins/workspace/Lucene-Solr-trunk-Linux/solr/build/solr-core/test/J0/temp/solr.core.TestLazyCores_CC93F3E2F22D4A7E-001/tempDir-001/collection2/data/ does not point to a valid data directory; skipping clean-up of old index directories.
   [junit4]   2> 9080 INFO  (coreLoadExecutor-6-thread-2) [    x:collectionLazy2] o.a.s.c.SolrCore no updateRequestProcessorChain defined as default, creating implicit default
   [junit4]   2> 9080 INFO  (coreLoadExecutor-6-thread-1) [    x:collection1] o.a.s.c.SolrCore no updateRequestProcessorChain defined as default, creating implicit default
   [junit4]   2> 9080 INFO  (coreLoadExecutor-6-thread-3) [    x:collectionLazy5] o.a.s.c.SolrCore no updateRequestProcessorChain defined as default, creating implicit default
   [junit4]   2> 9125 INFO  (coreLoadExecutor-6-thread-2) [    x:collectionLazy2] o.a.s.h.l.XMLLoader xsltCacheLifetimeSeconds=60
   [junit4]   2> 9125 INFO  (coreLoadExecutor-6-thread-3) [    x:collectionLazy5] o.a.s.h.l.XMLLoader xsltCacheLifetimeSeconds=60
   [junit4]   2> 9125 INFO  (coreLoadExecutor-6-thread-1) [    x:collection1] o.a.s.h.l.XMLLoader xsltCacheLifetimeSeconds=60
   [junit4]   2> 9129 INFO  (coreLoadExecutor-6-thread-1) [    x:collection1] o.a.s.h.l.XMLLoader xsltCacheLifetimeSeconds=60
   [junit4]   2> 9129 INFO  (coreLoadExecutor-6-thread-3) [    x:collectionLazy5] o.a.s.h.l.XMLLoader xsltCacheLifetimeSeconds=60
   [junit4]   2> 9129 INFO  (coreLoadExecutor-6-thread-1) [    x:collection1] o.a.s.h.l.XMLLoader xsltCacheLifetimeSeconds=60
   [junit4]   2> 9130 INFO  (coreLoadExecutor-6-thread-3) [    x:collectionLazy5] o.a.s.h.l.XMLLoader xsltCacheLifetimeSeconds=60
   [junit4]   2> 9130 INFO  (coreLoadExecutor-6-thread-1) [    x:collection1] o.a.s.h.l.XMLLoader xsltCacheLifetimeSeconds=60
   [junit4]   2> 9131 INFO  (coreLoadExecutor-6-thread-2) [    x:collectionLazy2] o.a.s.h.l.XMLLoader xsltCacheLifetimeSeconds=60
   [junit4]   2> 9131 INFO  (coreLoadExecutor-6-thread-3) [    x:collectionLazy5] o.a.s.h.l.XMLLoader xsltCacheLifetimeSeconds=60
   [junit4]   2> 9132 INFO  (coreLoadExecutor-6-thread-2) [    x:collectionLazy2] o.a.s.h.l.XMLLoader xsltCacheLifetimeSeconds=60
   [junit4]   2> 9133 INFO  (coreLoadExecutor-6-thread-2) [    x:collectionLazy2] o.a.s.h.l.XMLLoader xsltCacheLifetimeSeconds=60
   [junit4]   2> 9153 INFO  (coreLoadExecutor-6-thread-1) [    x:collection1] o.a.s.c.RequestHandlers Registered paths: /admin/mbeans,/update/csv,/update/json/docs,/admin/luke,/select,/admin/segments,/get,/admin/system,/replication,/admin/properties,/config,/schema,/admin/plugins,/admin/logging,/update/json,/admin/threads,/admin/ping,/update,/admin/file
   [junit4]   2> 9154 INFO  (coreLoadExecutor-6-thread-3) [    x:collectionLazy5] o.a.s.c.RequestHandlers Registered paths: /admin/mbeans,/update/csv,/update/json/docs,/admin/luke,/select,/admin/segments,/get,/admin/system,/replication,/admin/properties,/config,/schema,/admin/plugins,/admin/logging,/update/json,/admin/threads,/admin/ping,/update,/admin/file
   [junit4]   2> 9153 INFO  (coreLoadExecutor-6-thread-2) [    x:collectionLazy2] o.a.s.c.RequestHandlers Registered paths: /admin/mbeans,/update/csv,/update/json/docs,/admin/luke,/select,/admin/segments,/get,/admin/system,/replication,/admin/properties,/config,/schema,/admin/plugins,/admin/logging,/update/json,/admin/threads,/admin/ping,/update,/admin/file
   [junit4]   2> 9155 INFO  (coreLoadExecutor-6-thread-1) [    x:collection1] o.a.s.c.SolrCore Using default statsCache cache: org.apache.solr.search.stats.LocalStatsCache
   [junit4]   2> 9159 INFO  (coreLoadExecutor-6-thread-2) [    x:collectionLazy2] o.a.s.c.SolrCore Using default statsCache cache: org.apache.solr.search.stats.LocalStatsCache
   [junit4]   2> 9160 INFO  (coreLoadExecutor-6-thread-3) [    x:collectionLazy5] o.a.s.c.SolrCore Using default statsCache cache: org.apache.solr.search.stats.LocalStatsCache
   [junit4]   2> 9173 INFO  (coreLoadExecutor-6-thread-2) [    x:collectionLazy2] o.a.s.c.SolrCore Hard AutoCommit: disabled
   [junit4]   2> 9173 INFO  (coreLoadExecutor-6-thread-3) [    x:collectionLazy5] o.a.s.c.SolrCore Hard AutoCommit: disabled
   [junit4]   2> 9173 INFO  (coreLoadExecutor-6-thread-1) [    x:collection1] o.a.s.c.SolrCore Hard AutoCommit: disabled
   [junit4]   2> 9173 INFO  (coreLoadExecutor-6-thread-3) [    x:collectionLazy5] o.a.s.c.SolrCore Soft AutoCommit: disabled
   [junit4]   2> 9173 INFO  (coreLoadExecutor-6-thread-2) [    x:collectionLazy2] o.a.s.c.SolrCore Soft AutoCommit: disabled
   [junit4]   2> 9173 INFO  (coreLoadExecutor-6-thread-1) [    x:collection1] o.a.s.c.SolrCore Soft AutoCommit: disabled
   [junit4]   2> 9174 INFO  (coreLoadExecutor-6-thread-2) [    x:collectionLazy2] o.a.s.u.RandomMergePolicy RandomMergePolicy wrapping class org.apache.lucene.index.TieredMergePolicy: [TieredMergePolicy: maxMergeAtOnce=42, maxMergeAtOnceExplicit=27, maxMergedSegmentMB=65.6748046875, floorSegmentMB=0.99609375, forceMergeDeletesPctAllowed=16.430431274516074, segmentsPerTier=18.0, maxCFSSegmentSizeMB=8.796093022207999E12, noCFSRatio=0.7992430874729024
   [junit4]   2> 9174 INFO  (coreLoadExecutor-6-thread-3) [    x:collectionLazy5] o.a.s.u.RandomMergePolicy RandomMergePolicy wrapping class org.apache.lucene.index.TieredMergePolicy: [TieredMergePolicy: maxMergeAtOnce=42, maxMergeAtOnceExplicit=27, maxMergedSegmentMB=65.6748046875, floorSegmentMB=0.99609375, forceMergeDeletesPctAllowed=16.430431274516074, segmentsPerTier=18.0, maxCFSSegmentSizeMB=8.796093022207999E12, noCFSRatio=0.7992430874729024
   [junit4]   2> 9174 INFO  (coreLoadExecutor-6-thread-1) [    x:collection1] o.a.s.u.RandomMergePolicy RandomMergePolicy wrapping class org.apache.lucene.index.TieredMergePolicy: [TieredMergePolicy: maxMergeAtOnce=42, maxMergeAtOnceExplicit=27, maxMergedSegmentMB=65.6748046875, floorSegmentMB=0.99609375, forceMergeDeletesPctAllowed=16.430431274516074, segmentsPerTier=18.0, maxCFSSegmentSizeMB=8.796093022207999E12, noCFSRatio=0.7992430874729024
   [junit4]   2> 9184 INFO  (coreLoadExecutor-6-thread-2) [    x:collectionLazy2] o.a.s.c.SolrCore SolrDeletionPolicy.onInit: commits: num=1
   [junit4]   2> 	commit{dir=MockDirectoryWrapper(MMapDirectory@/home/jenkins/workspace/Lucene-Solr-trunk-Linux/solr/build/solr-core/test/J0/temp/solr.core.TestLazyCores_CC93F3E2F22D4A7E-001/index-MMapDirectory-001 lockFactory=org.apache.lucene.store.NativeFSLockFactory@fce4f6),segFN=segments_1,generation=1}
   [junit4]   2> 9184 INFO  (coreLoadExecutor-6-thread-2) [    x:collectionLazy2] o.a.s.c.SolrCore newest commit generation = 1
   [junit4]   2> 9184 INFO  (coreLoadExecutor-6-thread-1) [    x:collection1] o.a.s.c.SolrCore SolrDeletionPolicy.onInit: commits: num=1
   [junit4]   2> 	commit{dir=MockDirectoryWrapper(MMapDirectory@/home/jenkins/workspace/Lucene-Solr-trunk-Linux/solr/build/solr-core/test/J0/temp/solr.core.TestLazyCores_CC93F3E2F22D4A7E-001/index-MMapDirectory-002 lockFactory=org.apache.lucene.store.NativeFSLockFactory@fce4f6),segFN=segments_1,generation=1}
   [junit4]   2> 9184 INFO  (coreLoadExecutor-6-thread-3) [    x:collectionLazy5] o.a.s.c.SolrCore SolrDeletionPolicy.onInit: commits: num=1
   [junit4]   2> 	commit{dir=MockDirectoryWrapper(MMapDirectory@/home/jenkins/workspace/Lucene-Solr-trunk-Linux/solr/build/solr-core/test/J0/temp/solr.core.TestLazyCores_CC93F3E2F22D4A7E-001/index-MMapDirectory-003 lockFactory=org.apache.lucene.store.NativeFSLockFactory@fce4f6),segFN=segments_1,generation=1}
   [junit4]   2> 9184 INFO  (coreLoadExecutor-6-thread-1) [    x:collection1] o.a.s.c.SolrCore newest commit generation = 1
   [junit4]   2> 9184 INFO  (coreLoadExecutor-6-thread-3) [    x:collectionLazy5] o.a.s.c.SolrCore newest commit generation = 1
   [junit4]   2> 9202 INFO  (coreLoadExecutor-6-thread-2) [    x:collectionLazy2] o.a.s.s.SolrIndexSearcher Opening Searcher@104bfa6[collectionLazy2] main
   [junit4]   2> 9202 INFO  (coreLoadExecutor-6-thread-3) [    x:collectionLazy5] o.a.s.s.SolrIndexSearcher Opening Searcher@6b406c[collectionLazy5] main
   [junit4]   2> 9202 INFO  (coreLoadExecutor-6-thread-1) [    x:collection1] o.a.s.s.SolrIndexSearcher Opening Searcher@1d61b6a[collection1] main
   [junit4]   2> 9210 INFO  (coreLoadExecutor-6-thread-2) [    x:collectionLazy2] o.a.s.r.ManagedResourceStorage File-based storage initialized to use dir: /home/jenkins/workspace/Lucene-Solr-trunk-Linux/solr/build/solr-core/test/J0/temp/solr.core.TestLazyCores_CC93F3E2F22D4A7E-001/tempDir-001/collection2/conf
   [junit4]   2> 9210 INFO  (coreLoadExecutor-6-thread-3) [    x:collectionLazy5] o.a.s.r.ManagedResourceStorage File-based storage initialized to use dir: /home/jenkins/workspace/Lucene-Solr-trunk-Linux/solr/build/solr-core/test/J0/temp/solr.core.TestLazyCores_CC93F3E2F22D4A7E-001/tempDir-001/collection5/conf
   [junit4]   2> 9210 INFO  (coreLoadExecutor-6-thread-1) [    x:collection1] o.a.s.r.ManagedResourceStorage File-based storage initialized to use dir: /home/jenkins/workspace/Lucene-Solr-trunk-Linux/solr/build/solr-core/test/J0/temp/solr.core.TestLazyCores_CC93F3E2F22D4A7E-001/tempDir-001/collection1/conf
   [junit4]   2> 9211 INFO  (coreLoadExecutor-6-thread-3) [    x:collectionLazy5] o.a.s.r.RestManager Initializing RestManager with initArgs: {storageDir=/home/jenkins/workspace/Lucene-Solr-trunk-Linux/solr/build/solr-core/test/J0/temp/solr.core.TestLazyCores_CC93F3E2F22D4A7E-001/tempDir-001/collection5/conf}
   [junit4]   2> 9210 INFO  (coreLoadExecutor-6-thread-2) [    x:collectionLazy2] o.a.s.r.RestManager Initializing RestManager with initArgs: {storageDir=/home/jenkins/workspace/Lucene-Solr-trunk-Linux/solr/build/solr-core/test/J0/temp/solr.core.TestLazyCores_CC93F3E2F22D4A7E-001/tempDir-001/collection2/conf}
   [junit4]   2> 9211 INFO  (coreLoadExecutor-6-thread-1) [    x:collection1] o.a.s.r.RestManager Initializing RestManager with initArgs: {storageDir=/home/jenkins/workspace/Lucene-Solr-trunk-Linux/solr/build/solr-core/test/J0/temp/solr.core.TestLazyCores_CC93F3E2F22D4A7E-001/tempDir-001/collection1/conf}
   [junit4]   2> 9225 INFO  (coreLoadExecutor-6-thread-2) [    x:collectionLazy2] o.a.s.r.ManagedResourceStorage Reading _rest_managed.json using file:dir=/home/jenkins/workspace/Lucene-Solr-trunk-Linux/solr/build/solr-core/test/J0/temp/solr.core.TestLazyCores_CC93F3E2F22D4A7E-001/tempDir-001/collection2/conf
   [junit4]   2> 9225 INFO  (coreLoadExecutor-6-thread-3) [    x:collectionLazy5] o.a.s.r.ManagedResourceStorage Reading _rest_managed.json using file:dir=/home/jenkins/workspace/Lucene-Solr-trunk-Linux/solr/build/solr-core/test/J0/temp/solr.core.TestLazyCores_CC93F3E2F22D4A7E-001/tempDir-001/collection5/conf
   [junit4]   2> 9225 INFO  (coreLoadExecutor-6-thread-1) [    x:collection1] o.a.s.r.ManagedResourceStorage Reading _rest_managed.json using file:dir=/home/jenkins/workspace/Lucene-Solr-trunk-Linux/solr/build/solr-core/test/J0/temp/solr.core.TestLazyCores_CC93F3E2F22D4A7E-001/tempDir-001/collection1/conf
   [junit4]   2> 9231 INFO  (coreLoadExecutor-6-thread-2) [    x:collectionLazy2] o.a.s.r.RestManager Initializing 0 registered ManagedResources
   [junit4]   2> 9231 INFO  (coreLoadExecutor-6-thread-1) [    x:collection1] o.a.s.r.RestManager Initializing 0 registered ManagedResources
   [junit4]   2> 9231 INFO  (coreLoadExecutor-6-thread-3) [    x:collectionLazy5] o.a.s.r.RestManager Initializing 0 registered ManagedResources
   [junit4]   2> 9248 INFO  (coreLoadExecutor-6-thread-2) [    x:collectionLazy2] o.a.s.h.ReplicationHandler Commits will be reserved for  10000
   [junit4]   2> 9248 INFO  (coreLoadExecutor-6-thread-3) [    x:collectionLazy5] o.a.s.h.ReplicationHandler Commits will be reserved for  10000
   [junit4]   2> 9248 INFO  (coreLoadExecutor-6-thread-1) [    x:collection1] o.a.s.h.ReplicationHandler Commits will be reserved for  10000
   [junit4]   2> 9248 INFO  (searcherExecutor-7-thread-1-processing-x:collectionLazy2) [    x:collectionLazy2] o.a.s.c.SolrCore [collectionLazy2] Registered new searcher Searcher@104bfa6[collectionLazy2] main{ExitableDirectoryReader(UninvertingDirectoryReader())}
   [junit4]   2> 9249 INFO  (searcherExecutor-8-thread-1-processing-x:collection1) [    x:collection1] o.a.s.c.SolrCore [collection1] Registered new searcher Searcher@1d61b6a[collection1] main{ExitableDirectoryReader(UninvertingDirectoryReader())}
   [junit4]   2> 9248 INFO  (searcherExecutor-9-thread-1-processing-x:collectionLazy5) [    x:collectionLazy5] o.a.s.c.SolrCore [collectionLazy5] Registered new searcher Searcher@6b406c[collectionLazy5] main{ExitableDirectoryReader(UninvertingDirectoryReader())}
   [junit4]   2> 9249 INFO  (coreLoadExecutor-6-thread-3) [    x:collectionLazy5] o.a.s.c.CoreContainer registering core: collectionLazy5
   [junit4]   2> 9249 INFO  (coreLoadExecutor-6-thread-2) [    x:collectionLazy2] o.a.s.c.CoreContainer Opening transient core collectionLazy2
   [junit4]   2> 9249 INFO  (coreLoadExecutor-6-thread-1) [    x:collection1] o.a.s.c.CoreContainer registering core: collection1
   [junit4]   2> 9249 INFO  (coreLoadExecutor-6-thread-2) [    x:collectionLazy2] o.a.s.c.CoreContainer registering core: collectionLazy2
   [junit4]   2> 9251 INFO  (TEST-TestLazyCores.testLazySearch-seed#[CC93F3E2F22D4A7E]) [    ] o.a.s.c.SolrResourceLoader new SolrResourceLoader for directory: '/home/jenkins/workspace/Lucene-Solr-trunk-Linux/solr/build/solr-core/test/J0/temp/solr.core.TestLazyCores_CC93F3E2F22D4A7E-001/tempDir-001/collection4/'
   [junit4]   2> 9251 INFO  (TEST-TestLazyCores.testLazySearch-seed#[CC93F3E2F22D4A7E]) [    ] o.a.s.c.SolrResourceLoader JNDI not configured for solr (NoInitialContextEx)
   [junit4]   2> 9251 INFO  (TEST-TestLazyCores.testLazySearch-seed#[CC93F3E2F22D4A7E]) [    ] o.a.s.c.SolrResourceLoader solr home defaulted to 'solr/' (could not find system property or JNDI)
   [junit4]   2> 9273 INFO  (TEST-TestLazyCores.testLazySearch-seed#[CC93F3E2F22D4A7E]) [    ] o.a.s.c.SolrConfig current version of requestparams : -1
   [junit4]   2> 9279 INFO  (TEST-TestLazyCores.testLazySearch-seed#[CC93F3E2F22D4A7E]) [    ] o.a.s.c.SolrConfig Using Lucene MatchVersion: 6.0.0
   [junit4]   2> 9290 INFO  (TEST-TestLazyCores.testLazySearch-seed#[CC93F3E2F22D4A7E]) [    ] o.a.s.c.Config Loaded SolrConfig: solrconfig.xml
   [junit4]   2> 9291 INFO  (TEST-TestLazyCores.testLazySearch-seed#[CC93F3E2F22D4A7E]) [    ] o.a.s.s.IndexSchema Reading Solr Schema from /home/jenkins/workspace/Lucene-Solr-trunk-Linux/solr/build/solr-core/test/J0/temp/solr.core.TestLazyCores_CC93F3E2F22D4A7E-001/tempDir-001/collection4/conf/schema.xml
   [junit4]   2> 9297 INFO  (TEST-TestLazyCores.testLazySearch-seed#[CC93F3E2F22D4A7E]) [    ] o.a.s.s.IndexSchema [collectionLazy4] Schema name=tiny
   [junit4]   2> 9303 INFO  (TEST-TestLazyCores.testLazySearch-seed#[CC93F3E2F22D4A7E]) [    ] o.a.s.s.IndexSchema unique key field: id
   [junit4]   2> 9305 INFO  (TEST-TestLazyCores.testLazySearch-seed#[CC93F3E2F22D4A7E]) [    ] o.a.s.c.ConfigSetProperties Did not find ConfigSet properties, assuming default properties: Can't find resource 'configsetprops.json' in classpath or '/home/jenkins/workspace/Lucene-Solr-trunk-Linux/solr/build/solr-core/test/J0/temp/solr.core.TestLazyCores_CC93F3E2F22D4A7E-001/tempDir-001/collection4/conf'
   [junit4]   2> 9305 INFO  (TEST-TestLazyCores.testLazySearch-seed#[CC93F3E2F22D4A7E]) [    ] o.a.s.c.CoreContainer Creating SolrCore 'collectionLazy4' using configuration from instancedir /home/jenkins/workspace/Lucene-Solr-trunk-Linux/solr/build/solr-core/test/J0/temp/solr.core.TestLazyCores_CC93F3E2F22D4A7E-001/tempDir-001/collection4/
   [junit4]   2> 9305 INFO  (TEST-TestLazyCores.testLazySearch-seed#[CC93F3E2F22D4A7E]) [    x:collectionLazy4] o.a.s.c.SolrCore org.apache.solr.core.MockDirectoryFactory
   [junit4]   2> 9305 INFO  (TEST-TestLazyCores.testLazySearch-seed#[CC93F3E2F22D4A7E]) [    x:collectionLazy4] o.a.s.c.SolrCore [[collectionLazy4] ] Opening new SolrCore at [/home/jenkins/workspace/Lucene-Solr-trunk-Linux/solr/build/solr-core/test/J0/temp/solr.core.TestLazyCores_CC93F3E2F22D4A7E-001/tempDir-001/collection4/], dataDir=[null]
   [junit4]   2> 9305 INFO  (TEST-TestLazyCores.testLazySearch-seed#[CC93F3E2F22D4A7E]) [    x:collectionLazy4] o.a.s.c.SolrCore JMX monitoring not detected for core: collectionLazy4
   [junit4]   2> 9306 INFO  (TEST-TestLazyCores.testLazySearch-seed#[CC93F3E2F22D4A7E]) [    x:collectionLazy4] o.a.s.c.CachingDirectoryFactory return new directory for /home/jenkins/workspace/Lucene-Solr-trunk-Linux/solr/build/solr-core/test/J0/temp/solr.core.TestLazyCores_CC93F3E2F22D4A7E-001/tempDir-001/collection4/data
   [junit4]   2> 9306 INFO  (TEST-TestLazyCores.testLazySearch-seed#[CC93F3E2F22D4A7E]) [    x:collectionLazy4] o.a.s.c.SolrCore New index directory detected: old=null new=/home/jenkins/workspace/Lucene-Solr-trunk-Linux/solr/build/solr-core/test/J0/temp/solr.core.TestLazyCores_CC93F3E2F22D4A7E-001/tempDir-001/collection4/data/index/
   [junit4]   2> 9306 WARN  (TEST-TestLazyCores.testLazySearch-seed#[CC93F3E2F22D4A7E]) [    x:collectionLazy4] o.a.s.c.SolrCore [collectionLazy4] Solr index directory '/home/jenkins/workspace/Lucene-Solr-trunk-Linux/solr/build/solr-core/test/J0/temp/solr.core.TestLazyCores_CC93F3E2F22D4A7E-001/tempDir-001/collection4/data/index' doesn't exist. Creating new index...
   [junit4]   2> 9307 INFO  (TEST-TestLazyCores.testLazySearch-seed#[CC93F3E2F22D4A7E]) [    x:collectionLazy4] o.a.s.c.CachingDirectoryFactory return new directory for /home/jenkins/workspace/Lucene-Solr-trunk-Linux/solr/build/solr-core/test/J0/temp/solr.core.TestLazyCores_CC93F3E2F22D4A7E-001/tempDir-001/collection4/data/index
   [junit4]   2> 9307 INFO  (TEST-TestLazyCores.testLazySearch-seed#[CC93F3E2F22D4A7E]) [    x:collectionLazy4] o.a.s.u.RandomMergePolicy RandomMergePolicy wrapping class org.apache.lucene.index.TieredMergePolicy: [TieredMergePolicy: maxMergeAtOnce=33, maxMergeAtOnceExplicit=42, maxMergedSegmentMB=7.4013671875, floorSegmentMB=1.322265625, forceMergeDeletesPctAllowed=2.2573838480110373, segmentsPerTier=14.0, maxCFSSegmentSizeMB=8.796093022207999E12, noCFSRatio=0.0
   [junit4]   2> 9309 INFO  (TEST-TestLazyCores.testLazySearch-seed#[CC93F3E2F22D4A7E]) [    x:collectionLazy4] o.a.s.c.SolrCore SolrDeletionPolicy.onCommit: commits: num=1
   [junit4]   2> 	commit{dir=MockDirectoryWrapper(RAMDirectory@410339 lockFactory=org.apache.lucene.store.SingleInstanceLockFactory@cc23c2),segFN=segments_1,generation=1}
   [junit4]   2> 9309 INFO  (TEST-TestLazyCores.testLazySearch-seed#[CC93F3E2F22D4A7E]) [    x:collectionLazy4] o.a.s.c.SolrCore newest commit generation = 1
   [junit4]   2> 9310 INFO  (OldIndexDirectoryCleanupThreadForCore-collectionLazy4) [    x:collectionLazy4] o.a.s.c.SolrCore Looking for old index directories to cleanup for core collectionLazy4 in /home/jenkins/workspace/Lucene-Solr-trunk-Linux/solr/build/solr-core/test/J0/temp/solr.core.TestLazyCores_CC93F3E2F22D4A7E-001/tempDir-001/collection4/data/
   [junit4]   2> 9310 WARN  (OldIndexDirectoryCleanupThreadForCore-collectionLazy4) [    x:collectionLazy4] o.a.s.c.DirectoryFactory /home/jenkins/workspace/Lucene-Solr-trunk-Linux/solr/build/solr-core/test/J0/temp/solr.core.TestLazyCores_CC93F3E2F22D4A7E-001/tempDir-001/collection4/data/ does not point to a valid data directory; skipping clean-up of old index directories.
   [junit4]   2> 9311 INFO  (TEST-TestLazyCores.testLazySearch-seed#[CC93F3E2F22D4A7E]) [    x:collectionLazy4] o.a.s.c.SolrCore no updateRequestProcessorChain defined as default, creating implicit default
   [junit4]   2> 9312 INFO  (TEST-TestLazyCores.testLazySearch-seed#[CC93F3E2F22D4A7E]) [    x:collectionLazy4] o.a.s.h.l.XMLLoader xsltCacheLifetimeSeconds=60
   [junit4]   2> 9313 INFO  (TEST-TestLazyCores.testLazySearch-seed#[CC93F3E2F22D4A7E]) [    x:collectionLazy4] o.a.s.h.l.XMLLoader xsltCacheLifetimeSeconds=60
   [junit4]   2> 9314 INFO  (TEST-TestLazyCores.testLazySearch-seed#[CC93F3E2F22D4A7E]) [    x:collectionLazy4] o.a.s.h.l.XMLLoader xsltCacheLifetimeSeconds=60
   [junit4]   2> 9315 INFO  (TEST-TestLazyCores.testLazySearch-seed#[CC93F3E2F22D4A7E]) [    x:collectionLazy4] o.a.s.h.l.XMLLoader xsltCacheLifetimeSeconds=60
   [junit4]   2> 9316 INFO  (TEST-TestLazyCores.testLazySearch-seed#[CC93F3E2F22D4A7E]) [    x:collectionLazy4] o.a.s.c.RequestHandlers Registered paths: /admin/mbeans,/update/csv,/update/json/docs,/admin/luke,/select,/admin/segments,/get,/admin/system,/replication,/admin/properties,/config,/schema,/admin/plugins,/admin/logging,/update/json,/admin/threads,/admin/ping,/update,/admin/file
   [junit4]   2> 9317 INFO  (TEST-TestLazyCores.testLazySearch-seed#[CC93F3E2F22D4A7E]) [    x:collectionLazy4] o.a.s.c.SolrCore Using default statsCache cache: org.apache.solr.search.stats.LocalStatsCache
   [junit4]   2> 9318 INFO  (TEST-TestLazyCores.testLazySearch-seed#[CC93F3E2F22D4A7E]) [    x:collectionLazy4] o.a.s.c.SolrCore Hard AutoCommit: disabled
   [junit4]   2> 9318 INFO  (TEST-TestLazyCores.testLazySearch-seed#[CC93F3E2F22D4A7E]) [    x:collectionLazy4] o.a.s.c.SolrCore Soft AutoCommit: disabled
   [junit4]   2> 9318 INFO  (TEST-TestLazyCores.testLazySearch-seed#[CC93F3E2F22D4A7E]) [    x:collectionLazy4] o.a.s.u.RandomMergePolicy RandomMergePolicy wrapping class org.apache.lucene.index.TieredMergePolicy: [TieredMergePolicy: maxMergeAtOnce=19, maxMergeAtOnceExplicit=37, maxMergedSegmentMB=59.9990234375, floorSegmentMB=1.2392578125, forceMergeDeletesPctAllowed=25.31688325902564, segmentsPerTier=44.0, maxCFSSegmentSizeMB=8.796093022207999E12, noCFSRatio=0.4867214085550473
   [junit4]   2> 9319 INFO  (TEST-TestLazyCores.testLazySearch-seed#[CC93F3E2F22D4A7E]) [    x:collectionLazy4] o.a.s.c.SolrCore SolrDeletionPolicy.onInit: commits: num=1
   [junit4]   2> 	commit{dir=MockDirectoryWrapper(RAMDirectory@410339 lockFactory=org.apache.lucene.store.SingleInstanceLockFactory@cc23c2),segFN=segments_1,generation=1}
   [junit4]   2> 9319 INFO  (TEST-TestLazyCores.testLazySearch-seed#[CC93F3E2F22D4A7E]) [    x:collectionLazy4] o.a.s.c.SolrCore newest commit generation = 1
   [junit4]   2> 9320 INFO  (TEST-TestLazyCores.testLazySearch-seed#[CC93F3E2F22D4A7E]) [    x:collectionLazy4] o.a.s.s.SolrIndexSearcher Opening Searcher@4b8013[collectionLazy4] main
   [junit4]   2> 9320 INFO  (TEST-TestLazyCores.testLazySearch-seed#[CC93F3E2F22D4A7E]) [    x:collectionLazy4] o.a.s.r.ManagedResourceStorage File-based storage initialized to use dir: /home/jenkins/workspace/Lucene-Solr-trunk-Linux/solr/build/solr-core/test/J0/temp/solr.core.TestLazyCores_CC93F3E2F22D4A7E-001/tempDir-001/collection4/conf
   [junit4]   2> 9320 INFO  (TEST-TestLazyCores.testLazySearch-seed#[CC93F3E2F22D4A7E]) [    x:collectionLazy4] o.a.s.r.RestManager Initializing RestManager with initArgs: {storageDir=/home/jenkins/workspace/Lucene-Solr-trunk-Linux/solr/build/solr-core/test/J0/temp/solr.core.TestLazyCores_CC93F3E2F22D4A7E-001/tempDir-001/collection4/conf}
   [junit4]   2> 9320 INFO  (TEST-TestLazyCores.testLazySearch-seed#[CC93F3E2F22D4A7E]) [    x:collectionLazy4] o.a.s.r.ManagedResourceStorage Reading _rest_managed.json using file:dir=/home/jenkins/workspace/Lucene-Solr-trunk-Linux/solr/build/solr-core/test/J0/temp/solr.core.TestLazyCores_CC93F3E2F22D4A7E-001/tempDir-001/collection4/conf
   [junit4]   2> 9321 INFO  (TEST-TestLazyCores.testLazySearch-seed#[CC93F3E2F22D4A7E]) [    x:collectionLazy4] o.a.s.r.RestManager Initializing 0 registered ManagedResources
   [junit4]   2> 9321 INFO  (TEST-TestLazyCores.testLazySearch-seed#[CC93F3E2F22D4A7E]) [    x:collectionLazy4] o.a.s.h.ReplicationHandler Commits will be reserved for  10000
   [junit4]   2> 9321 INFO  (searcherExecutor-19-thread-1-processing-x:collectionLazy4) [    x:collectionLazy4] o.a.s.c.SolrCore [collectionLazy4] Registered new searcher Searcher@4b8013[collectionLazy4] main{ExitableDirectoryReader(UninvertingDirectoryReader())}
   [junit4]   2> 9321 INFO  (TEST-TestLazyCores.testLazySearch-seed#[CC93F3E2F22D4A7E]) [    x:collectionLazy4] o.a.s.c.CoreContainer registering core: collectionLazy4
   [junit4]   2> 9390 INFO  (TEST-TestLazyCores.testLazySearch-seed#[CC93F3E2F22D4A7E]) [    x:collectionLazy4] o.a.s.u.UpdateHandler start commit{,optimize=false,openSearcher=true,waitSearcher=true,expungeDeletes=false,softCommit=false,prepareCommit=false}
   [junit4]   2> 9493 INFO  (TEST-TestLazyCores.testLazySearch-seed#[CC93F3E2F22D4A7E]) [    x:collectionLazy4] o.a.s.c.SolrCore SolrDeletionPolicy.onCommit: commits: num=2
   [junit4]   2> 	commit{dir=MockDirectoryWrapper(RAMDirectory@410339 lockFactory=org.apache.lucene.store.SingleInstanceLockFactory@cc23c2),segFN=segments_1,generation=1}
   [junit4]   2> 	commit{dir=MockDirectoryWrapper(RAMDirectory@410339 lockFactory=org.apache.lucene.store.SingleInstanceLockFactory@cc23c2),segFN=segments_2,generation=2}
   [junit4]   2> 9493 INFO  (TEST-TestLazyCores.testLazySearch-seed#[CC93F3E2F22D4A7E]) [    x:collectionLazy4] o.a.s.c.SolrCore newest commit generation = 2
   [junit4]   2> 9533 INFO  (TEST-TestLazyCores.testLazySearch-seed#[CC93F3E2F22D4A7E]) [    x:collectionLazy4] o.a.s.s.SolrIndexSearcher Opening Searcher@fbee0c[collectionLazy4] main
   [junit4]   2> 9534 INFO  (TEST-TestLazyCores.testLazySearch-seed#[CC93F3E2F22D4A7E]) [    x:collectionLazy4] o.a.s.u.UpdateHandler end_commit_flush
   [junit4]   2> 9534 INFO  (searcherExecutor-19-thread-1-processing-x:collectionLazy4) [    x:collectionLazy4] o.a.s.c.SolrCore [collectionLazy4] Registered new searcher Searcher@fbee0c[collectionLazy4] main{ExitableDirectoryReader(UninvertingDirectoryReader(Uninverting(_0(6.0.0):C7)))}
   [junit4]   2> 9589 INFO  (TEST-TestLazyCores.testLazySearch-seed#[CC93F3E2F22D4A7E]) [    x:collectionLazy4] o.a.s.c.S.Request [collectionLazy4] webapp=null path=null params={q={!prefix+f%3Dv_t}hel&wt=xml} hits=2 status=0 QTime=53 
   [junit4]   2> 9621 INFO  (TEST-TestLazyCores.testLazySearch-seed#[CC93F3E2F22D4A7E]) [    x:collectionLazy4] o.a.s.c.S.Request [collectionLazy4] webapp=null path=null params={q={!raw+f%3Dv_t}hello&wt=xml} hits=2 status=0 QTime=9 
   [junit4]   2> 9624 INFO  (TEST-TestLazyCores.testLazySearch-seed#[CC93F3E2F22D4A7E]) [    x:collectionLazy4] o.a.s.c.S.Request [collectionLazy4] webapp=null path=null params={q={!raw+f%3Dv_t}Hello&wt=xml} hits=0 status=0 QTime=0 
   [junit4]   2> 9629 INFO  (TEST-TestLazyCores.testLazySearch-seed#[CC93F3E2F22D4A7E]) [    x:collectionLazy4] o.a.s.c.S.Request [collectionLazy4] webapp=null path=null params={q={!raw+f%3Dv_f}1.5&wt=xml} hits=0 status=0 QTime=3 
   [junit4]   2> 9631 INFO  (TEST-TestLazyCores.testLazySearch-seed#[CC93F3E2F22D4A7E]) [    x:collectionLazy4] o.a.s.c.S.Request [collection1] webapp=null path=null params={q={!raw+f%3Dv_t}hello&wt=xml} hits=0 status=0 QTime=1 
   [junit4]   2> 9633 INFO  (TEST-TestLazyCores.testLazySearch-seed#[CC93F3E2F22D4A7E]) [    x:collectionLazy4] o.a.s.c.CoreContainer Shutting down CoreContainer instance=30458002
   [junit4]   2> 9633 INFO  (TEST-TestLazyCores.testLazySearch-seed#[CC93F3E2F22D4A7E]) [    x:collectionLazy5] o.a.s.c.SolrCore [collectionLazy5]  CLOSING SolrCore org.apache.solr.core.SolrCore@1ed593e
   [junit4]   2> 9634 INFO  (TEST-TestLazyCores.testLazySearch-seed#[CC93F3E2F22D4A7E]) [    x:collectionLazy5] o.a.s.u.UpdateHandler closing DirectUpdateHandler2{commits=0,autocommits=0,soft autocommits=0,optimizes=0,rollbacks=0,expungeDeletes=0,docsPending=0,adds=0,deletesById=0,deletesByQuery=0,errors=0,cumulative_adds=0,cumulative_deletesById=0,cumulative_deletesByQuery=0,cumulative_errors=0}
   [junit4]   2> 9635 INFO  (TEST-TestLazyCores.testLazySearch-seed#[CC93F3E2F22D4A7E]) [    x:collectionLazy5] o.a.s.u.SolrCoreState Closing SolrCoreState
   [junit4]   2> 9635 INFO  (TEST-TestLazyCores.testLazySearch-seed#[CC93F3E2F22D4A7E]) [    x:collectionLazy5] o.a.s.u.DefaultSolrCoreState SolrCoreState ref count has reached 0 - closing IndexWriter
   [junit4]   2> 9635 INFO  (TEST-TestLazyCores.testLazySearch-seed#[CC93F3E2F22D4A7E]) [    x:collectionLazy5] o.a.s.u.DefaultSolrCoreState closing IndexWriter with IndexWriterCloser
   [junit4]   2> 9636 INFO  (TEST-TestLazyCores.testLazySearch-seed#[CC93F3E2F22D4A7E]) [    x:collectionLazy5] o.a.s.c.SolrCore [collectionLazy5] Closing main searcher on request.
   [junit4]   2> 9636 INFO  (TEST-TestLazyCores.testLazySearch-seed#[CC93F3E2F22D4A7E]) [    x:collectionLazy5] o.a.s.c.CachingDirectoryFactory Closing MockDirectoryFactory - 2 directories currently being tracked
   [junit4]   2> 9637 INFO  (TEST-TestLazyCores.testLazySearch-seed#[CC93F3E2F22D4A7E]) [    x:collectionLazy5] o.a.s.c.CachingDirectoryFactory looking to close /home/jenkins/workspace/Lucene-Solr-trunk-Linux/solr/build/solr-core/test/J0/temp/solr.core.TestLazyCores_CC93F3E2F22D4A7E-001/tempDir-001/collection5/data [CachedDir<<refCount=0;path=/home/jenkins/workspace/Lucene-Solr-trunk-Linux/solr/build/solr-core/test/J0/temp/solr.core.TestLazyCores_CC93F3E2F22D4A7E-001/tempDir-001/collection5/data;done=false>>]
   [junit4]   2> 9637 INFO  (TEST-TestLazyCores.testLazySearch-seed#[CC93F3E2F22D4A7E]) [    x:collectionLazy5] o.a.s.c.CachingDirectoryFactory Closing directory: /home/jenkins/workspace/Lucene-Solr-trunk-Linux/solr/build/solr-core/test/J0/temp/solr.core.TestLazyCores_CC93F3E2F22D4A7E-001/tempDir-001/collection5/data
   [junit4]   2> 9637 INFO  (TEST-TestLazyCores.testLazySearch-seed#[CC93F3E2F22D4A7E]) [    x:collectionLazy5] o.a.s.c.CachingDirectoryFactory looking to close /home/jenkins/workspace/Lucene-Solr-trunk-Linux/solr/build/solr-core/test/J0/temp/solr.core.TestLazyCores_CC93F3E2F22D4A7E-001/tempDir-001/collection5/data/index [CachedDir<<refCount=0;path=/home/jenkins/workspace/Lucene-Solr-trunk-Linux/solr/build/solr-core/test/J0/temp/solr.core.TestLazyCores_CC93F3E2F22D4A7E-001/tempDir-001/collection5/data/index;done=false>>]
   [junit4]   2> 9637 INFO  (TEST-TestLazyCores.testLazySearch-seed#[CC93F3E2F22D4A7E]) [    x:collectionLazy5] o.a.s.c.CachingDirectoryFactory Closing directory: /home/jenkins/workspace/Lucene-Solr-trunk-Linux/solr/build/solr-core/test/J0/temp/solr.core.TestLazyCores_CC93F3E2F22D4A7E-001/tempDir-001/collection5/data/index
   [junit4]   2> 9637 INFO  (TEST-TestLazyCores.testLazySearch-seed#[CC93F3E2F22D4A7E]) [    x:collection1] o.a.s.c.SolrCore [collection1]  CLOSING SolrCore org.apache.solr.core.SolrCore@ea5b45
   [junit4]   2> 9637 INFO  (TEST-TestLazyCores.testLazySearch-seed#[CC93F3E2F22D4A7E]) [    x:collection1] o.a.s.u.UpdateHandler closing DirectUpdateHandler2{commits=0,autocommits=0,soft autocommits=0,optimizes=0,rollbacks=0,expungeDeletes=0,docsPending=0,adds=0,deletesById=0,deletesByQuery=0,errors=0,cumulative_adds=0,cumulative_deletesById=0,cumulative_deletesByQuery=0,cumulative_errors=0}
   [junit4]   2> 9638 INFO  (TEST-TestLazyCores.testLazySearch-seed#[CC93F3E2F22D4A7E]) [    x:collection1] o.a.s.u.SolrCoreState Closing SolrCoreState
   [junit4]   2> 9638 INFO  (TEST-TestLazyCores.testLazySearch-seed#[CC93F3E2F22D4A7E]) [    x:collection1] o.a.s.u.DefaultSolrCoreState SolrCoreState ref count has reached 0 - closing IndexWriter
   [junit4]   2> 9638 INFO  (TEST-TestLazyCores.testLazySearch-seed#[CC93F3E2F22D4A7E]) [    x:collection1] o.a.s.u.DefaultSolrCoreState closing IndexWriter with IndexWriterCloser
   [junit4]   2> 9639 INFO  (TEST-TestLazyCores.testLazySearch-seed#[CC93F3E2F22D4A7E]) [    x:collection1] o.a.s.c.SolrCore [collection1] Closing main searcher on request.
   [junit4]   2> 9639 INFO  (TEST-TestLazyCores.testLazySearch-seed#[CC93F3E2F22D4A7E]) [    x:collection1] o.a.s.c.CachingDirectoryFactory Closing MockDirectoryFactory - 2 directories currently being tracked
   [junit4]   2> 9639 INFO  (TEST-TestLazyCores.testLazySearch-seed#[CC93F3E2F22D4A7E]) [    x:collection1] o.a.s.c.CachingDirectoryFactory looking to close /home/jenkins/workspace/Lucene-Solr-trunk-Linux/solr/build/solr-core/test/J0/temp/solr.core.TestLazyCores_CC93F3E2F22D4A7E-001/tempDir-001/collection1/data [CachedDir<<refCount=0;path=/home/jenkins/workspace/Lucene-Solr-trunk-Linux/solr/build/solr-core/test/J0/temp/solr.core.TestLazyCores_CC93F3E2F22D4A7E-001/tempDir-001/collection1/data;done=false>>]
   [junit4]   2> 9639 INFO  (TEST-TestLazyCores.testLazySearch-seed#[CC93F3E2F22D4A7E]) [    x:collection1] o.a.s.c.CachingDirectoryFactory Closing directory: /home/jenkins/workspace/Lucene-Solr-trunk-Linux/solr/build/solr-core/test/J0/temp/solr.core.TestLazyCores_CC93F3E2F22D4A7E-001/tempDir-001/collection1/data
   [junit4]   2> 9639 INFO  (TEST-TestLazyCores.testLazySearch-seed#[CC93F3E2F22D4A7E]) [    x:collection1] o.a.s.c.CachingDirectoryFactory looking to close /home/jenkins/workspace/Lucene-Solr-trunk-Linux/solr/build/solr-core/test/J0/temp/solr.core.TestLazyCores_CC93F3E2F22D4A7E-001/tempDir-001/collection1/data/index [CachedDir<<refCount=0;path=/home/jenkins/workspace/Lucene-Solr-trunk-Linux/solr/build/solr-core/test/J0/temp/solr.core.TestLazyCores_CC93F3E2F22D4A7E-001/tempDir-001/collection1/data/index;done=false>>]
   [junit4]   2> 9639 INFO  (TEST-TestLazyCores.testLazySearch-seed#[CC93F3E2F22D4A7E]) [    x:collection1] o.a.s.c.CachingDirectoryFactory Closing directory: /home/jenkins/workspace/Lucene-Solr-trunk-Linux/solr/build/solr-core/test/J0/temp/solr.core.TestLazyCores_CC93F3E2F22D4A7E-001/tempDir-001/collection1/data/index
   [junit4]   2> 9640 INFO  (TEST-TestLazyCores.testLazySearch-seed#[CC93F3E2F22D4A7E]) [    x:collectionLazy4] o.a.s.c.SolrCore [collectionLazy4]  CLOSING SolrCore org.apache.solr.core.SolrCore@126e28d
   [junit4]   2> 9640 INFO  (TEST-TestLazyCores.testLazySearch-seed#[CC93F3E2F22D4A7E]) [    x:collectionLazy4] o.a.s.u.UpdateHandler closing DirectUpdateHandler2{commits=1,autocommits=0,soft autocommits=0,optimizes=0,rollbacks=0,expungeDeletes=0,docsPending=0,adds=0,deletesById=0,deletesByQuery=0,errors=0,cumulative_adds=7,cumulative_deletesById=0,cumulative_deletesByQuery=0,cumulative_errors=0}
   [junit4]   2> 9640 INFO  (TEST-TestLazyCores.testLazySearch-seed#[CC93F3E2F22D4A7E]) [    x:collectionLazy4] o.a.s.u.SolrCoreState Closing SolrCoreState
   [junit4]   2> 9640 INFO  (TEST-TestLazyCores.testLazySearch-seed#[CC93F3E2F22D4A7E]) [    x:collectionLazy4] o.a.s.u.DefaultSolrCoreState SolrCoreState ref count has reached 0 - closing IndexWriter
   [junit4]   2> 9640 INFO  (TEST-TestLazyCores.testLazySearch-seed#[CC93F3E2F22D4A7E]) [    x:collectionLazy4] o.a.s.u.DefaultSolrCoreState closing IndexWriter with IndexWriterCloser
   [junit4]   2> 9641 INFO  (TEST-TestLazyCores.testLazySearch-seed#[CC93F3E2F22D4A7E]) [    x:collectionLazy4] o.a.s.c.SolrCore [collectionLazy4] Closing main searcher on request.
   [junit4]   2> 9641 INFO  (TEST-TestLazyCores.testLazySearch-seed#[CC93F3E2F22D4A7E]) [    x:collectionLazy4] o.a.s.c.CachingDirectoryFactory Closing MockDirectoryFactory - 2 directories currently being tracked
   [junit4]   2> 9641 INFO  (TEST-TestLazyCores.testLazySearch-seed#[CC93F3E2F22D4A7E]) [    x:collectionLazy4] o.a.s.c.CachingDirectoryFactory looking to close /home/jenkins/workspace/Lucene-Solr-trunk-Linux/solr/build/solr-core/test/J0/temp/solr.core.TestLazyCores_CC93F3E2F22D4A7E-001/tempDir-001/collection4/data/index [CachedDir<<refCount=0;path=/home/jenkins/workspace/Lucene-Solr-trunk-Linux/solr/build/solr-core/test/J0/temp/solr.core.TestLazyCores_CC93F3E2F22D4A7E-001/tempDir-001/collection4/data/index;done=false>>]
   [junit4]   2> 9641 INFO  (TEST-TestLazyCores.testLazySearch-seed#[CC93F3E2F22D4A7E]) [    x:collectionLazy4] o.a.s.c.CachingDirectoryFactory Closing directory: /home/jenkins/workspace/Lucene-Solr-trunk-Linux/solr/build/solr-core/test/J0/temp/solr.core.TestLazyCores_CC93F3E2F22D4A7E-001/tempDir-001/collection4/data/index
   [junit4]   2> 9641 INFO  (TEST-TestLazyCores.testLazySearch-seed#[CC93F3E2F22D4A7E]) [    x:collectionLazy4] o.a.s.c.CachingDirectoryFactory looking to close /home/jenkins/workspace/Lucene-Solr-trunk-Linux/solr/build/solr-core/test/J0/temp/solr.core.TestLazyCores_CC93F3E2F22D4A7E-001/tempDir-001/collection4/data [CachedDir<<refCount=0;path=/home/jenkins/workspace/Lucene-Solr-trunk-Linux/solr/build/solr-core/test/J0/temp/solr.core.TestLazyCores_CC93F3E2F22D4A7E-001/tempDir-001/collection4/data;done=false>>]
   [junit4]   2> 9641 INFO  (TEST-TestLazyCores.testLazySearch-seed#[CC93F3E2F22D4A7E]) [    x:collectionLazy4] o.a.s.c.CachingDirectoryFactory Closing directory: /home/jenkins/workspace/Lucene-Solr-trunk-Linux/solr/build/solr-core/test/J0/temp/solr.core.TestLazyCores_CC93F3E2F22D4A7E-001/tempDir-001/collection4/data
   [junit4]   2> 9641 INFO  (TEST-TestLazyCores.testLazySearch-seed#[CC93F3E2F22D4A7E]) [    x:collectionLazy2] o.a.s.c.SolrCore [collectionLazy2]  CLOSING SolrCore org.apache.solr.core.SolrCore@60dd2
   [junit4]   2> 9642 INFO  (TEST-TestLazyCores.testLazySearch-seed#[CC93F3E2F22D4A7E]) [    x:collectionLazy2] o.a.s.u.UpdateHandler closing DirectUpdateHandler2{commits=0,autocommits=0,soft autocommits=0,optimizes=0,rollbacks=0,expungeDeletes=0,docsPending=0,adds=0,deletesById=0,deletesByQuery=0,errors=0,cumulative_adds=0,cumulative_deletesById=0,cumulative_deletesByQuery=0,cumulative_errors=0}
   [junit4]   2> 9642 INFO  (TEST-TestLazyCores.testLazySearch-seed#[CC93F3E2F22D4A7E]) [    x:collectionLazy2] o.a.s.u.SolrCoreState Closing SolrCoreState
   [junit4]   2> 9642 INFO  (TEST-TestLazyCores.testLazySearch-seed#[CC93F3E2F22D4A7E]) [    x:collectionLazy2] o.a.s.u.DefaultSolrCoreState SolrCoreState ref count has reached 0 - closing IndexWriter
   [junit4]   2> 9642 INFO  (TEST-TestLazyCores.testLazySearch-seed#[CC93F3E2F22D4A7E]) [    x:collectionLazy2] o.a.s.u.DefaultSolrCoreState closing IndexWriter with IndexWriterCloser
   [junit4]   2> 9643 INFO  (TEST-TestLazyCores.testLazySearch-seed#[CC93F3E2F22D4A7E]) [    x:collectionLazy2] o.a.s.c.SolrCore [collectionLazy2] Closing main searcher on request.
   [junit4]   2> 9643 INFO  (TEST-TestLazyCores.testLazySearch-seed#[CC93F3E2F22D4A7E]) [    x:collectionLazy2] o.a.s.c.CachingDirectoryFactory Closing MockDirectoryFactory - 2 directories currently being tracked
   [junit4]   2> 9643 INFO  (TEST-TestLazyCores.testLazySearch-seed#[CC93F3E2F22D4A7E]) [    x:collectionLazy2] o.a.s.c.CachingDirectoryFactory looking to close /home/jenkins/workspace/Lucene-Solr-trunk-Linux/solr/build/solr-core/test/J0/temp/solr.core.TestLazyCores_CC93F3E2F22D4A7E-001/tempDir-001/collection2/data/index [CachedDir<<refCount=0;path=/home/jenkins/workspace/Lucene-Solr-trunk-Linux/solr/build/solr-core/test/J0/temp/solr.core.TestLazyCores_CC93F3E2F22D4A7E-001/tempDir-001/collection2/data/index;done=false>>]
   [junit4]   2> 9643 INFO  (TEST-TestLazyCores.testLazySearch-seed#[CC93F3E2F22D4A7E]) [    x:collectionLazy2] o.a.s.c.CachingDirectoryFactory Closing directory: /home/jenkins/workspace/Lucene-Solr-trunk-Linux/solr/build/solr-core/test/J0/temp/solr.core.TestLazyCores_CC93F3E2F22D4A7E-001/tempDir-001/collection2/data/index
   [junit4]   2> 9643 INFO  (TEST-TestLazyCores.testLazySearch-seed#[CC93F3E2F22D4A7E]) [    x:collectionLazy2] o.a.s.c.CachingDirectoryFactory looking to close /home/jenkins/workspace/Lucene-Solr-trunk-Linux/solr/build/solr-core/test/J0/temp/solr.core.TestLazyCores_CC93F3E2F22D4A7E-001/tempDir-001/collection2/data [CachedDir<<refCount=0;path=/home/jenkins/workspace/Lucene-Solr-trunk-Linux/solr/build/solr-core/test/J0/temp/solr.core.TestLazyCores_CC93F3E2F22D4A7E-001/tempDir-001/collection2/data;done=false>>]
   [junit4]   2> 9643 INFO  (TEST-TestLazyCores.testLazySearch-seed#[CC93F3E2F22D4A7E]) [    x:collectionLazy2] o.a.s.c.CachingDirectoryFactory Closing directory: /home/jenkins/workspace/Lucene-Solr-trunk-Linux/solr/build/solr-core/test/J0/temp/solr.core.TestLazyCores_CC93F3E2F22D4A7E-001/tempDir-001/collection2/data
   [junit4]   2> 9644 INFO  (TEST-TestLazyCores.testLazySearch-seed#[CC93F3E2F22D4A7E]) [    x:collectionLazy2] o.a.s.SolrTestCaseJ4 ###Ending testLazySearch
   [junit4]   2> 9646 INFO  (TEST-TestLazyCores.testCreateTransientFromAdmin-seed#[CC93F3E2F22D4A7E]) [    x:collectionLazy2] o.a.s.SolrTestCaseJ4 ###Starting testCreateTransientFromAdmin
   [junit4]   2> 9660 INFO  (TEST-TestLazyCores.testCreateTransientFromAdmin-seed#[CC93F3E2F22D4A7E]) [    x:collectionLazy2] o.a.s.c.SolrResourceLoader new SolrResourceLoader for directory: '/home/jenkins/workspace/Lucene-Solr-trunk-Linux/solr/build/solr-core/test/J0/temp/solr.core.TestLazyCores_CC93F3E2F22D4A7E-001/tempDir-002/'
   [junit4]   2> 9660 INFO  (TEST-TestLazyCores.testCreateTransientFromAdmin-seed#[CC93F3E2F22D4A7E]) [    x:collectionLazy2] o.a.s.c.SolrResourceLoader JNDI not configured for solr (NoInitialContextEx)
   [junit4]   2> 9660 INFO  (TEST-TestLazyCores.testCreateTransientFromAdmin-seed#[CC93F3E2F22D4A7E]) [    x:collectionLazy2] o.a.s.c.SolrResourceLoader solr home defaulted to 'solr/' (could not find system property or JNDI)
   [junit4]   2> 9675 INFO  (TEST-TestLazyCores.testCreateTransientFromAdmin-seed#[CC93F3E2F22D4A7E]) [    x:collectionLazy2] o.a.s.c.CoreContainer New CoreContainer 1658574
   [junit4]   2> 9675 INFO  (TEST-TestLazyCores.testCreateTransientFromAdmin-seed#[CC93F3E2F22D4A7E]) [    x:collectionLazy2] o.a.s.c.CoreContainer Loading cores into CoreContainer [instanceDir=/home/jenkins/workspace/Lucene-Solr-trunk-Linux/solr/build/solr-core/test/J0/temp/solr.core.TestLazyCores_CC93F3E2F22D4A7E-001/tempDir-002/]
   [junit4]   2> 9675 INFO  (TEST-TestLazyCores.testCreateTransientFromAdmin-seed#[CC93F3E2F22D4A7E]) [    x:collectionLazy2] o.a.s.c.CoreContainer loading shared library: /home/jenkins/workspace/Lucene-Solr-trunk-Linux/solr/build/solr-core/test/J0/temp/solr.core.TestLazyCores_CC93F3E2F22D4A7E-001/tempDir-002/lib
   [junit4]   2> 9675 WARN  (TEST-TestLazyCores.testCreateTransientFromAdmin-seed#[CC93F3E2F22D4A7E]) [    x:collectionLazy2] o.a.s.c.SolrResourceLoader Can't find (or read) directory to add to classloader: lib (resolved as: /home/jenkins/workspace/Lucene-Solr-trunk-Linux/solr/build/solr-core/test/J0/temp/solr.core.TestLazyCores_CC93F3E2F22D4A7E-001/tempDir-002/lib).
   [junit4]   2> 9683 INFO  (TEST-TestLazyCores.testCreateTransientFromAdmin-seed#[CC93F3E2F22D4A7E]) [    x:collectionLazy2] o.a.s.h.c.HttpShardHandlerFactory created with socketTimeout : 600000,connTimeout : 60000,maxConnectionsPerHost : 20,maxConnections : 10000,corePoolSize : 0,maximumPoolSize : 2147483647,maxThreadIdleTime : 5,sizeOfQueue : -1,fairnessPolicy : false,useRetries : false,
   [junit4]   2> 9684 INFO  (TEST-TestLazyCores.testCreateTransientFromAdmin-seed#[CC93F3E2F22D4A7E]) [    x:collectionLazy2] o.a.s.u.UpdateShardHandler Creating UpdateShardHandler HTTP client with params: socketTimeout=600000&connTimeout=60000&retry=true
   [junit4]   2> 9685 INFO  (TEST-TestLazyCores.testCreateTransientFromAdmin-seed#[CC93F3E2F22D4A7E]) [    x:collectionLazy2] o.a.s.c.CoreContainer Allocating transient cache for 4 transient cores
   [junit4]   2> 9685 INFO  (TEST-TestLazyCores.testCreateTransientFromAdmin-seed#[CC93F3E2F22D4A7E]) [    x:collectionLazy2] o.a.s.l.LogWatcher SLF4J impl is org.slf4j.impl.Log4jLoggerFactory
   [junit4]   2> 9685 INFO  (TEST-TestLazyCores.testCreateTransientFromAdmin-seed#[CC93F3E2F22D4A7E]) [    x:collectionLazy2] o.a.s.l.LogWatcher Registering Log Listener [Log4j (org.slf4j.impl.Log4jLoggerFactory)]
   [junit4]   2> 9685 INFO  (TEST-TestLazyCores.testCreateTransientFromAdmin-seed#[CC93F3E2F22D4A7E]) [    x:collectionLazy2] o.a.s.c.CoreContainer Security conf doesn't exist. Skipping setup for authorization module.
   [junit4]   2> 9685 INFO  (TEST-TestLazyCores.testCreateTransientFromAdmin-seed#[CC93F3E2F22D4A7E]) [    x:collectionLazy2] o.a.s.c.CoreContainer No authentication plugin used.
   [junit4]   2> 9686 INFO  (TEST-TestLazyCores.testCreateTransientFromAdmin-seed#[CC93F3E2F22D4A7E]) [    x:collectionLazy2] o.a.s.c.SolrCore Created CoreDescriptor: {name=collection1, config=solrconfig.xml, transient=false, schema=schema.xml, loadOnStartup=true, configSetProperties=configsetprops.json, instanceDir=collection1, absoluteInstDir=/home/jenkins/workspace/Lucene-Solr-trunk-Linux/solr/build/solr-core/test/J0/temp/solr.core.TestLazyCores_CC93F3E2F22D4A7E-001/tempDir-002/collection1/, dataDir=data/}
   [junit4]   2> 9686 INFO  (TEST-TestLazyCores.testCreateTransientFromAdmin-seed#[CC93F3E2F22D4A7E]) [    x:collectionLazy2] o.a.s.c.SolrCore Created CoreDescriptor: {name=collectionLazy2, config=solrconfig.xml, transient=true, schema=schema.xml, loadOnStartup=true, configSetProperties=configsetprops.json, instanceDir=collection2, absoluteInstDir=/home/jenkins/workspace/Lucene-Solr-trunk-Linux/solr/build/solr-core/test/J0/temp/solr.core.TestLazyCores_CC93F3E2F22D4A7E-001/tempDir-002/collection2/, dataDir=data/}
   [junit4]   2> 9687 INFO  (TEST-TestLazyCores.testCreateTransientFromAdmin-seed#[CC93F3E2F22D4A7E]) [    x:collectionLazy2] o.a.s.c.SolrCore Created CoreDescriptor: {name=collectionLazy3, config=solrconfig.xml, transient=on, schema=schema.xml, loadOnStartup=false, configSetProperties=configsetprops.json, instanceDir=collection3, absoluteInstDir=/home/jenkins/workspace/Lucene-Solr-trunk-Linux/solr/build/solr-core/test/J0/temp/solr.core.TestLazyCores_CC93F3E2F22D4A7E-001/tempDir-002/collection3/, dataDir=data/}
   [junit4]   2> 9687 INFO  (TEST-TestLazyCores.testCreateTransientFromAdmin-seed#[CC93F3E2F22D4A7E]) [    x:collectionLazy2] o.a.s.c.SolrCore Created CoreDescriptor: {name=collectionLazy4, config=solrconfig.xml, transient=false, schema=schema.xml, loadOnStartup=false, configSetProperties=configsetprops.json, instanceDir=collection4, absoluteInstDir=/home/jenkins/workspace/Lucene-Solr-trunk-Linux/solr/build/solr-core/test/J0/temp/solr.core.TestLazyCores_CC93F3E2F22D4A7E-001/tempDir-002/collection4/, dataDir=data/}
   [junit4]   2> 9687 INFO  (TEST-TestLazyCores.testCreateTransientFromAdmin-seed#[CC93F3E2F22D4A7E]) [    x:collectionLazy2] o.a.s.c.SolrCore Created CoreDescriptor: {name=collectionLazy5, config=solrconfig.xml, transient=false, schema=schema.xml, loadOnStartup=true, configSetProperties=configsetprops.json, instanceDir=collection5, absoluteInstDir=/home/jenkins/workspace/Lucene-Solr-trunk-Linux/solr/build/solr-core/test/J0/temp/solr.core.TestLazyCores_CC93F3E2F22D4A7E-001/tempDir-002/collection5/, dataDir=data/}
   [junit4]   2> 9688 INFO  (TEST-TestLazyCores.testCreateTransientFromAdmin-seed#[CC93F3E2F22D4A7E]) [    x:collectionLazy2] o.a.s.c.SolrCore Created CoreDescriptor: {name=collectionLazy6, config=solrconfig.xml, transient=true, schema=schema.xml, loadOnStartup=false, configSetProperties=configsetprops.json, instanceDir=collection6, absoluteInstDir=/home/jenkins/workspace/Lucene-Solr-trunk-Linux/solr/build/solr-core/test/J0/temp/solr.core.TestLazyCores_CC93F3E2F22D4A7E-001/tempDir-002/collection6/, dataDir=data/}
   [junit4]   2> 9688 INFO  (TEST-TestLazyCores.testCreateTransientFromAdmin-seed#[CC93F3E2F22D4A7E]) [    x:collectionLazy2] o.a.s.c.SolrCore Created CoreDescriptor: {name=collectionLazy7, config=solrconfig.xml, transient=true, schema=schema.xml, loadOnStartup=false, configSetProperties=configsetprops.json, instanceDir=collection7, absoluteInstDir=/home/jenkins/workspace/Lucene-Solr-trunk-Linux/solr/build/solr-core/test/J0/temp/solr.core.TestLazyCores_CC93F3E2F22D4A7E-001/tempDir-002/collection7/, dataDir=data/}
   [junit4]   2> 9688 INFO  (TEST-TestLazyCores.testCreateTransientFromAdmin-seed#[CC93F3E2F22D4A7E]) [    x:collectionLazy2] o.a.s.c.SolrCore Created CoreDescriptor: {name=collectionLazy8, config=solrconfig.xml, transient=true, schema=schema.xml, loadOnStartup=false, configSetProperties=configsetprops.json, instanceDir=collection8, absoluteInstDir=/home/jenkins/workspace/Lucene-Solr-trunk-Linux/solr/build/solr-core/test/J0/temp/solr.core.TestLazyCores_CC93F3E2F22D4A7E-001/tempDir-002/collection8/, dataDir=data/}
   [junit4]   2> 9689 INFO  (TEST-TestLazyCores.testCreateTransientFromAdmin-seed#[CC93F3E2F22D4A7E]) [    x:collectionLazy2] o.a.s.c.SolrCore Created CoreDescriptor: {name=collectionLazy9, config=solrconfig.xml, transient=true, schema=schema.xml, loadOnStartup=false, configSetProperties=configsetprops.json, instanceDir=collection9, absoluteInstDir=/home/jenkins/workspace/Lucene-Solr-trunk-Linux/solr/build/solr-core/test/J0/temp/solr.core.TestLazyCores_CC93F3E2F22D4A7E-001/tempDir-002/collection9/, dataDir=data/}
   [junit4]   2> 9689 INFO  (coreLoadExecutor-28-thread-1-processing-x:collectionLazy2) [    x:collectionLazy2] o.a.s.c.SolrResourceLoader new SolrResourceLoader for directory: '/home/jenkins/workspace/Lucene-Solr-trunk-Linux/solr/build/solr-core/test/J0/temp/solr.core.TestLazyCores_CC93F3E2F22D4A7E-001/tempDir-002/collection1/'
   [junit4]   2> 9690 INFO  (coreLoadExecutor-28-thread-3-processing-x:collectionLazy2) [    x:collectionLazy2] o.a.s.c.SolrResourceLoader new SolrResourceLoader for directory: '/home/jenkins/workspace/Lucene-Solr-trunk-Linux/solr/build/solr-core/test/J0/temp/solr.core.TestLazyCores_CC93F3E2F22D4A7E-001/tempDir-002/collection5/'
   [junit4]   2> 9690 INFO  (coreLoadExecutor-28-thread-1-processing-x:collectionLazy2) [    x:collectionLazy2] o.a.s.c.SolrResourceLoader JNDI not configured for solr (NoInitialContextEx)
   [junit4]   2> 9690 INFO  (coreLoadExecutor-28-thread-3-processing-x:collectionLazy2) [    x:collectionLazy2] o.a.s.c.SolrResourceLoader JNDI not configured for solr (NoInitialContextEx)
   [junit4]   2> 9690 INFO  (coreLoadExecutor-28-thread-1-processing-x:collectionLazy2) [    x:collectionLazy2] o.a.s.c.SolrResourceLoader solr home defaulted to 'solr/' (could not find system property or JNDI)
   [junit4]   2> 9690 INFO  (coreLoadExecutor-28-thread-3-processing-x:collectionLazy2) [    x:collectionLazy2] o.a.s.c.SolrResourceLoader solr home defaulted to 'solr/' (could not find system property or JNDI)
   [junit4]   2> 9692 INFO  (coreLoadExecutor-28-thread-2-processing-x:collectionLazy2) [    x:collectionLazy2] o.a.s.c.SolrResourceLoader new SolrResourceLoader for directory: '/home/jenkins/workspace/Lucene-Solr-trunk-Linux/solr/build/solr-core/test/J0/temp/solr.core.TestLazyCores_CC93F3E2F22D4A7E-001/tempDir-002/collection2/'
   [junit4]   2> 9694 INFO  (coreLoadExecutor-28-thread-2-processing-x:collectionLazy2) [    x:collectionLazy2] o.a.s.c.SolrResourceLoader JNDI not configured for solr (NoInitialContextEx)
   [junit4]   2> 9694 INFO  (coreLoadExecutor-28-thread-2-processing-x:collectionLazy2) [    x:collectionLazy2] o.a.s.c.SolrResourceLoader solr home defaulted to 'solr/' (could not find system property or JNDI)
   [junit4]   2> 9714 INFO  (coreLoadExecutor-28-thread-3-processing-x:collectionLazy2) [    x:collectionLazy2] o.a.s.c.SolrConfig current version of requestparams : -1
   [junit4]   2> 9715 INFO  (coreLoadExecutor-28-thread-2-processing-x:collectionLazy2) [    x:collectionLazy2] o.a.s.c.SolrConfig current version of requestparams : -1
   [junit4]   2> 9721 INFO  (coreLoadExecutor-28-thread-1-processing-x:collectionLazy2) [    x:collectionLazy2] o.a.s.c.SolrConfig current version of requestparams : -1
   [junit4]   2> 9721 INFO  (coreLoadExecutor-28-thread-2-processing-x:collectionLazy2) [    x:collectionLazy2] o.a.s.c.SolrConfig Using Lucene MatchVersion: 6.0.0
   [junit4]   2> 9722 INFO  (coreLoadExecutor-28-thread-3-processing-x:collectionLazy2) [    x:collectionLazy2] o.a.s.c.SolrConfig Using Lucene MatchVersion: 6.0.0
   [junit4]   2> 9741 INFO  (coreLoadExecutor-28-thread-1-processing-x:collectionLazy2) [    x:collectionLazy2] o.a.s.c.SolrConfig Using Lucene MatchVersion: 6.0.0
   [junit4]   2> 9746 INFO  (coreLoadExecutor-28-thread-2-processing-x:collectionLazy2) [    x:collectionLazy2] o.a.s.c.Config Loaded SolrConfig: solrconfig.xml
   [junit4]   2> 9747 INFO  (coreLoadExecutor-28-thread-2-processing-x:collectionLazy2) [    x:collectionLazy2] o.a.s.s.IndexSchema Reading Solr Schema from /home/jenkins/workspace/Lucene-Solr-trunk-Linux/solr/build/solr-core/test/J0/temp/solr.core.TestLazyCores_CC93F3E2F22D4A7E-001/tempDir-002/collection2/conf/schema.xml
   [junit4]   2> 9748 INFO  (coreLoadExecutor-28-thread-3-processing-x:collectionLazy2) [    x:collectionLazy2] o.a.s.c.Config Loaded SolrConfig: solrconfig.xml
   [junit4]   2> 9749 INFO  (coreLoadExecutor-28-thread-3-processing-x:collectionLazy2) [    x:collectionLazy2] o.a.s.s.IndexSchema Reading Solr Schema from /home/jenkins/workspace/Lucene-Solr-trunk-Linux/solr/build/solr-core/test/J0/temp/solr.core.TestLazyCores_CC93F3E2F22D4A7E-001/tempDir-002/collection5/conf/schema.xml
   [junit4]   2> 9752 INFO  (coreLoadExecutor-28-thread-2-processing-x:collectionLazy2) [    x:collectionLazy2] o.a.s.s.IndexSchema [collectionLazy2] Schema name=tiny
   [junit4]   2> 9753 INFO  (coreLoadExecutor-28-thread-3-processing-x:collectionLazy2) [    x:collectionLazy2] o.a.s.s.IndexSchema [collectionLazy5] Schema name=tiny
   [junit4]   2> 9755 INFO  (coreLoadExecutor-28-thread-1-processing-x:collectionLazy2) [    x:collectionLazy2] o.a.s.c.Config Loaded SolrConfig: solrconfig.xml
   [junit4]   2> 9756 INFO  (coreLoadExecutor-28-thread-1-processing-x:collectionLazy2) [    x:collectionLazy2] o.a.s.s.IndexSchema Reading Solr Schema from /home/jenkins/workspace/Lucene-Solr-trunk-Linux/solr/build/solr-core/test/J0/temp/solr.core.TestLazyCores_CC93F3E2F22D4A7E-001/tempDir-002/collection1/conf/schema.xml
   [junit4]   2> 9758 INFO  (coreLoadExecutor-28-thread-2-processing-x:collectionLazy2) [    x:collectionLazy2] o.a.s.s.IndexSchema unique key field: id
   [junit4]   2> 9759 INFO  (coreLoadExecutor-28-thread-3-processing-x:collectionLazy2) [    x:collectionLazy2] o.a.s.s.IndexSchema unique key field: id
   [junit4]   2> 9759 INFO  (coreLoadExecutor-28-thread-3-processing-x:collectionLazy2) [    x:collectionLazy2] o.a.s.c.ConfigSetProperties Did not find ConfigSet properties, assuming default properties: Can't find resource 'configsetprops.json' in classpath or '/home/jenkins/workspace/Lucene-Solr-trunk-Linux/solr/build/solr-core/test/J0/temp/solr.core.TestLazyCores_CC93F3E2F22D4A7E-001/tempDir-002/collection5/conf'
   [junit4]   2> 9759 INFO  (coreLoadExecutor-28-thread-2-processing-x:collectionLazy2) [    x:collectionLazy2] o.a.s.c.ConfigSetProperties Did not find ConfigSet properties, assuming default properties: Can't find resource 'configsetprops.json' in classpath or '/home/jenkins/workspace/Lucene-Solr-trunk-Linux/solr/build/solr-core/test/J0/temp/solr.core.TestLazyCores_CC93F3E2F22D4A7

[...truncated too long message...]

  [junit4]   2>         at java.util.concurrent.LinkedBlockingQueue.take(LinkedBlockingQueue.java:442)
   [junit4]   2>         at java.util.concurrent.ThreadPoolExecutor.getTask(ThreadPoolExecutor.java:1067)
   [junit4]   2>         at java.util.concurrent.ThreadPoolExecutor.runWorker(ThreadPoolExecutor.java:1127)
   [junit4]   2>         at java.util.concurrent.ThreadPoolExecutor$Worker.run(ThreadPoolExecutor.java:617)
   [junit4]   2>         at java.lang.Thread.run(Thread.java:747)
   [junit4]   2> Oct 21, 2015 6:44:24 PM com.carrotsearch.randomizedtesting.ThreadLeakControl tryToInterruptAll
   [junit4]   2> INFO: Starting to interrupt leaked threads:
   [junit4]   2>    1) Thread[id=178, name=searcherExecutor-187-thread-1, state=WAITING, group=TGRP-TestLazyCores]
   [junit4]   2> Oct 21, 2015 6:44:27 PM com.carrotsearch.randomizedtesting.ThreadLeakControl tryToInterruptAll
   [junit4]   2> SEVERE: There are still zombie threads that couldn't be terminated:
   [junit4]   2>    1) Thread[id=178, name=searcherExecutor-187-thread-1, state=WAITING, group=TGRP-TestLazyCores]
   [junit4]   2>         at sun.misc.Unsafe.park(Native Method)
   [junit4]   2>         at java.util.concurrent.locks.LockSupport.park(LockSupport.java:175)
   [junit4]   2>         at java.util.concurrent.locks.AbstractQueuedSynchronizer$ConditionObject.await(AbstractQueuedSynchronizer.java:2039)
   [junit4]   2>         at java.util.concurrent.LinkedBlockingQueue.take(LinkedBlockingQueue.java:442)
   [junit4]   2>         at java.util.concurrent.ThreadPoolExecutor.getTask(ThreadPoolExecutor.java:1067)
   [junit4]   2>         at java.util.concurrent.ThreadPoolExecutor.runWorker(ThreadPoolExecutor.java:1127)
   [junit4]   2>         at java.util.concurrent.ThreadPoolExecutor$Worker.run(ThreadPoolExecutor.java:617)
   [junit4]   2>         at java.lang.Thread.run(Thread.java:747)
   [junit4]   2> NOTE: test params are: codec=Asserting(Lucene53): {v_t=FST50, id=FST50, v_s=PostingsFormat(name=Direct), v_f=BlockTreeOrds(blocksize=128)}, docValues:{}, sim=RandomSimilarityProvider(queryNorm=true,coord=crazy): {}, locale=ar_AE, timezone=Africa/Brazzaville
   [junit4]   2> NOTE: Linux 3.19.0-31-generic i386/Oracle Corporation 1.9.0-ea (32-bit)/cpus=12,threads=2,free=173912368,total=217579520
   [junit4]   2> NOTE: All tests run in this JVM: [TestPKIAuthenticationPlugin, OverseerTaskQueueTest, TestLazyCores]
   [junit4]   2> NOTE: reproduce with: ant test  -Dtestcase=TestLazyCores -Dtests.seed=CC93F3E2F22D4A7E -Dtests.multiplier=3 -Dtests.slow=true -Dtests.locale=ar_AE -Dtests.timezone=Africa/Brazzaville -Dtests.asserts=true -Dtests.file.encoding=UTF-8
   [junit4] ERROR   0.00s J0 | TestLazyCores (suite) <<<
   [junit4]    > Throwable #1: java.lang.AssertionError: ERROR: SolrIndexSearcher opens=51 closes=50
   [junit4]    > 	at __randomizedtesting.SeedInfo.seed([CC93F3E2F22D4A7E]:0)
   [junit4]    > 	at org.apache.solr.SolrTestCaseJ4.endTrackingSearchers(SolrTestCaseJ4.java:468)
   [junit4]    > 	at org.apache.solr.SolrTestCaseJ4.afterClass(SolrTestCaseJ4.java:234)
   [junit4]    > 	at java.lang.Thread.run(Thread.java:747)Throwable #2: java.lang.RuntimeException: file handle leaks: [FileChannel(/home/jenkins/workspace/Lucene-Solr-trunk-Linux/solr/build/solr-core/test/J0/temp/solr.core.TestLazyCores_CC93F3E2F22D4A7E-001/index-MMapDirectory-016/write.lock)]
   [junit4]    > 	at org.apache.lucene.mockfile.LeakFS.onClose(LeakFS.java:64)
   [junit4]    > 	at org.apache.lucene.mockfile.FilterFileSystem.close(FilterFileSystem.java:78)
   [junit4]    > 	at org.apache.lucene.mockfile.FilterFileSystem.close(FilterFileSystem.java:79)
   [junit4]    > 	at java.lang.Thread.run(Thread.java:747)
   [junit4]    > Caused by: java.lang.Exception
   [junit4]    > 	at org.apache.lucene.mockfile.LeakFS.onOpen(LeakFS.java:47)
   [junit4]    > 	at org.apache.lucene.mockfile.HandleTrackingFS.callOpenHook(HandleTrackingFS.java:82)
   [junit4]    > 	at org.apache.lucene.mockfile.HandleTrackingFS.newFileChannel(HandleTrackingFS.java:198)
   [junit4]    > 	at org.apache.lucene.mockfile.HandleTrackingFS.newFileChannel(HandleTrackingFS.java:167)
   [junit4]    > 	at java.nio.channels.FileChannel.open(FileChannel.java:287)
   [junit4]    > 	at java.nio.channels.FileChannel.open(FileChannel.java:335)
   [junit4]    > 	at org.apache.lucene.store.NativeFSLockFactory.obtainFSLock(NativeFSLockFactory.java:113)
   [junit4]    > 	at org.apache.lucene.store.FSLockFactory.obtainLock(FSLockFactory.java:41)
   [junit4]    > 	at org.apache.lucene.store.BaseDirectory.obtainLock(BaseDirectory.java:62)
   [junit4]    > 	at org.apache.lucene.store.FilterDirectory.obtainLock(FilterDirectory.java:99)
   [junit4]    > 	at org.apache.lucene.store.MockDirectoryWrapper.obtainLock(MockDirectoryWrapper.java:1014)
   [junit4]    > 	at org.apache.lucene.index.IndexWriter.<init>(IndexWriter.java:761)
   [junit4]    > 	at org.apache.solr.update.SolrIndexWriter.<init>(SolrIndexWriter.java:78)
   [junit4]    > 	at org.apache.solr.update.SolrIndexWriter.create(SolrIndexWriter.java:65)
   [junit4]    > 	at org.apache.solr.update.DefaultSolrCoreState.createMainIndexWriter(DefaultSolrCoreState.java:231)
   [junit4]    > 	at org.apache.solr.update.DefaultSolrCoreState.getIndexWriter(DefaultSolrCoreState.java:105)
   [junit4]    > 	at org.apache.solr.core.SolrCore.openNewSearcher(SolrCore.java:1642)
   [junit4]    > 	at org.apache.solr.core.SolrCore.getSearcher(SolrCore.java:1784)
   [junit4]    > 	at org.apache.solr.core.SolrCore.initSearcher(SolrCore.java:927)
   [junit4]    > 	at org.apache.solr.core.SolrCore.<init>(SolrCore.java:804)
   [junit4]    > 	at org.apache.solr.core.SolrCore.<init>(SolrCore.java:672)
   [junit4]    > 	at org.apache.solr.core.CoreContainer.create(CoreContainer.java:729)
   [junit4]    > 	at org.apache.solr.core.CoreContainer$1.call(CoreContainer.java:449)
   [junit4]    > 	at org.apache.solr.core.CoreContainer$1.call(CoreContainer.java:440)
   [junit4]    > 	at java.util.concurrent.FutureTask.run(FutureTask.java:265)
   [junit4]    > 	at org.apache.solr.common.util.ExecutorUtil$MDCAwareThreadPoolExecutor$1.run(ExecutorUtil.java:231)
   [junit4]    > 	at java.util.concurrent.ThreadPoolExecutor.runWorker(ThreadPoolExecutor.java:1142)
   [junit4]    > 	at java.util.concurrent.ThreadPoolExecutor$Worker.run(ThreadPoolExecutor.java:617)
   [junit4]    > 	... 1 moreThrowable #3: com.carrotsearch.randomizedtesting.ThreadLeakError: 1 thread leaked from SUITE scope at org.apache.solr.core.TestLazyCores: 
   [junit4]    >    1) Thread[id=178, name=searcherExecutor-187-thread-1, state=WAITING, group=TGRP-TestLazyCores]
   [junit4]    >         at sun.misc.Unsafe.park(Native Method)
   [junit4]    >         at java.util.concurrent.locks.LockSupport.park(LockSupport.java:175)
   [junit4]    >         at java.util.concurrent.locks.AbstractQueuedSynchronizer$ConditionObject.await(AbstractQueuedSynchronizer.java:2039)
   [junit4]    >         at java.util.concurrent.LinkedBlockingQueue.take(LinkedBlockingQueue.java:442)
   [junit4]    >         at java.util.concurrent.ThreadPoolExecutor.getTask(ThreadPoolExecutor.java:1067)
   [junit4]    >         at java.util.concurrent.ThreadPoolExecutor.runWorker(ThreadPoolExecutor.java:1127)
   [junit4]    >         at java.util.concurrent.ThreadPoolExecutor$Worker.run(ThreadPoolExecutor.java:617)
   [junit4]    >         at java.lang.Thread.run(Thread.java:747)
   [junit4]    > 	at __randomizedtesting.SeedInfo.seed([CC93F3E2F22D4A7E]:0)Throwable #4: com.carrotsearch.randomizedtesting.ThreadLeakError: There are still zombie threads that couldn't be terminated:
   [junit4]    >    1) Thread[id=178, name=searcherExecutor-187-thread-1, state=WAITING, group=TGRP-TestLazyCores]
   [junit4]    >         at sun.misc.Unsafe.park(Native Method)
   [junit4]    >         at java.util.concurrent.locks.LockSupport.park(LockSupport.java:175)
   [junit4]    >         at java.util.concurrent.locks.AbstractQueuedSynchronizer$ConditionObject.await(AbstractQueuedSynchronizer.java:2039)
   [junit4]    >         at java.util.concurrent.LinkedBlockingQueue.take(LinkedBlockingQueue.java:442)
   [junit4]    >         at java.util.concurrent.ThreadPoolExecutor.getTask(ThreadPoolExecutor.java:1067)
   [junit4]    >         at java.util.concurrent.ThreadPoolExecutor.runWorker(ThreadPoolExecutor.java:1127)
   [junit4]    >         at java.util.concurrent.ThreadPoolExecutor$Worker.run(ThreadPoolExecutor.java:617)
   [junit4]    >         at java.lang.Thread.run(Thread.java:747)
   [junit4]    > 	at __randomizedtesting.SeedInfo.seed([CC93F3E2F22D4A7E]:0)
   [junit4] Completed [39/552] on J0 in 148.66s, 7 tests, 1 failure, 3 errors <<< FAILURES!

[...truncated 1588 lines...]
BUILD FAILED
/home/jenkins/workspace/Lucene-Solr-trunk-Linux/build.xml:775: The following error occurred while executing this line:
/home/jenkins/workspace/Lucene-Solr-trunk-Linux/build.xml:719: The following error occurred while executing this line:
/home/jenkins/workspace/Lucene-Solr-trunk-Linux/build.xml:59: The following error occurred while executing this line:
/home/jenkins/workspace/Lucene-Solr-trunk-Linux/solr/build.xml:233: The following error occurred while executing this line:
/home/jenkins/workspace/Lucene-Solr-trunk-Linux/solr/common-build.xml:516: The following error occurred while executing this line:
/home/jenkins/workspace/Lucene-Solr-trunk-Linux/lucene/common-build.xml:1432: The following error occurred while executing this line:
/home/jenkins/workspace/Lucene-Solr-trunk-Linux/lucene/common-build.xml:987: There were test failures: 552 suites (8 ignored), 2171 tests, 4 suite-level errors, 1427 ignored (30 assumptions) [seed: CC93F3E2F22D4A7E]

Total time: 37 minutes 55 seconds
Build step 'Invoke Ant' marked build as failure
Archiving artifacts
[WARNINGS] Skipping publisher since build result is FAILURE
Recording test results
Email was triggered for: Failure - Any
Sending email for trigger: Failure - Any



[JENKINS-EA] Lucene-Solr-trunk-Linux (32bit/jdk1.9.0-ea-b85) - Build # 14614 - Still Failing!

Posted by Policeman Jenkins Server <je...@thetaphi.de>.
Build: http://jenkins.thetaphi.de/job/Lucene-Solr-trunk-Linux/14614/
Java: 32bit/jdk1.9.0-ea-b85 -server -XX:+UseParallelGC

1 tests failed.
FAILED:  org.apache.solr.cloud.HttpPartitionTest.test

Error Message:
Doc with id=2 not found in http://127.0.0.1:60147/c8n_1x2_leader_session_loss due to: Path not found: /id; rsp={doc=null}

Stack Trace:
java.lang.AssertionError: Doc with id=2 not found in http://127.0.0.1:60147/c8n_1x2_leader_session_loss due to: Path not found: /id; rsp={doc=null}
	at __randomizedtesting.SeedInfo.seed([AE9B26581EE7AA43:26CF1982B01BC7BB]:0)
	at org.junit.Assert.fail(Assert.java:93)
	at org.junit.Assert.assertTrue(Assert.java:43)
	at org.apache.solr.cloud.HttpPartitionTest.assertDocExists(HttpPartitionTest.java:622)
	at org.apache.solr.cloud.HttpPartitionTest.assertDocsExistInAllReplicas(HttpPartitionTest.java:577)
	at org.apache.solr.cloud.HttpPartitionTest.testLeaderZkSessionLoss(HttpPartitionTest.java:525)
	at org.apache.solr.cloud.HttpPartitionTest.test(HttpPartitionTest.java:121)
	at sun.reflect.NativeMethodAccessorImpl.invoke0(Native Method)
	at sun.reflect.NativeMethodAccessorImpl.invoke(NativeMethodAccessorImpl.java:62)
	at sun.reflect.DelegatingMethodAccessorImpl.invoke(DelegatingMethodAccessorImpl.java:43)
	at java.lang.reflect.Method.invoke(Method.java:520)
	at com.carrotsearch.randomizedtesting.RandomizedRunner.invoke(RandomizedRunner.java:1665)
	at com.carrotsearch.randomizedtesting.RandomizedRunner$8.evaluate(RandomizedRunner.java:864)
	at com.carrotsearch.randomizedtesting.RandomizedRunner$9.evaluate(RandomizedRunner.java:900)
	at com.carrotsearch.randomizedtesting.RandomizedRunner$10.evaluate(RandomizedRunner.java:914)
	at org.apache.solr.BaseDistributedSearchTestCase$ShardsRepeatRule$ShardsFixedStatement.callStatement(BaseDistributedSearchTestCase.java:963)
	at org.apache.solr.BaseDistributedSearchTestCase$ShardsRepeatRule$ShardsStatement.evaluate(BaseDistributedSearchTestCase.java:938)
	at com.carrotsearch.randomizedtesting.rules.SystemPropertiesRestoreRule$1.evaluate(SystemPropertiesRestoreRule.java:57)
	at org.apache.lucene.util.TestRuleSetupTeardownChained$1.evaluate(TestRuleSetupTeardownChained.java:50)
	at org.apache.lucene.util.AbstractBeforeAfterRule$1.evaluate(AbstractBeforeAfterRule.java:46)
	at org.apache.lucene.util.TestRuleThreadAndTestName$1.evaluate(TestRuleThreadAndTestName.java:49)
	at org.apache.lucene.util.TestRuleIgnoreAfterMaxFailures$1.evaluate(TestRuleIgnoreAfterMaxFailures.java:65)
	at org.apache.lucene.util.TestRuleMarkFailure$1.evaluate(TestRuleMarkFailure.java:48)
	at com.carrotsearch.randomizedtesting.rules.StatementAdapter.evaluate(StatementAdapter.java:36)
	at com.carrotsearch.randomizedtesting.ThreadLeakControl$StatementRunner.run(ThreadLeakControl.java:367)
	at com.carrotsearch.randomizedtesting.ThreadLeakControl.forkTimeoutingTask(ThreadLeakControl.java:809)
	at com.carrotsearch.randomizedtesting.ThreadLeakControl$3.evaluate(ThreadLeakControl.java:460)
	at com.carrotsearch.randomizedtesting.RandomizedRunner.runSingleTest(RandomizedRunner.java:873)
	at com.carrotsearch.randomizedtesting.RandomizedRunner$5.evaluate(RandomizedRunner.java:775)
	at com.carrotsearch.randomizedtesting.RandomizedRunner$6.evaluate(RandomizedRunner.java:809)
	at com.carrotsearch.randomizedtesting.RandomizedRunner$7.evaluate(RandomizedRunner.java:820)
	at com.carrotsearch.randomizedtesting.rules.StatementAdapter.evaluate(StatementAdapter.java:36)
	at com.carrotsearch.randomizedtesting.rules.SystemPropertiesRestoreRule$1.evaluate(SystemPropertiesRestoreRule.java:57)
	at org.apache.lucene.util.AbstractBeforeAfterRule$1.evaluate(AbstractBeforeAfterRule.java:46)
	at com.carrotsearch.randomizedtesting.rules.StatementAdapter.evaluate(StatementAdapter.java:36)
	at org.apache.lucene.util.TestRuleStoreClassName$1.evaluate(TestRuleStoreClassName.java:42)
	at com.carrotsearch.randomizedtesting.rules.NoShadowingOrOverridesOnMethodsRule$1.evaluate(NoShadowingOrOverridesOnMethodsRule.java:39)
	at com.carrotsearch.randomizedtesting.rules.NoShadowingOrOverridesOnMethodsRule$1.evaluate(NoShadowingOrOverridesOnMethodsRule.java:39)
	at com.carrotsearch.randomizedtesting.rules.StatementAdapter.evaluate(StatementAdapter.java:36)
	at com.carrotsearch.randomizedtesting.rules.StatementAdapter.evaluate(StatementAdapter.java:36)
	at com.carrotsearch.randomizedtesting.rules.StatementAdapter.evaluate(StatementAdapter.java:36)
	at org.apache.lucene.util.TestRuleAssertionsRequired$1.evaluate(TestRuleAssertionsRequired.java:54)
	at org.apache.lucene.util.TestRuleMarkFailure$1.evaluate(TestRuleMarkFailure.java:48)
	at org.apache.lucene.util.TestRuleIgnoreAfterMaxFailures$1.evaluate(TestRuleIgnoreAfterMaxFailures.java:65)
	at org.apache.lucene.util.TestRuleIgnoreTestSuites$1.evaluate(TestRuleIgnoreTestSuites.java:55)
	at com.carrotsearch.randomizedtesting.rules.StatementAdapter.evaluate(StatementAdapter.java:36)
	at com.carrotsearch.randomizedtesting.ThreadLeakControl$StatementRunner.run(ThreadLeakControl.java:367)
	at java.lang.Thread.run(Thread.java:747)




Build Log:
[...truncated 9796 lines...]
   [junit4] Suite: org.apache.solr.cloud.HttpPartitionTest
   [junit4]   2> Creating dataDir: /home/jenkins/workspace/Lucene-Solr-trunk-Linux/solr/build/solr-core/test/J0/temp/solr.cloud.HttpPartitionTest_AE9B26581EE7AA43-001/init-core-data-001
   [junit4]   2> 574719 INFO  (SUITE-HttpPartitionTest-seed#[AE9B26581EE7AA43]-worker) [    ] o.a.s.BaseDistributedSearchTestCase Setting hostContext system property: /
   [junit4]   2> 574721 INFO  (TEST-HttpPartitionTest.test-seed#[AE9B26581EE7AA43]) [    ] o.a.s.c.ZkTestServer STARTING ZK TEST SERVER
   [junit4]   2> 574721 INFO  (Thread-1178) [    ] o.a.s.c.ZkTestServer client port:0.0.0.0/0.0.0.0:0
   [junit4]   2> 574721 INFO  (Thread-1178) [    ] o.a.s.c.ZkTestServer Starting server
   [junit4]   2> 574821 INFO  (TEST-HttpPartitionTest.test-seed#[AE9B26581EE7AA43]) [    ] o.a.s.c.ZkTestServer start zk server on port:43634
   [junit4]   2> 574821 INFO  (TEST-HttpPartitionTest.test-seed#[AE9B26581EE7AA43]) [    ] o.a.s.c.c.SolrZkClient Using default ZkCredentialsProvider
   [junit4]   2> 574821 INFO  (TEST-HttpPartitionTest.test-seed#[AE9B26581EE7AA43]) [    ] o.a.s.c.c.ConnectionManager Waiting for client to connect to ZooKeeper
   [junit4]   2> 574823 INFO  (zkCallback-613-thread-1) [    ] o.a.s.c.c.ConnectionManager Watcher org.apache.solr.common.cloud.ConnectionManager@ce724b name:ZooKeeperConnection Watcher:127.0.0.1:43634 got event WatchedEvent state:SyncConnected type:None path:null path:null type:None
   [junit4]   2> 574823 INFO  (TEST-HttpPartitionTest.test-seed#[AE9B26581EE7AA43]) [    ] o.a.s.c.c.ConnectionManager Client is connected to ZooKeeper
   [junit4]   2> 574823 INFO  (TEST-HttpPartitionTest.test-seed#[AE9B26581EE7AA43]) [    ] o.a.s.c.c.SolrZkClient Using default ZkACLProvider
   [junit4]   2> 574823 INFO  (TEST-HttpPartitionTest.test-seed#[AE9B26581EE7AA43]) [    ] o.a.s.c.c.SolrZkClient makePath: /solr
   [junit4]   2> 574825 INFO  (TEST-HttpPartitionTest.test-seed#[AE9B26581EE7AA43]) [    ] o.a.s.c.c.SolrZkClient Using default ZkCredentialsProvider
   [junit4]   2> 574825 INFO  (TEST-HttpPartitionTest.test-seed#[AE9B26581EE7AA43]) [    ] o.a.s.c.c.ConnectionManager Waiting for client to connect to ZooKeeper
   [junit4]   2> 574825 INFO  (zkCallback-614-thread-1) [    ] o.a.s.c.c.ConnectionManager Watcher org.apache.solr.common.cloud.ConnectionManager@1cfe409 name:ZooKeeperConnection Watcher:127.0.0.1:43634/solr got event WatchedEvent state:SyncConnected type:None path:null path:null type:None
   [junit4]   2> 574825 INFO  (TEST-HttpPartitionTest.test-seed#[AE9B26581EE7AA43]) [    ] o.a.s.c.c.ConnectionManager Client is connected to ZooKeeper
   [junit4]   2> 574826 INFO  (TEST-HttpPartitionTest.test-seed#[AE9B26581EE7AA43]) [    ] o.a.s.c.c.SolrZkClient Using default ZkACLProvider
   [junit4]   2> 574826 INFO  (TEST-HttpPartitionTest.test-seed#[AE9B26581EE7AA43]) [    ] o.a.s.c.c.SolrZkClient makePath: /collections/collection1
   [junit4]   2> 574826 INFO  (TEST-HttpPartitionTest.test-seed#[AE9B26581EE7AA43]) [    ] o.a.s.c.c.SolrZkClient makePath: /collections/collection1/shards
   [junit4]   2> 574827 INFO  (TEST-HttpPartitionTest.test-seed#[AE9B26581EE7AA43]) [    ] o.a.s.c.c.SolrZkClient makePath: /collections/control_collection
   [junit4]   2> 574827 INFO  (TEST-HttpPartitionTest.test-seed#[AE9B26581EE7AA43]) [    ] o.a.s.c.c.SolrZkClient makePath: /collections/control_collection/shards
   [junit4]   2> 574828 INFO  (TEST-HttpPartitionTest.test-seed#[AE9B26581EE7AA43]) [    ] o.a.s.c.AbstractZkTestCase put /home/jenkins/workspace/Lucene-Solr-trunk-Linux/solr/core/src/test-files/solr/collection1/conf/solrconfig-tlog.xml to /configs/conf1/solrconfig.xml
   [junit4]   2> 574828 INFO  (TEST-HttpPartitionTest.test-seed#[AE9B26581EE7AA43]) [    ] o.a.s.c.c.SolrZkClient makePath: /configs/conf1/solrconfig.xml
   [junit4]   2> 574828 INFO  (TEST-HttpPartitionTest.test-seed#[AE9B26581EE7AA43]) [    ] o.a.s.c.AbstractZkTestCase put /home/jenkins/workspace/Lucene-Solr-trunk-Linux/solr/core/src/test-files/solr/collection1/conf/schema.xml to /configs/conf1/schema.xml
   [junit4]   2> 574829 INFO  (TEST-HttpPartitionTest.test-seed#[AE9B26581EE7AA43]) [    ] o.a.s.c.c.SolrZkClient makePath: /configs/conf1/schema.xml
   [junit4]   2> 574829 INFO  (TEST-HttpPartitionTest.test-seed#[AE9B26581EE7AA43]) [    ] o.a.s.c.AbstractZkTestCase put /home/jenkins/workspace/Lucene-Solr-trunk-Linux/solr/core/src/test-files/solr/collection1/conf/solrconfig.snippet.randomindexconfig.xml to /configs/conf1/solrconfig.snippet.randomindexconfig.xml
   [junit4]   2> 574829 INFO  (TEST-HttpPartitionTest.test-seed#[AE9B26581EE7AA43]) [    ] o.a.s.c.c.SolrZkClient makePath: /configs/conf1/solrconfig.snippet.randomindexconfig.xml
   [junit4]   2> 574830 INFO  (TEST-HttpPartitionTest.test-seed#[AE9B26581EE7AA43]) [    ] o.a.s.c.AbstractZkTestCase put /home/jenkins/workspace/Lucene-Solr-trunk-Linux/solr/core/src/test-files/solr/collection1/conf/stopwords.txt to /configs/conf1/stopwords.txt
   [junit4]   2> 574830 INFO  (TEST-HttpPartitionTest.test-seed#[AE9B26581EE7AA43]) [    ] o.a.s.c.c.SolrZkClient makePath: /configs/conf1/stopwords.txt
   [junit4]   2> 574830 INFO  (TEST-HttpPartitionTest.test-seed#[AE9B26581EE7AA43]) [    ] o.a.s.c.AbstractZkTestCase put /home/jenkins/workspace/Lucene-Solr-trunk-Linux/solr/core/src/test-files/solr/collection1/conf/protwords.txt to /configs/conf1/protwords.txt
   [junit4]   2> 574830 INFO  (TEST-HttpPartitionTest.test-seed#[AE9B26581EE7AA43]) [    ] o.a.s.c.c.SolrZkClient makePath: /configs/conf1/protwords.txt
   [junit4]   2> 574831 INFO  (TEST-HttpPartitionTest.test-seed#[AE9B26581EE7AA43]) [    ] o.a.s.c.AbstractZkTestCase put /home/jenkins/workspace/Lucene-Solr-trunk-Linux/solr/core/src/test-files/solr/collection1/conf/currency.xml to /configs/conf1/currency.xml
   [junit4]   2> 574831 INFO  (TEST-HttpPartitionTest.test-seed#[AE9B26581EE7AA43]) [    ] o.a.s.c.c.SolrZkClient makePath: /configs/conf1/currency.xml
   [junit4]   2> 574831 INFO  (TEST-HttpPartitionTest.test-seed#[AE9B26581EE7AA43]) [    ] o.a.s.c.AbstractZkTestCase put /home/jenkins/workspace/Lucene-Solr-trunk-Linux/solr/core/src/test-files/solr/collection1/conf/enumsConfig.xml to /configs/conf1/enumsConfig.xml
   [junit4]   2> 574831 INFO  (TEST-HttpPartitionTest.test-seed#[AE9B26581EE7AA43]) [    ] o.a.s.c.c.SolrZkClient makePath: /configs/conf1/enumsConfig.xml
   [junit4]   2> 574832 INFO  (TEST-HttpPartitionTest.test-seed#[AE9B26581EE7AA43]) [    ] o.a.s.c.AbstractZkTestCase put /home/jenkins/workspace/Lucene-Solr-trunk-Linux/solr/core/src/test-files/solr/collection1/conf/open-exchange-rates.json to /configs/conf1/open-exchange-rates.json
   [junit4]   2> 574832 INFO  (TEST-HttpPartitionTest.test-seed#[AE9B26581EE7AA43]) [    ] o.a.s.c.c.SolrZkClient makePath: /configs/conf1/open-exchange-rates.json
   [junit4]   2> 574832 INFO  (TEST-HttpPartitionTest.test-seed#[AE9B26581EE7AA43]) [    ] o.a.s.c.AbstractZkTestCase put /home/jenkins/workspace/Lucene-Solr-trunk-Linux/solr/core/src/test-files/solr/collection1/conf/mapping-ISOLatin1Accent.txt to /configs/conf1/mapping-ISOLatin1Accent.txt
   [junit4]   2> 574832 INFO  (TEST-HttpPartitionTest.test-seed#[AE9B26581EE7AA43]) [    ] o.a.s.c.c.SolrZkClient makePath: /configs/conf1/mapping-ISOLatin1Accent.txt
   [junit4]   2> 574833 INFO  (TEST-HttpPartitionTest.test-seed#[AE9B26581EE7AA43]) [    ] o.a.s.c.AbstractZkTestCase put /home/jenkins/workspace/Lucene-Solr-trunk-Linux/solr/core/src/test-files/solr/collection1/conf/old_synonyms.txt to /configs/conf1/old_synonyms.txt
   [junit4]   2> 574833 INFO  (TEST-HttpPartitionTest.test-seed#[AE9B26581EE7AA43]) [    ] o.a.s.c.c.SolrZkClient makePath: /configs/conf1/old_synonyms.txt
   [junit4]   2> 574833 INFO  (TEST-HttpPartitionTest.test-seed#[AE9B26581EE7AA43]) [    ] o.a.s.c.AbstractZkTestCase put /home/jenkins/workspace/Lucene-Solr-trunk-Linux/solr/core/src/test-files/solr/collection1/conf/synonyms.txt to /configs/conf1/synonyms.txt
   [junit4]   2> 574833 INFO  (TEST-HttpPartitionTest.test-seed#[AE9B26581EE7AA43]) [    ] o.a.s.c.c.SolrZkClient makePath: /configs/conf1/synonyms.txt
   [junit4]   2> 574882 INFO  (TEST-HttpPartitionTest.test-seed#[AE9B26581EE7AA43]) [    ] o.a.s.SolrTestCaseJ4 Writing core.properties file to /home/jenkins/workspace/Lucene-Solr-trunk-Linux/solr/build/solr-core/test/J0/temp/solr.cloud.HttpPartitionTest_AE9B26581EE7AA43-001/control-001/cores/collection1
   [junit4]   2> 574884 INFO  (TEST-HttpPartitionTest.test-seed#[AE9B26581EE7AA43]) [    ] o.e.j.s.Server jetty-9.2.13.v20150730
   [junit4]   2> 574885 INFO  (TEST-HttpPartitionTest.test-seed#[AE9B26581EE7AA43]) [    ] o.e.j.s.h.ContextHandler Started o.e.j.s.ServletContextHandler@1893773{/,null,AVAILABLE}
   [junit4]   2> 574887 INFO  (TEST-HttpPartitionTest.test-seed#[AE9B26581EE7AA43]) [    ] o.e.j.s.ServerConnector Started ServerConnector@4f1868{HTTP/1.1}{127.0.0.1:59439}
   [junit4]   2> 574887 INFO  (TEST-HttpPartitionTest.test-seed#[AE9B26581EE7AA43]) [    ] o.e.j.s.Server Started @576943ms
   [junit4]   2> 574887 INFO  (TEST-HttpPartitionTest.test-seed#[AE9B26581EE7AA43]) [    ] o.a.s.c.s.e.JettySolrRunner Jetty properties: {solr.data.dir=/home/jenkins/workspace/Lucene-Solr-trunk-Linux/solr/build/solr-core/test/J0/temp/solr.cloud.HttpPartitionTest_AE9B26581EE7AA43-001/tempDir-001/control/data, hostContext=/, hostPort=60147, coreRootDirectory=/home/jenkins/workspace/Lucene-Solr-trunk-Linux/solr/build/solr-core/test/J0/temp/solr.cloud.HttpPartitionTest_AE9B26581EE7AA43-001/control-001/cores}
   [junit4]   2> 574887 INFO  (TEST-HttpPartitionTest.test-seed#[AE9B26581EE7AA43]) [    ] o.a.s.s.SolrDispatchFilter SolrDispatchFilter.init(): sun.misc.Launcher$AppClassLoader@1c6c3b2
   [junit4]   2> 574887 INFO  (TEST-HttpPartitionTest.test-seed#[AE9B26581EE7AA43]) [    ] o.a.s.c.SolrResourceLoader new SolrResourceLoader for directory: '/home/jenkins/workspace/Lucene-Solr-trunk-Linux/solr/build/solr-core/test/J0/temp/solr.cloud.HttpPartitionTest_AE9B26581EE7AA43-001/control-001/'
   [junit4]   2> 574887 INFO  (TEST-HttpPartitionTest.test-seed#[AE9B26581EE7AA43]) [    ] o.a.s.c.SolrResourceLoader JNDI not configured for solr (NoInitialContextEx)
   [junit4]   2> 574887 INFO  (TEST-HttpPartitionTest.test-seed#[AE9B26581EE7AA43]) [    ] o.a.s.c.SolrResourceLoader solr home defaulted to 'solr/' (could not find system property or JNDI)
   [junit4]   2> 574895 INFO  (TEST-HttpPartitionTest.test-seed#[AE9B26581EE7AA43]) [    ] o.a.s.c.c.SolrZkClient Using default ZkCredentialsProvider
   [junit4]   2> 574895 INFO  (TEST-HttpPartitionTest.test-seed#[AE9B26581EE7AA43]) [    ] o.a.s.c.c.ConnectionManager Waiting for client to connect to ZooKeeper
   [junit4]   2> 574896 INFO  (zkCallback-615-thread-1) [    ] o.a.s.c.c.ConnectionManager Watcher org.apache.solr.common.cloud.ConnectionManager@17d3a3a name:ZooKeeperConnection Watcher:127.0.0.1:43634/solr got event WatchedEvent state:SyncConnected type:None path:null path:null type:None
   [junit4]   2> 574896 INFO  (TEST-HttpPartitionTest.test-seed#[AE9B26581EE7AA43]) [    ] o.a.s.c.c.ConnectionManager Client is connected to ZooKeeper
   [junit4]   2> 574896 INFO  (TEST-HttpPartitionTest.test-seed#[AE9B26581EE7AA43]) [    ] o.a.s.c.c.SolrZkClient Using default ZkACLProvider
   [junit4]   2> 574897 INFO  (TEST-HttpPartitionTest.test-seed#[AE9B26581EE7AA43]) [    ] o.a.s.s.SolrDispatchFilter Loading solr.xml from SolrHome (not found in ZooKeeper)
   [junit4]   2> 574897 INFO  (TEST-HttpPartitionTest.test-seed#[AE9B26581EE7AA43]) [    ] o.a.s.c.SolrXmlConfig Loading container configuration from /home/jenkins/workspace/Lucene-Solr-trunk-Linux/solr/build/solr-core/test/J0/temp/solr.cloud.HttpPartitionTest_AE9B26581EE7AA43-001/control-001/solr.xml
   [junit4]   2> 574900 INFO  (TEST-HttpPartitionTest.test-seed#[AE9B26581EE7AA43]) [    ] o.a.s.c.CoresLocator Config-defined core root directory: /home/jenkins/workspace/Lucene-Solr-trunk-Linux/solr/build/solr-core/test/J0/temp/solr.cloud.HttpPartitionTest_AE9B26581EE7AA43-001/control-001/cores
   [junit4]   2> 574900 INFO  (TEST-HttpPartitionTest.test-seed#[AE9B26581EE7AA43]) [    ] o.a.s.c.CoreContainer New CoreContainer 6052766
   [junit4]   2> 574900 INFO  (TEST-HttpPartitionTest.test-seed#[AE9B26581EE7AA43]) [    ] o.a.s.c.CoreContainer Loading cores into CoreContainer [instanceDir=/home/jenkins/workspace/Lucene-Solr-trunk-Linux/solr/build/solr-core/test/J0/temp/solr.cloud.HttpPartitionTest_AE9B26581EE7AA43-001/control-001/]
   [junit4]   2> 574900 INFO  (TEST-HttpPartitionTest.test-seed#[AE9B26581EE7AA43]) [    ] o.a.s.c.CoreContainer loading shared library: /home/jenkins/workspace/Lucene-Solr-trunk-Linux/solr/build/solr-core/test/J0/temp/solr.cloud.HttpPartitionTest_AE9B26581EE7AA43-001/control-001/lib
   [junit4]   2> 574900 WARN  (TEST-HttpPartitionTest.test-seed#[AE9B26581EE7AA43]) [    ] o.a.s.c.SolrResourceLoader Can't find (or read) directory to add to classloader: lib (resolved as: /home/jenkins/workspace/Lucene-Solr-trunk-Linux/solr/build/solr-core/test/J0/temp/solr.cloud.HttpPartitionTest_AE9B26581EE7AA43-001/control-001/lib).
   [junit4]   2> 574905 INFO  (TEST-HttpPartitionTest.test-seed#[AE9B26581EE7AA43]) [    ] o.a.s.h.c.HttpShardHandlerFactory created with socketTimeout : 90000,urlScheme : ,connTimeout : 15000,maxConnectionsPerHost : 20,maxConnections : 10000,corePoolSize : 0,maximumPoolSize : 2147483647,maxThreadIdleTime : 5,sizeOfQueue : -1,fairnessPolicy : false,useRetries : false,
   [junit4]   2> 574906 INFO  (TEST-HttpPartitionTest.test-seed#[AE9B26581EE7AA43]) [    ] o.a.s.u.UpdateShardHandler Creating UpdateShardHandler HTTP client with params: socketTimeout=340000&connTimeout=45000&retry=true
   [junit4]   2> 574906 INFO  (TEST-HttpPartitionTest.test-seed#[AE9B26581EE7AA43]) [    ] o.a.s.l.LogWatcher SLF4J impl is org.slf4j.impl.Log4jLoggerFactory
   [junit4]   2> 574906 INFO  (TEST-HttpPartitionTest.test-seed#[AE9B26581EE7AA43]) [    ] o.a.s.l.LogWatcher Registering Log Listener [Log4j (org.slf4j.impl.Log4jLoggerFactory)]
   [junit4]   2> 574906 INFO  (TEST-HttpPartitionTest.test-seed#[AE9B26581EE7AA43]) [    ] o.a.s.c.ZkContainer Zookeeper client=127.0.0.1:43634/solr
   [junit4]   2> 574906 INFO  (TEST-HttpPartitionTest.test-seed#[AE9B26581EE7AA43]) [    ] o.a.s.c.ZkController zkHost includes chroot
   [junit4]   2> 574906 INFO  (TEST-HttpPartitionTest.test-seed#[AE9B26581EE7AA43]) [    ] o.a.s.c.c.SolrZkClient Using default ZkCredentialsProvider
   [junit4]   2> 574907 INFO  (TEST-HttpPartitionTest.test-seed#[AE9B26581EE7AA43]) [    ] o.a.s.c.c.ConnectionManager Waiting for client to connect to ZooKeeper
   [junit4]   2> 574907 INFO  (zkCallback-617-thread-1) [    ] o.a.s.c.c.ConnectionManager Watcher org.apache.solr.common.cloud.ConnectionManager@19a2d6 name:ZooKeeperConnection Watcher:127.0.0.1:43634 got event WatchedEvent state:SyncConnected type:None path:null path:null type:None
   [junit4]   2> 574908 INFO  (TEST-HttpPartitionTest.test-seed#[AE9B26581EE7AA43]) [    ] o.a.s.c.c.ConnectionManager Client is connected to ZooKeeper
   [junit4]   2> 574909 INFO  (TEST-HttpPartitionTest.test-seed#[AE9B26581EE7AA43]) [    ] o.a.s.c.c.SolrZkClient Using default ZkACLProvider
   [junit4]   2> 574909 INFO  (TEST-HttpPartitionTest.test-seed#[AE9B26581EE7AA43]) [n:127.0.0.1:60147_    ] o.a.s.c.c.ConnectionManager Waiting for client to connect to ZooKeeper
   [junit4]   2> 574910 INFO  (zkCallback-618-thread-1-processing-n:127.0.0.1:60147_) [n:127.0.0.1:60147_    ] o.a.s.c.c.ConnectionManager Watcher org.apache.solr.common.cloud.ConnectionManager@d7448 name:ZooKeeperConnection Watcher:127.0.0.1:43634/solr got event WatchedEvent state:SyncConnected type:None path:null path:null type:None
   [junit4]   2> 574910 INFO  (TEST-HttpPartitionTest.test-seed#[AE9B26581EE7AA43]) [n:127.0.0.1:60147_    ] o.a.s.c.c.ConnectionManager Client is connected to ZooKeeper
   [junit4]   2> 574910 INFO  (TEST-HttpPartitionTest.test-seed#[AE9B26581EE7AA43]) [n:127.0.0.1:60147_    ] o.a.s.c.c.SolrZkClient makePath: /overseer/queue
   [junit4]   2> 574911 INFO  (TEST-HttpPartitionTest.test-seed#[AE9B26581EE7AA43]) [n:127.0.0.1:60147_    ] o.a.s.c.c.SolrZkClient makePath: /overseer/collection-queue-work
   [junit4]   2> 574912 INFO  (TEST-HttpPartitionTest.test-seed#[AE9B26581EE7AA43]) [n:127.0.0.1:60147_    ] o.a.s.c.c.SolrZkClient makePath: /overseer/collection-map-running
   [junit4]   2> 574912 INFO  (TEST-HttpPartitionTest.test-seed#[AE9B26581EE7AA43]) [n:127.0.0.1:60147_    ] o.a.s.c.c.SolrZkClient makePath: /overseer/collection-map-completed
   [junit4]   2> 574913 INFO  (TEST-HttpPartitionTest.test-seed#[AE9B26581EE7AA43]) [n:127.0.0.1:60147_    ] o.a.s.c.c.SolrZkClient makePath: /overseer/collection-map-failure
   [junit4]   2> 574914 INFO  (TEST-HttpPartitionTest.test-seed#[AE9B26581EE7AA43]) [n:127.0.0.1:60147_    ] o.a.s.c.c.SolrZkClient makePath: /live_nodes
   [junit4]   2> 574914 INFO  (TEST-HttpPartitionTest.test-seed#[AE9B26581EE7AA43]) [n:127.0.0.1:60147_    ] o.a.s.c.c.SolrZkClient makePath: /aliases.json
   [junit4]   2> 574914 INFO  (TEST-HttpPartitionTest.test-seed#[AE9B26581EE7AA43]) [n:127.0.0.1:60147_    ] o.a.s.c.c.SolrZkClient makePath: /clusterstate.json
   [junit4]   2> 574915 INFO  (TEST-HttpPartitionTest.test-seed#[AE9B26581EE7AA43]) [n:127.0.0.1:60147_    ] o.a.s.c.c.SolrZkClient makePath: /security.json
   [junit4]   2> 574916 INFO  (TEST-HttpPartitionTest.test-seed#[AE9B26581EE7AA43]) [n:127.0.0.1:60147_    ] o.a.s.c.ZkController Register node as live in ZooKeeper:/live_nodes/127.0.0.1:60147_
   [junit4]   2> 574916 INFO  (TEST-HttpPartitionTest.test-seed#[AE9B26581EE7AA43]) [n:127.0.0.1:60147_    ] o.a.s.c.c.SolrZkClient makePath: /live_nodes/127.0.0.1:60147_
   [junit4]   2> 574917 INFO  (TEST-HttpPartitionTest.test-seed#[AE9B26581EE7AA43]) [n:127.0.0.1:60147_    ] o.a.s.c.c.SolrZkClient makePath: /overseer_elect
   [junit4]   2> 574917 INFO  (TEST-HttpPartitionTest.test-seed#[AE9B26581EE7AA43]) [n:127.0.0.1:60147_    ] o.a.s.c.c.SolrZkClient makePath: /overseer_elect/election
   [junit4]   2> 574917 INFO  (TEST-HttpPartitionTest.test-seed#[AE9B26581EE7AA43]) [n:127.0.0.1:60147_    ] o.a.s.c.Overseer Overseer (id=null) closing
   [junit4]   2> 574918 INFO  (TEST-HttpPartitionTest.test-seed#[AE9B26581EE7AA43]) [n:127.0.0.1:60147_    ] o.a.s.c.LeaderElector Joined leadership election with path: /overseer_elect/election/94729634352594948-127.0.0.1:60147_-n_0000000000
   [junit4]   2> 574918 INFO  (TEST-HttpPartitionTest.test-seed#[AE9B26581EE7AA43]) [n:127.0.0.1:60147_    ] o.a.s.c.OverseerElectionContext I am going to be the leader 127.0.0.1:60147_
   [junit4]   2> 574918 INFO  (TEST-HttpPartitionTest.test-seed#[AE9B26581EE7AA43]) [n:127.0.0.1:60147_    ] o.a.s.c.c.SolrZkClient makePath: /overseer_elect/leader
   [junit4]   2> 574918 INFO  (TEST-HttpPartitionTest.test-seed#[AE9B26581EE7AA43]) [n:127.0.0.1:60147_    ] o.a.s.c.Overseer Overseer (id=94729634352594948-127.0.0.1:60147_-n_0000000000) starting
   [junit4]   2> 574919 INFO  (TEST-HttpPartitionTest.test-seed#[AE9B26581EE7AA43]) [n:127.0.0.1:60147_    ] o.a.s.c.c.SolrZkClient makePath: /overseer/queue-work
   [junit4]   2> 574921 INFO  (TEST-HttpPartitionTest.test-seed#[AE9B26581EE7AA43]) [n:127.0.0.1:60147_    ] o.a.s.c.OverseerAutoReplicaFailoverThread Starting OverseerAutoReplicaFailoverThread autoReplicaFailoverWorkLoopDelay=10000 autoReplicaFailoverWaitAfterExpiration=30000 autoReplicaFailoverBadNodeExpiration=60000
   [junit4]   2> 574921 INFO  (TEST-HttpPartitionTest.test-seed#[AE9B26581EE7AA43]) [n:127.0.0.1:60147_    ] o.a.s.c.c.ZkStateReader Updating cluster state from ZooKeeper... 
   [junit4]   2> 574921 INFO  (OverseerCollectionConfigSetProcessor-94729634352594948-127.0.0.1:60147_-n_0000000000) [n:127.0.0.1:60147_    ] o.a.s.c.OverseerTaskProcessor Process current queue of overseer operations
   [junit4]   2> 574921 INFO  (OverseerStateUpdate-94729634352594948-127.0.0.1:60147_-n_0000000000) [n:127.0.0.1:60147_    ] o.a.s.c.Overseer Starting to work on the main queue
   [junit4]   2> 574940 INFO  (TEST-HttpPartitionTest.test-seed#[AE9B26581EE7AA43]) [n:127.0.0.1:60147_    ] o.a.s.c.CoreContainer Security conf doesn't exist. Skipping setup for authorization module.
   [junit4]   2> 574940 INFO  (TEST-HttpPartitionTest.test-seed#[AE9B26581EE7AA43]) [n:127.0.0.1:60147_    ] o.a.s.c.CoreContainer No authentication plugin used.
   [junit4]   2> 574940 INFO  (TEST-HttpPartitionTest.test-seed#[AE9B26581EE7AA43]) [n:127.0.0.1:60147_    ] o.a.s.c.CoresLocator Looking for core definitions underneath /home/jenkins/workspace/Lucene-Solr-trunk-Linux/solr/build/solr-core/test/J0/temp/solr.cloud.HttpPartitionTest_AE9B26581EE7AA43-001/control-001/cores
   [junit4]   2> 574940 INFO  (TEST-HttpPartitionTest.test-seed#[AE9B26581EE7AA43]) [n:127.0.0.1:60147_    ] o.a.s.c.SolrCore Created CoreDescriptor: {name=collection1, config=solrconfig.xml, transient=false, schema=schema.xml, loadOnStartup=true, configSetProperties=configsetprops.json, instanceDir=/home/jenkins/workspace/Lucene-Solr-trunk-Linux/solr/build/solr-core/test/J0/temp/solr.cloud.HttpPartitionTest_AE9B26581EE7AA43-001/control-001/cores/collection1, collection=control_collection, absoluteInstDir=/home/jenkins/workspace/Lucene-Solr-trunk-Linux/solr/build/solr-core/test/J0/temp/solr.cloud.HttpPartitionTest_AE9B26581EE7AA43-001/control-001/cores/collection1/, coreNodeName=, dataDir=data/, shard=}
   [junit4]   2> 574941 INFO  (TEST-HttpPartitionTest.test-seed#[AE9B26581EE7AA43]) [n:127.0.0.1:60147_    ] o.a.s.c.CoresLocator Found core collection1 in /home/jenkins/workspace/Lucene-Solr-trunk-Linux/solr/build/solr-core/test/J0/temp/solr.cloud.HttpPartitionTest_AE9B26581EE7AA43-001/control-001/cores/collection1/
   [junit4]   2> 574941 INFO  (TEST-HttpPartitionTest.test-seed#[AE9B26581EE7AA43]) [n:127.0.0.1:60147_    ] o.a.s.c.CoresLocator Found 1 core definitions
   [junit4]   2> 574941 INFO  (TEST-HttpPartitionTest.test-seed#[AE9B26581EE7AA43]) [n:127.0.0.1:60147_    ] o.a.s.s.SolrDispatchFilter user.dir=/home/jenkins/workspace/Lucene-Solr-trunk-Linux/solr/build/solr-core/test/J0
   [junit4]   2> 574941 INFO  (TEST-HttpPartitionTest.test-seed#[AE9B26581EE7AA43]) [n:127.0.0.1:60147_    ] o.a.s.s.SolrDispatchFilter SolrDispatchFilter.init() done
   [junit4]   2> 574941 INFO  (coreLoadExecutor-1326-thread-1-processing-n:127.0.0.1:60147_) [n:127.0.0.1:60147_ c:control_collection   x:collection1] o.a.s.c.ZkController publishing state=down
   [junit4]   2> 574941 INFO  (coreLoadExecutor-1326-thread-1-processing-n:127.0.0.1:60147_) [n:127.0.0.1:60147_ c:control_collection   x:collection1] o.a.s.c.ZkController numShards not found on descriptor - reading it from system property
   [junit4]   2> 574942 INFO  (OverseerStateUpdate-94729634352594948-127.0.0.1:60147_-n_0000000000) [n:127.0.0.1:60147_    ] o.a.s.c.Overseer processMessage: queueSize: 1, message = {
   [junit4]   2>   "core":"collection1",
   [junit4]   2>   "roles":null,
   [junit4]   2>   "base_url":"http://127.0.0.1:60147",
   [junit4]   2>   "node_name":"127.0.0.1:60147_",
   [junit4]   2>   "numShards":"1",
   [junit4]   2>   "state":"down",
   [junit4]   2>   "shard":null,
   [junit4]   2>   "collection":"control_collection",
   [junit4]   2>   "operation":"state"} current state version: 0
   [junit4]   2> 574942 INFO  (coreLoadExecutor-1326-thread-1-processing-n:127.0.0.1:60147_) [n:127.0.0.1:60147_ c:control_collection   x:collection1] o.a.s.c.ZkController look for our core node name
   [junit4]   2> 574942 INFO  (OverseerStateUpdate-94729634352594948-127.0.0.1:60147_-n_0000000000) [n:127.0.0.1:60147_    ] o.a.s.c.o.ReplicaMutator Update state numShards=1 message={
   [junit4]   2>   "core":"collection1",
   [junit4]   2>   "roles":null,
   [junit4]   2>   "base_url":"http://127.0.0.1:60147",
   [junit4]   2>   "node_name":"127.0.0.1:60147_",
   [junit4]   2>   "numShards":"1",
   [junit4]   2>   "state":"down",
   [junit4]   2>   "shard":null,
   [junit4]   2>   "collection":"control_collection",
   [junit4]   2>   "operation":"state"}
   [junit4]   2> 574942 INFO  (OverseerStateUpdate-94729634352594948-127.0.0.1:60147_-n_0000000000) [n:127.0.0.1:60147_    ] o.a.s.c.o.ClusterStateMutator building a new cName: control_collection
   [junit4]   2> 574942 INFO  (OverseerStateUpdate-94729634352594948-127.0.0.1:60147_-n_0000000000) [n:127.0.0.1:60147_    ] o.a.s.c.o.ReplicaMutator Assigning new node to shard shard=shard1
   [junit4]   2> 574943 INFO  (zkCallback-618-thread-1-processing-n:127.0.0.1:60147_) [n:127.0.0.1:60147_    ] o.a.s.c.c.ZkStateReader A cluster state change: WatchedEvent state:SyncConnected type:NodeDataChanged path:/clusterstate.json, has occurred - updating... (live nodes size: 1)
   [junit4]   2> 575942 INFO  (coreLoadExecutor-1326-thread-1-processing-n:127.0.0.1:60147_) [n:127.0.0.1:60147_ c:control_collection   x:collection1] o.a.s.c.ZkController waiting to find shard id in clusterstate for collection1
   [junit4]   2> 575942 INFO  (coreLoadExecutor-1326-thread-1-processing-n:127.0.0.1:60147_) [n:127.0.0.1:60147_ c:control_collection   x:collection1] o.a.s.c.ZkController Check for collection zkNode:control_collection
   [junit4]   2> 575943 INFO  (coreLoadExecutor-1326-thread-1-processing-n:127.0.0.1:60147_) [n:127.0.0.1:60147_ c:control_collection   x:collection1] o.a.s.c.ZkController Collection zkNode exists
   [junit4]   2> 575943 INFO  (coreLoadExecutor-1326-thread-1-processing-n:127.0.0.1:60147_) [n:127.0.0.1:60147_ c:control_collection   x:collection1] o.a.s.c.c.ZkStateReader Load collection config from:/collections/control_collection
   [junit4]   2> 575943 INFO  (coreLoadExecutor-1326-thread-1-processing-n:127.0.0.1:60147_) [n:127.0.0.1:60147_ c:control_collection   x:collection1] o.a.s.c.c.ZkStateReader path=/collections/control_collection configName=conf1 specified config exists in ZooKeeper
   [junit4]   2> 575943 INFO  (coreLoadExecutor-1326-thread-1-processing-n:127.0.0.1:60147_) [n:127.0.0.1:60147_ c:control_collection   x:collection1] o.a.s.c.SolrResourceLoader new SolrResourceLoader for directory: '/home/jenkins/workspace/Lucene-Solr-trunk-Linux/solr/build/solr-core/test/J0/temp/solr.cloud.HttpPartitionTest_AE9B26581EE7AA43-001/control-001/cores/collection1/'
   [junit4]   2> 575943 INFO  (coreLoadExecutor-1326-thread-1-processing-n:127.0.0.1:60147_) [n:127.0.0.1:60147_ c:control_collection   x:collection1] o.a.s.c.SolrResourceLoader JNDI not configured for solr (NoInitialContextEx)
   [junit4]   2> 575943 INFO  (coreLoadExecutor-1326-thread-1-processing-n:127.0.0.1:60147_) [n:127.0.0.1:60147_ c:control_collection   x:collection1] o.a.s.c.SolrResourceLoader solr home defaulted to 'solr/' (could not find system property or JNDI)
   [junit4]   2> 575950 INFO  (coreLoadExecutor-1326-thread-1-processing-n:127.0.0.1:60147_) [n:127.0.0.1:60147_ c:control_collection   x:collection1] o.a.s.c.Config loaded config solrconfig.xml with version 0 
   [junit4]   2> 575953 INFO  (coreLoadExecutor-1326-thread-1-processing-n:127.0.0.1:60147_) [n:127.0.0.1:60147_ c:control_collection   x:collection1] o.a.s.c.SolrConfig current version of requestparams : -1
   [junit4]   2> 575955 INFO  (coreLoadExecutor-1326-thread-1-processing-n:127.0.0.1:60147_) [n:127.0.0.1:60147_ c:control_collection   x:collection1] o.a.s.c.SolrConfig Using Lucene MatchVersion: 6.0.0
   [junit4]   2> 575964 INFO  (coreLoadExecutor-1326-thread-1-processing-n:127.0.0.1:60147_) [n:127.0.0.1:60147_ c:control_collection   x:collection1] o.a.s.c.Config Loaded SolrConfig: solrconfig.xml
   [junit4]   2> 575964 INFO  (coreLoadExecutor-1326-thread-1-processing-n:127.0.0.1:60147_) [n:127.0.0.1:60147_ c:control_collection   x:collection1] o.a.s.s.IndexSchema Reading Solr Schema from /configs/conf1/schema.xml
   [junit4]   2> 575967 INFO  (coreLoadExecutor-1326-thread-1-processing-n:127.0.0.1:60147_) [n:127.0.0.1:60147_ c:control_collection   x:collection1] o.a.s.s.IndexSchema [collection1] Schema name=test
   [junit4]   2> 576014 INFO  (coreLoadExecutor-1326-thread-1-processing-n:127.0.0.1:60147_) [n:127.0.0.1:60147_ c:control_collection   x:collection1] o.a.s.s.OpenExchangeRatesOrgProvider Initialized with rates=open-exchange-rates.json, refreshInterval=1440.
   [junit4]   2> 576018 INFO  (coreLoadExecutor-1326-thread-1-processing-n:127.0.0.1:60147_) [n:127.0.0.1:60147_ c:control_collection   x:collection1] o.a.s.s.IndexSchema default search field in schema is text
   [junit4]   2> 576018 INFO  (coreLoadExecutor-1326-thread-1-processing-n:127.0.0.1:60147_) [n:127.0.0.1:60147_ c:control_collection   x:collection1] o.a.s.s.IndexSchema unique key field: id
   [junit4]   2> 576022 INFO  (coreLoadExecutor-1326-thread-1-processing-n:127.0.0.1:60147_) [n:127.0.0.1:60147_ c:control_collection   x:collection1] o.a.s.s.FileExchangeRateProvider Reloading exchange rates from file currency.xml
   [junit4]   2> 576023 INFO  (coreLoadExecutor-1326-thread-1-processing-n:127.0.0.1:60147_) [n:127.0.0.1:60147_ c:control_collection   x:collection1] o.a.s.s.FileExchangeRateProvider Reloading exchange rates from file currency.xml
   [junit4]   2> 576024 INFO  (coreLoadExecutor-1326-thread-1-processing-n:127.0.0.1:60147_) [n:127.0.0.1:60147_ c:control_collection   x:collection1] o.a.s.s.OpenExchangeRatesOrgProvider Reloading exchange rates from open-exchange-rates.json
   [junit4]   2> 576024 WARN  (coreLoadExecutor-1326-thread-1-processing-n:127.0.0.1:60147_) [n:127.0.0.1:60147_ c:control_collection   x:collection1] o.a.s.s.OpenExchangeRatesOrgProvider Unknown key IMPORTANT NOTE
   [junit4]   2> 576025 WARN  (coreLoadExecutor-1326-thread-1-processing-n:127.0.0.1:60147_) [n:127.0.0.1:60147_ c:control_collection   x:collection1] o.a.s.s.OpenExchangeRatesOrgProvider Expected key, got STRING
   [junit4]   2> 576025 INFO  (coreLoadExecutor-1326-thread-1-processing-n:127.0.0.1:60147_) [n:127.0.0.1:60147_ c:control_collection   x:collection1] o.a.s.s.OpenExchangeRatesOrgProvider Reloading exchange rates from open-exchange-rates.json
   [junit4]   2> 576025 WARN  (coreLoadExecutor-1326-thread-1-processing-n:127.0.0.1:60147_) [n:127.0.0.1:60147_ c:control_collection   x:collection1] o.a.s.s.OpenExchangeRatesOrgProvider Unknown key IMPORTANT NOTE
   [junit4]   2> 576025 WARN  (coreLoadExecutor-1326-thread-1-processing-n:127.0.0.1:60147_) [n:127.0.0.1:60147_ c:control_collection   x:collection1] o.a.s.s.OpenExchangeRatesOrgProvider Expected key, got STRING
   [junit4]   2> 576025 INFO  (coreLoadExecutor-1326-thread-1-processing-n:127.0.0.1:60147_) [n:127.0.0.1:60147_ c:control_collection   x:collection1] o.a.s.c.ConfigSetProperties Did not find ConfigSet properties, assuming default properties: Can't find resource 'configsetprops.json' in classpath or '/configs/conf1', cwd=/home/jenkins/workspace/Lucene-Solr-trunk-Linux/solr/build/solr-core/test/J0
   [junit4]   2> 576026 INFO  (coreLoadExecutor-1326-thread-1-processing-n:127.0.0.1:60147_) [n:127.0.0.1:60147_ c:control_collection   x:collection1] o.a.s.c.CoreContainer Creating SolrCore 'collection1' using configuration from collection control_collection
   [junit4]   2> 576026 INFO  (coreLoadExecutor-1326-thread-1-processing-n:127.0.0.1:60147_) [n:127.0.0.1:60147_ c:control_collection s:shard1 r:core_node1 x:collection1] o.a.s.c.SolrCore org.apache.solr.core.MockDirectoryFactory
   [junit4]   2> 576026 INFO  (coreLoadExecutor-1326-thread-1-processing-n:127.0.0.1:60147_) [n:127.0.0.1:60147_ c:control_collection s:shard1 r:core_node1 x:collection1] o.a.s.c.SolrCore [[collection1] ] Opening new SolrCore at [/home/jenkins/workspace/Lucene-Solr-trunk-Linux/solr/build/solr-core/test/J0/temp/solr.cloud.HttpPartitionTest_AE9B26581EE7AA43-001/control-001/cores/collection1/], dataDir=[null]
   [junit4]   2> 576026 INFO  (coreLoadExecutor-1326-thread-1-processing-n:127.0.0.1:60147_) [n:127.0.0.1:60147_ c:control_collection s:shard1 r:core_node1 x:collection1] o.a.s.c.JmxMonitoredMap JMX monitoring is enabled. Adding Solr mbeans to JMX Server: com.sun.jmx.mbeanserver.JmxMBeanServer@5d18c2
   [junit4]   2> 576026 INFO  (coreLoadExecutor-1326-thread-1-processing-n:127.0.0.1:60147_) [n:127.0.0.1:60147_ c:control_collection s:shard1 r:core_node1 x:collection1] o.a.s.c.CachingDirectoryFactory return new directory for /home/jenkins/workspace/Lucene-Solr-trunk-Linux/solr/build/solr-core/test/J0/temp/solr.cloud.HttpPartitionTest_AE9B26581EE7AA43-001/control-001/cores/collection1/data
   [junit4]   2> 576026 INFO  (coreLoadExecutor-1326-thread-1-processing-n:127.0.0.1:60147_) [n:127.0.0.1:60147_ c:control_collection s:shard1 r:core_node1 x:collection1] o.a.s.c.SolrCore New index directory detected: old=null new=/home/jenkins/workspace/Lucene-Solr-trunk-Linux/solr/build/solr-core/test/J0/temp/solr.cloud.HttpPartitionTest_AE9B26581EE7AA43-001/control-001/cores/collection1/data/index/
   [junit4]   2> 576026 WARN  (coreLoadExecutor-1326-thread-1-processing-n:127.0.0.1:60147_) [n:127.0.0.1:60147_ c:control_collection s:shard1 r:core_node1 x:collection1] o.a.s.c.SolrCore [collection1] Solr index directory '/home/jenkins/workspace/Lucene-Solr-trunk-Linux/solr/build/solr-core/test/J0/temp/solr.cloud.HttpPartitionTest_AE9B26581EE7AA43-001/control-001/cores/collection1/data/index' doesn't exist. Creating new index...
   [junit4]   2> 576027 INFO  (coreLoadExecutor-1326-thread-1-processing-n:127.0.0.1:60147_) [n:127.0.0.1:60147_ c:control_collection s:shard1 r:core_node1 x:collection1] o.a.s.c.CachingDirectoryFactory return new directory for /home/jenkins/workspace/Lucene-Solr-trunk-Linux/solr/build/solr-core/test/J0/temp/solr.cloud.HttpPartitionTest_AE9B26581EE7AA43-001/control-001/cores/collection1/data/index
   [junit4]   2> 576027 INFO  (coreLoadExecutor-1326-thread-1-processing-n:127.0.0.1:60147_) [n:127.0.0.1:60147_ c:control_collection s:shard1 r:core_node1 x:collection1] o.a.s.u.RandomMergePolicy RandomMergePolicy wrapping class org.apache.lucene.index.TieredMergePolicy: [TieredMergePolicy: maxMergeAtOnce=6, maxMergeAtOnceExplicit=4, maxMergedSegmentMB=30.1787109375, floorSegmentMB=1.98828125, forceMergeDeletesPctAllowed=7.253812654397162, segmentsPerTier=19.0, maxCFSSegmentSizeMB=8.796093022207999E12, noCFSRatio=1.0
   [junit4]   2> 576028 INFO  (coreLoadExecutor-1326-thread-1-processing-n:127.0.0.1:60147_) [n:127.0.0.1:60147_ c:control_collection s:shard1 r:core_node1 x:collection1] o.a.s.c.SolrCore SolrDeletionPolicy.onCommit: commits: num=1
   [junit4]   2> 	commit{dir=MockDirectoryWrapper(NRTCachingDirectory(RAMDirectory@1949e05 lockFactory=org.apache.lucene.store.SingleInstanceLockFactory@1adfab4; maxCacheMB=0.8544921875 maxMergeSizeMB=0.04296875)),segFN=segments_1,generation=1}
   [junit4]   2> 576028 INFO  (coreLoadExecutor-1326-thread-1-processing-n:127.0.0.1:60147_) [n:127.0.0.1:60147_ c:control_collection s:shard1 r:core_node1 x:collection1] o.a.s.c.SolrCore newest commit generation = 1
   [junit4]   2> 576028 INFO  (OldIndexDirectoryCleanupThreadForCore-collection1) [n:127.0.0.1:60147_ c:control_collection s:shard1 r:core_node1 x:collection1] o.a.s.c.SolrCore Looking for old index directories to cleanup for core collection1 in /home/jenkins/workspace/Lucene-Solr-trunk-Linux/solr/build/solr-core/test/J0/temp/solr.cloud.HttpPartitionTest_AE9B26581EE7AA43-001/control-001/cores/collection1/data/
   [junit4]   2> 576028 WARN  (OldIndexDirectoryCleanupThreadForCore-collection1) [n:127.0.0.1:60147_ c:control_collection s:shard1 r:core_node1 x:collection1] o.a.s.c.DirectoryFactory /home/jenkins/workspace/Lucene-Solr-trunk-Linux/solr/build/solr-core/test/J0/temp/solr.cloud.HttpPartitionTest_AE9B26581EE7AA43-001/control-001/cores/collection1/data/ does not point to a valid data directory; skipping clean-up of old index directories.
   [junit4]   2> 576030 INFO  (coreLoadExecutor-1326-thread-1-processing-n:127.0.0.1:60147_) [n:127.0.0.1:60147_ c:control_collection s:shard1 r:core_node1 x:collection1] o.a.s.u.p.UpdateRequestProcessorChain creating updateRequestProcessorChain "nodistrib"
   [junit4]   2> 576030 INFO  (coreLoadExecutor-1326-thread-1-processing-n:127.0.0.1:60147_) [n:127.0.0.1:60147_ c:control_collection s:shard1 r:core_node1 x:collection1] o.a.s.u.p.UpdateRequestProcessorChain creating updateRequestProcessorChain "dedupe"
   [junit4]   2> 576030 INFO  (coreLoadExecutor-1326-thread-1-processing-n:127.0.0.1:60147_) [n:127.0.0.1:60147_ c:control_collection s:shard1 r:core_node1 x:collection1] o.a.s.u.p.UpdateRequestProcessorChain inserting DistributedUpdateProcessorFactory into updateRequestProcessorChain "dedupe"
   [junit4]   2> 576030 INFO  (coreLoadExecutor-1326-thread-1-processing-n:127.0.0.1:60147_) [n:127.0.0.1:60147_ c:control_collection s:shard1 r:core_node1 x:collection1] o.a.s.u.p.UpdateRequestProcessorChain creating updateRequestProcessorChain "stored_sig"
   [junit4]   2> 576030 INFO  (coreLoadExecutor-1326-thread-1-processing-n:127.0.0.1:60147_) [n:127.0.0.1:60147_ c:control_collection s:shard1 r:core_node1 x:collection1] o.a.s.u.p.UpdateRequestProcessorChain inserting DistributedUpdateProcessorFactory into updateRequestProcessorChain "stored_sig"
   [junit4]   2> 576030 INFO  (coreLoadExecutor-1326-thread-1-processing-n:127.0.0.1:60147_) [n:127.0.0.1:60147_ c:control_collection s:shard1 r:core_node1 x:collection1] o.a.s.u.p.UpdateRequestProcessorChain creating updateRequestProcessorChain "distrib-dup-test-chain-explicit"
   [junit4]   2> 576030 INFO  (coreLoadExecutor-1326-thread-1-processing-n:127.0.0.1:60147_) [n:127.0.0.1:60147_ c:control_collection s:shard1 r:core_node1 x:collection1] o.a.s.u.p.UpdateRequestProcessorChain creating updateRequestProcessorChain "distrib-dup-test-chain-implicit"
   [junit4]   2> 576030 INFO  (coreLoadExecutor-1326-thread-1-processing-n:127.0.0.1:60147_) [n:127.0.0.1:60147_ c:control_collection s:shard1 r:core_node1 x:collection1] o.a.s.u.p.UpdateRequestProcessorChain inserting DistributedUpdateProcessorFactory into updateRequestProcessorChain "distrib-dup-test-chain-implicit"
   [junit4]   2> 576030 INFO  (coreLoadExecutor-1326-thread-1-processing-n:127.0.0.1:60147_) [n:127.0.0.1:60147_ c:control_collection s:shard1 r:core_node1 x:collection1] o.a.s.c.SolrCore no updateRequestProcessorChain defined as default, creating implicit default
   [junit4]   2> 576032 INFO  (coreLoadExecutor-1326-thread-1-processing-n:127.0.0.1:60147_) [n:127.0.0.1:60147_ c:control_collection s:shard1 r:core_node1 x:collection1] o.a.s.h.l.XMLLoader xsltCacheLifetimeSeconds=60
   [junit4]   2> 576033 INFO  (coreLoadExecutor-1326-thread-1-processing-n:127.0.0.1:60147_) [n:127.0.0.1:60147_ c:control_collection s:shard1 r:core_node1 x:collection1] o.a.s.h.l.XMLLoader xsltCacheLifetimeSeconds=60
   [junit4]   2> 576033 INFO  (coreLoadExecutor-1326-thread-1-processing-n:127.0.0.1:60147_) [n:127.0.0.1:60147_ c:control_collection s:shard1 r:core_node1 x:collection1] o.a.s.h.l.XMLLoader xsltCacheLifetimeSeconds=60
   [junit4]   2> 576033 INFO  (coreLoadExecutor-1326-thread-1-processing-n:127.0.0.1:60147_) [n:127.0.0.1:60147_ c:control_collection s:shard1 r:core_node1 x:collection1] o.a.s.h.l.XMLLoader xsltCacheLifetimeSeconds=60
   [junit4]   2> 576035 INFO  (coreLoadExecutor-1326-thread-1-processing-n:127.0.0.1:60147_) [n:127.0.0.1:60147_ c:control_collection s:shard1 r:core_node1 x:collection1] o.a.s.c.RequestHandlers Registered paths: /admin/mbeans,standard,/update/csv,/update/json/docs,/admin/luke,/admin/segments,/get,/admin/system,/replication,/admin/properties,/config,/schema,/admin/plugins,/admin/logging,/update/json,/admin/threads,/admin/ping,/update,/admin/file
   [junit4]   2> 576035 INFO  (coreLoadExecutor-1326-thread-1-processing-n:127.0.0.1:60147_) [n:127.0.0.1:60147_ c:control_collection s:shard1 r:core_node1 x:collection1] o.a.s.c.SolrCore Using default statsCache cache: org.apache.solr.search.stats.LocalStatsCache
   [junit4]   2> 576035 INFO  (coreLoadExecutor-1326-thread-1-processing-n:127.0.0.1:60147_) [n:127.0.0.1:60147_ c:control_collection s:shard1 r:core_node1 x:collection1] o.a.s.u.UpdateHandler Using UpdateLog implementation: org.apache.solr.update.UpdateLog
   [junit4]   2> 576035 INFO  (coreLoadExecutor-1326-thread-1-processing-n:127.0.0.1:60147_) [n:127.0.0.1:60147_ c:control_collection s:shard1 r:core_node1 x:collection1] o.a.s.u.UpdateLog Initializing UpdateLog: dataDir= defaultSyncLevel=FLUSH numRecordsToKeep=100 maxNumLogsToKeep=10 numVersionBuckets=65536
   [junit4]   2> 576036 INFO  (coreLoadExecutor-1326-thread-1-processing-n:127.0.0.1:60147_) [n:127.0.0.1:60147_ c:control_collection s:shard1 r:core_node1 x:collection1] o.a.s.c.SolrCore Hard AutoCommit: disabled
   [junit4]   2> 576036 INFO  (coreLoadExecutor-1326-thread-1-processing-n:127.0.0.1:60147_) [n:127.0.0.1:60147_ c:control_collection s:shard1 r:core_node1 x:collection1] o.a.s.c.SolrCore Soft AutoCommit: disabled
   [junit4]   2> 576036 INFO  (coreLoadExecutor-1326-thread-1-processing-n:127.0.0.1:60147_) [n:127.0.0.1:60147_ c:control_collection s:shard1 r:core_node1 x:collection1] o.a.s.u.RandomMergePolicy RandomMergePolicy wrapping class org.apache.lucene.index.LogDocMergePolicy: [LogDocMergePolicy: minMergeSize=1000, mergeFactor=14, maxMergeSize=9223372036854775807, maxMergeSizeForForcedMerge=9223372036854775807, calibrateSizeByDeletes=false, maxMergeDocs=2147483647, maxCFSSegmentSizeMB=8.796093022207999E12, noCFSRatio=0.0]
   [junit4]   2> 576036 INFO  (coreLoadExecutor-1326-thread-1-processing-n:127.0.0.1:60147_) [n:127.0.0.1:60147_ c:control_collection s:shard1 r:core_node1 x:collection1] o.a.s.c.SolrCore SolrDeletionPolicy.onInit: commits: num=1
   [junit4]   2> 	commit{dir=MockDirectoryWrapper(NRTCachingDirectory(RAMDirectory@1949e05 lockFactory=org.apache.lucene.store.SingleInstanceLockFactory@1adfab4; maxCacheMB=0.8544921875 maxMergeSizeMB=0.04296875)),segFN=segments_1,generation=1}
   [junit4]   2> 576036 INFO  (coreLoadExecutor-1326-thread-1-processing-n:127.0.0.1:60147_) [n:127.0.0.1:60147_ c:control_collection s:shard1 r:core_node1 x:collection1] o.a.s.c.SolrCore newest commit generation = 1
   [junit4]   2> 576036 INFO  (coreLoadExecutor-1326-thread-1-processing-n:127.0.0.1:60147_) [n:127.0.0.1:60147_ c:control_collection s:shard1 r:core_node1 x:collection1] o.a.s.s.SolrIndexSearcher Opening Searcher@425cf[collection1] main
   [junit4]   2> 576036 INFO  (coreLoadExecutor-1326-thread-1-processing-n:127.0.0.1:60147_) [n:127.0.0.1:60147_ c:control_collection s:shard1 r:core_node1 x:collection1] o.a.s.c.c.ZkStateReader Load collection config from:/collections/control_collection
   [junit4]   2> 576037 INFO  (coreLoadExecutor-1326-thread-1-processing-n:127.0.0.1:60147_) [n:127.0.0.1:60147_ c:control_collection s:shard1 r:core_node1 x:collection1] o.a.s.c.c.ZkStateReader path=/collections/control_collection configName=conf1 specified config exists in ZooKeeper
   [junit4]   2> 576037 INFO  (coreLoadExecutor-1326-thread-1-processing-n:127.0.0.1:60147_) [n:127.0.0.1:60147_ c:control_collection s:shard1 r:core_node1 x:collection1] o.a.s.r.ManagedResourceStorage Setting up ZooKeeper-based storage for the RestManager with znodeBase: /configs/conf1
   [junit4]   2> 576037 INFO  (coreLoadExecutor-1326-thread-1-processing-n:127.0.0.1:60147_) [n:127.0.0.1:60147_ c:control_collection s:shard1 r:core_node1 x:collection1] o.a.s.r.ManagedResourceStorage Configured ZooKeeperStorageIO with znodeBase: /configs/conf1
   [junit4]   2> 576037 INFO  (coreLoadExecutor-1326-thread-1-processing-n:127.0.0.1:60147_) [n:127.0.0.1:60147_ c:control_collection s:shard1 r:core_node1 x:collection1] o.a.s.r.RestManager Initializing RestManager with initArgs: {}
   [junit4]   2> 576037 INFO  (coreLoadExecutor-1326-thread-1-processing-n:127.0.0.1:60147_) [n:127.0.0.1:60147_ c:control_collection s:shard1 r:core_node1 x:collection1] o.a.s.r.ManagedResourceStorage Reading _rest_managed.json using ZooKeeperStorageIO:path=/configs/conf1
   [junit4]   2> 576037 INFO  (coreLoadExecutor-1326-thread-1-processing-n:127.0.0.1:60147_) [n:127.0.0.1:60147_ c:control_collection s:shard1 r:core_node1 x:collection1] o.a.s.r.ManagedResourceStorage No data found for znode /configs/conf1/_rest_managed.json
   [junit4]   2> 576037 INFO  (coreLoadExecutor-1326-thread-1-processing-n:127.0.0.1:60147_) [n:127.0.0.1:60147_ c:control_collection s:shard1 r:core_node1 x:collection1] o.a.s.r.ManagedResourceStorage Loaded null at path _rest_managed.json using ZooKeeperStorageIO:path=/configs/conf1
   [junit4]   2> 576037 INFO  (coreLoadExecutor-1326-thread-1-processing-n:127.0.0.1:60147_) [n:127.0.0.1:60147_ c:control_collection s:shard1 r:core_node1 x:collection1] o.a.s.r.RestManager Initializing 0 registered ManagedResources
   [junit4]   2> 576037 INFO  (coreLoadExecutor-1326-thread-1-processing-n:127.0.0.1:60147_) [n:127.0.0.1:60147_ c:control_collection s:shard1 r:core_node1 x:collection1] o.a.s.h.ReplicationHandler Commits will be reserved for  10000
   [junit4]   2> 576038 INFO  (searcherExecutor-1327-thread-1-processing-n:127.0.0.1:60147_ x:collection1 s:shard1 c:control_collection r:core_node1) [n:127.0.0.1:60147_ c:control_collection s:shard1 r:core_node1 x:collection1] o.a.s.c.SolrCore [collection1] Registered new searcher Searcher@425cf[collection1] main{ExitableDirectoryReader(UninvertingDirectoryReader())}
   [junit4]   2> 576038 INFO  (coreLoadExecutor-1326-thread-1-processing-n:127.0.0.1:60147_) [n:127.0.0.1:60147_ c:control_collection s:shard1 r:core_node1 x:collection1] o.a.s.u.UpdateLog Looking up max value of version field to seed version buckets
   [junit4]   2> 576038 INFO  (coreLoadExecutor-1326-thread-1-processing-n:127.0.0.1:60147_) [n:127.0.0.1:60147_ c:control_collection s:shard1 r:core_node1 x:collection1] o.a.s.u.VersionInfo Refreshing highest value of _version_ for 65536 version buckets from index
   [junit4]   2> 576038 INFO  (coreLoadExecutor-1326-thread-1-processing-n:127.0.0.1:60147_) [n:127.0.0.1:60147_ c:control_collection s:shard1 r:core_node1 x:collection1] o.a.s.u.VersionInfo No terms found for _version_, cannot seed version bucket highest value from index
   [junit4]   2> 576038 INFO  (coreLoadExecutor-1326-thread-1-processing-n:127.0.0.1:60147_) [n:127.0.0.1:60147_ c:control_collection s:shard1 r:core_node1 x:collection1] o.a.s.u.UpdateLog Could not find max version in index or recent updates, using new clock 1515674151021445120
   [junit4]   2> 576039 INFO  (coreLoadExecutor-1326-thread-1-processing-n:127.0.0.1:60147_) [n:127.0.0.1:60147_ c:control_collection s:shard1 r:core_node1 x:collection1] o.a.s.u.UpdateLog Took 1.0ms to seed version buckets with highest version 1515674151021445120
   [junit4]   2> 576039 INFO  (coreLoadExecutor-1326-thread-1-processing-n:127.0.0.1:60147_) [n:127.0.0.1:60147_ c:control_collection s:shard1 r:core_node1 x:collection1] o.a.s.c.ZkController watch zkdir /configs/conf1
   [junit4]   2> 576040 INFO  (coreLoadExecutor-1326-thread-1-processing-n:127.0.0.1:60147_) [n:127.0.0.1:60147_ c:control_collection s:shard1 r:core_node1 x:collection1] o.a.s.c.CoreContainer registering core: collection1
   [junit4]   2> 576040 INFO  (coreZkRegister-1320-thread-1-processing-n:127.0.0.1:60147_ x:collection1 s:shard1 c:control_collection r:core_node1) [n:127.0.0.1:60147_ c:control_collection s:shard1 r:core_node1 x:collection1] o.a.s.c.ZkController Register replica - core:collection1 address:http://127.0.0.1:60147 collection:control_collection shard:shard1
   [junit4]   2> 576040 INFO  (coreZkRegister-1320-thread-1-processing-n:127.0.0.1:60147_ x:collection1 s:shard1 c:control_collection r:core_node1) [n:127.0.0.1:60147_ c:control_collection s:shard1 r:core_node1 x:collection1] o.a.s.c.c.SolrZkClient makePath: /collections/control_collection/leader_elect/shard1/election
   [junit4]   2> 576041 INFO  (coreZkRegister-1320-thread-1-processing-n:127.0.0.1:60147_ x:collection1 s:shard1 c:control_collection r:core_node1) [n:127.0.0.1:60147_ c:control_collection s:shard1 r:core_node1 x:collection1] o.a.s.c.LeaderElector Joined leadership election with path: /collections/control_collection/leader_elect/shard1/election/94729634352594948-core_node1-n_0000000000
   [junit4]   2> 576041 INFO  (coreZkRegister-1320-thread-1-processing-n:127.0.0.1:60147_ x:collection1 s:shard1 c:control_collection r:core_node1) [n:127.0.0.1:60147_ c:control_collection s:shard1 r:core_node1 x:collection1] o.a.s.c.ShardLeaderElectionContext Running the leader process for shard shard1
   [junit4]   2> 576042 INFO  (coreZkRegister-1320-thread-1-processing-n:127.0.0.1:60147_ x:collection1 s:shard1 c:control_collection r:core_node1) [n:127.0.0.1:60147_ c:control_collection s:shard1 r:core_node1 x:collection1] o.a.s.c.ShardLeaderElectionContext Enough replicas found to continue.
   [junit4]   2> 576042 INFO  (coreZkRegister-1320-thread-1-processing-n:127.0.0.1:60147_ x:collection1 s:shard1 c:control_collection r:core_node1) [n:127.0.0.1:60147_ c:control_collection s:shard1 r:core_node1 x:collection1] o.a.s.c.ShardLeaderElectionContext I may be the new leader - try and sync
   [junit4]   2> 576042 INFO  (coreZkRegister-1320-thread-1-processing-n:127.0.0.1:60147_ x:collection1 s:shard1 c:control_collection r:core_node1) [n:127.0.0.1:60147_ c:control_collection s:shard1 r:core_node1 x:collection1] o.a.s.c.SyncStrategy Sync replicas to http://127.0.0.1:60147/collection1/
   [junit4]   2> 576042 INFO  (coreZkRegister-1320-thread-1-processing-n:127.0.0.1:60147_ x:collection1 s:shard1 c:control_collection r:core_node1) [n:127.0.0.1:60147_ c:control_collection s:shard1 r:core_node1 x:collection1] o.a.s.c.SyncStrategy Sync Success - now sync replicas to me
   [junit4]   2> 576042 INFO  (coreZkRegister-1320-thread-1-processing-n:127.0.0.1:60147_ x:collection1 s:shard1 c:control_collection r:core_node1) [n:127.0.0.1:60147_ c:control_collection s:shard1 r:core_node1 x:collection1] o.a.s.c.SyncStrategy http://127.0.0.1:60147/collection1/ has no replicas
   [junit4]   2> 576042 INFO  (OverseerStateUpdate-94729634352594948-127.0.0.1:60147_-n_0000000000) [n:127.0.0.1:60147_    ] o.a.s.c.Overseer processMessage: queueSize: 1, message = {
   [junit4]   2>   "operation":"leader",
   [junit4]   2>   "shard":"shard1",
   [junit4]   2>   "collection":"control_collection"} current state version: 1
   [junit4]   2> 576042 INFO  (coreZkRegister-1320-thread-1-processing-n:127.0.0.1:60147_ x:collection1 s:shard1 c:control_collection r:core_node1) [n:127.0.0.1:60147_ c:control_collection s:shard1 r:core_node1 x:collection1] o.a.s.c.ShardLeaderElectionContext I am the new leader: http://127.0.0.1:60147/collection1/ shard1
   [junit4]   2> 576042 INFO  (coreZkRegister-1320-thread-1-processing-n:127.0.0.1:60147_ x:collection1 s:shard1 c:control_collection r:core_node1) [n:127.0.0.1:60147_ c:control_collection s:shard1 r:core_node1 x:collection1] o.a.s.c.c.SolrZkClient makePath: /collections/control_collection/leaders/shard1
   [junit4]   2> 576044 INFO  (coreZkRegister-1320-thread-1-processing-n:127.0.0.1:60147_ x:collection1 s:shard1 c:control_collection r:core_node1) [n:127.0.0.1:60147_ c:control_collection s:shard1 r:core_node1 x:collection1] o.a.s.c.ShardLeaderElectionContextBase Creating leader registration node
   [junit4]   2> 576044 INFO  (OverseerStateUpdate-94729634352594948-127.0.0.1:60147_-n_0000000000) [n:127.0.0.1:60147_    ] o.a.s.c.Overseer processMessage: queueSize: 1, message = {
   [junit4]   2>   "operation":"leader",
   [junit4]   2>   "shard":"shard1",
   [junit4]   2>   "collection":"control_collection",
   [junit4]   2>   "base_url":"http://127.0.0.1:60147",
   [junit4]   2>   "core":"collection1",
   [junit4]   2>   "state":"active"} current state version: 1
   [junit4]   2> 576145 INFO  (zkCallback-618-thread-1-processing-n:127.0.0.1:60147_) [n:127.0.0.1:60147_    ] o.a.s.c.c.ZkStateReader A cluster state change: WatchedEvent state:SyncConnected type:NodeDataChanged path:/clusterstate.json, has occurred - updating... (live nodes size: 1)
   [junit4]   2> 576195 INFO  (coreZkRegister-1320-thread-1-processing-n:127.0.0.1:60147_ x:collection1 s:shard1 c:control_collection r:core_node1) [n:127.0.0.1:60147_ c:control_collection s:shard1 r:core_node1 x:collection1] o.a.s.c.ZkController We are http://127.0.0.1:60147/collection1/ and leader is http://127.0.0.1:60147/collection1/
   [junit4]   2> 576195 INFO  (coreZkRegister-1320-thread-1-processing-n:127.0.0.1:60147_ x:collection1 s:shard1 c:control_collection r:core_node1) [n:127.0.0.1:60147_ c:control_collection s:shard1 r:core_node1 x:collection1] o.a.s.c.ZkController No LogReplay needed for core=collection1 baseURL=http://127.0.0.1:60147
   [junit4]   2> 576195 INFO  (coreZkRegister-1320-thread-1-processing-n:127.0.0.1:60147_ x:collection1 s:shard1 c:control_collection r:core_node1) [n:127.0.0.1:60147_ c:control_collection s:shard1 r:core_node1 x:collection1] o.a.s.c.ZkController I am the leader, no recovery necessary
   [junit4]   2> 576195 INFO  (coreZkRegister-1320-thread-1-processing-n:127.0.0.1:60147_ x:collection1 s:shard1 c:control_collection r:core_node1) [n:127.0.0.1:60147_ c:control_collection s:shard1 r:core_node1 x:collection1] o.a.s.c.ZkController publishing state=active
   [junit4]   2> 576195 INFO  (coreZkRegister-1320-thread-1-processing-n:127.0.0.1:60147_ x:collection1 s:shard1 c:control_collection r:core_node1) [n:127.0.0.1:60147_ c:control_collection s:shard1 r:core_node1 x:collection1] o.a.s.c.ZkController numShards not found on descriptor - reading it from system property
   [junit4]   2> 576196 INFO  (OverseerStateUpdate-94729634352594948-127.0.0.1:60147_-n_0000000000) [n:127.0.0.1:60147_    ] o.a.s.c.Overseer processMessage: queueSize: 1, message = {
   [junit4]   2>   "core":"collection1",
   [junit4]   2>   "core_node_name":"core_node1",
   [junit4]   2>   "roles":null,
   [junit4]   2>   "base_url":"http://127.0.0.1:60147",
   [junit4]   2>   "node_name":"127.0.0.1:60147_",
   [junit4]   2>   "numShards":"1",
   [junit4]   2>   "state":"active",
   [junit4]   2>   "shard":"shard1",
   [junit4]   2>   "collection":"control_collection",
   [junit4]   2>   "operation":"state"} current state version: 2
   [junit4]   2> 576196 INFO  (OverseerStateUpdate-94729634352594948-127.0.0.1:60147_-n_0000000000) [n:127.0.0.1:60147_    ] o.a.s.c.o.ReplicaMutator Update state numShards=1 message={
   [junit4]   2>   "core":"collection1",
   [junit4]   2>   "core_node_name":"core_node1",
   [junit4]   2>   "roles":null,
   [junit4]   2>   "base_url":"http://127.0.0.1:60147",
   [junit4]   2>   "node_name":"127.0.0.1:60147_",
   [junit4]   2>   "numShards":"1",
   [junit4]   2>   "state":"active",
   [junit4]   2>   "shard":"shard1",
   [junit4]   2>   "collection":"control_collection",
   [junit4]   2>   "operation":"state"}
   [junit4]   2> 576297 INFO  (zkCallback-618-thread-1-processing-n:127.0.0.1:60147_) [n:127.0.0.1:60147_    ] o.a.s.c.c.ZkStateReader A cluster state change: WatchedEvent state:SyncConnected type:NodeDataChanged path:/clusterstate.json, has occurred - updating... (live nodes size: 1)
   [junit4]   2> 576444 INFO  (TEST-HttpPartitionTest.test-seed#[AE9B26581EE7AA43]) [    ] o.a.s.c.c.SolrZkClient Using default ZkCredentialsProvider
   [junit4]   2> 576444 INFO  (TEST-HttpPartitionTest.test-seed#[AE9B26581EE7AA43]) [    ] o.a.s.c.c.ConnectionManager Waiting for client to connect to ZooKeeper
   [junit4]   2> 576445 INFO  (zkCallback-620-thread-1) [    ] o.a.s.c.c.ConnectionManager Watcher org.apache.solr.common.cloud.ConnectionManager@a8ed4d name:ZooKeeperConnection Watcher:127.0.0.1:43634/solr got event WatchedEvent state:SyncConnected type:None path:null path:null type:None
   [junit4]   2> 576445 INFO  (TEST-HttpPartitionTest.test-seed#[AE9B26581EE7AA43]) [    ] o.a.s.c.c.ConnectionManager Client is connected to ZooKeeper
   [junit4]   2> 576445 INFO  (TEST-HttpPartitionTest.test-seed#[AE9B26581EE7AA43]) [    ] o.a.s.c.c.SolrZkClient Using default ZkACLProvider
   [junit4]   2> 576445 INFO  (TEST-HttpPartitionTest.test-seed#[AE9B26581EE7AA43]) [    ] o.a.s.c.c.ZkStateReader Updating cluster state from ZooKeeper... 
   [junit4]   2> 576446 INFO  (TEST-HttpPartitionTest.test-seed#[AE9B26581EE7AA43]) [    ] o.a.s.c.ChaosMonkey monkey: init - expire sessions:false cause connection loss:false
   [junit4]   2> 576446 INFO  (TEST-HttpPartitionTest.test-seed#[AE9B26581EE7AA43]) [    ] o.a.s.c.AbstractFullDistribZkTestBase Creating collection1 with stateFormat=2
   [junit4]   2> 576446 INFO  (TEST-HttpPartitionTest.test-seed#[AE9B26581EE7AA43]) [    ] o.a.s.c.c.SolrZkClient Using default ZkCredentialsProvider
   [junit4]   2> 576446 INFO  (TEST-HttpPartitionTest.test-seed#[AE9B26581EE7AA43]) [    ] o.a.s.c.c.ConnectionManager Waiting for client to connect to ZooKeeper
   [junit4]   2> 576446 INFO  (zkCallback-621-thread-1) [    ] o.a.s.c.c.ConnectionManager Watcher org.apache.solr.common.cloud.ConnectionManager@133db53 name:ZooKeeperConnection Watcher:127.0.0.1:43634/solr got event WatchedEvent state:SyncConnected type:None path:null path:null type:None
   [junit4]   2> 576447 INFO  (TEST-HttpPartitionTest.test-seed#[AE9B26581EE7AA43]) [    ] o.a.s.c.c.ConnectionManager Client is connected to ZooKeeper
   [junit4]   2> 576447 INFO  (TEST-HttpPartitionTest.test-seed#[AE9B26581EE7AA43]) [    ] o.a.s.c.c.SolrZkClient Using default ZkACLProvider
   [junit4]   2> 576448 INFO  (OverseerStateUpdate-94729634352594948-127.0.0.1:60147_-n_0000000000) [n:127.0.0.1:60147_    ] o.a.s.c.Overseer processMessage: queueSize: 1, message = {
   [junit4]   2>   "operation":"create",
   [junit4]   2>   "name":"collection1",
   [junit4]   2>   "numShards":"2",
   [junit4]   2>   "stateFormat":"2"} current state version: 3
   [junit4]   2> 576448 INFO  (OverseerStateUpdate-94729634352594948-127.0.0.1:60147_-n_0000000000) [n:127.0.0.1:60147_    ] o.a.s.c.o.ClusterStateMutator building a new cName: collection1
   [junit4]   2> 576498 INFO  (TEST-HttpPartitionTest.test-seed#[AE9B26581EE7AA43]) [    ] o.a.s.SolrTestCaseJ4 Writing core.properties file to /home/jenkins/workspace/Lucene-Solr-trunk-Linux/solr/build/solr-core/test/J0/temp/solr.cloud.HttpPartitionTest_AE9B26581EE7AA43-001/shard-1-001/cores/collection1
   [junit4]   2> 576499 INFO  (TEST-HttpPartitionTest.test-seed#[AE9B26581EE7AA43]) [    ] o.a.s.c.AbstractFullDistribZkTestBase create jetty 1 in directory /home/jenkins/workspace/Lucene-Solr-trunk-Linux/solr/build/solr-core/test/J0/temp/solr.cloud.HttpPartitionTest_AE9B26581EE7AA43-001/shard-1-001
   [junit4]   2> 576499 INFO  (TEST-HttpPartitionTest.test-seed#[AE9B26581EE7AA43]) [    ] o.e.j.s.Server jetty-9.2.13.v20150730
   [junit4]   2> 576500 INFO  (TEST-HttpPartitionTest.test-seed#[AE9B26581EE7AA43]) [    ] o.e.j.s.h.ContextHandler Started o.e.j.s.ServletContextHandler@ddb902{/,null,AVAILABLE}
   [junit4]   2> 576501 INFO  (TEST-HttpPartitionTest.test-seed#[AE9B26581EE7AA43]) [    ] o.e.j.s.ServerConnector Started ServerConnector@f2cff3{HTTP/1.1}{127.0.0.1:39773}
   [junit4]   2> 576501 INFO  (TEST-HttpPartitionTest.test-seed#[AE9B26581EE7AA43]) [    ] o.e.j.s.Server Started @578556ms
   [junit4]   2> 576501 INFO  (TEST-HttpPartitionTest.test-seed#[AE9B26581EE7AA43]) [    ] o.a.s.c.s.e.JettySolrRunner Jetty properties: {solr.data.dir=/home/jenkins/workspace/Lucene-Solr-trunk-Linux/solr/build/solr-core/test/J0/temp/solr.cloud.HttpPartitionTest_AE9B26581EE7AA43-001/tempDir-001/jetty1, solrconfig=solrconfig.xml, hostContext=/, hostPort=55478, coreRootDirectory=/home/jenkins/workspace/Lucene-Solr-trunk-Linux/solr/build/solr-core/test/J0/temp/solr.cloud.HttpPartitionTest_AE9B26581EE7AA43-001/shard-1-001/cores}
   [junit4]   2> 576501 INFO  (TEST-HttpPartitionTest.test-seed#[AE9B26581EE7AA43]) [    ] o.a.s.s.SolrDispatchFilter SolrDispatchFilter.init(): sun.misc.Launcher$AppClassLoader@1c6c3b2
   [junit4]   2> 576501 INFO  (TEST-HttpPartitionTest.test-seed#[AE9B26581EE7AA43]) [    ] o.a.s.c.SolrResourceLoader new SolrResourceLoader for directory: '/home/jenkins/workspace/Lucene-Solr-trunk-Linux/solr/build/solr-core/test/J0/temp/solr.cloud.HttpPartitionTest_AE9B26581EE7AA43-001/shard-1-001/'
   [junit4]   2> 576501 INFO  (TEST-HttpPartitionTest.test-seed#[AE9B26581EE7AA43]) [    ] o.a.s.c.SolrResourceLoader JNDI not configured for solr (NoInitialContextEx)
   [junit4]   2> 576501 INFO  (TEST-HttpPartitionTest.test-seed#[AE9B26581EE7AA43]) [    ] o.a.s.c.SolrResourceLoader solr home defaulted to 'solr/' (could not find system property or JNDI)
   [junit4]   2> 576514 INFO  (TEST-HttpPartitionTest.test-seed#[AE9B26581EE7AA43]) [    ] o.a.s.c.c.SolrZkClient Using default ZkCredentialsProvider
   [junit4]   2> 576514 INFO  (TEST-HttpPartitionTest.test-seed#[AE9B26581EE7AA43]) [    ] o.a.s.c.c.ConnectionManager Waiting for client to connect to ZooKeeper
   [junit4]   2> 576515 INFO  (zkCallback-622-thread-1) [    ] o.a.s.c.c.ConnectionManager Watcher org.apache.solr.common.cloud.ConnectionManager@611f0 name:ZooKeeperConnection Watcher:127.0.0.1:43634/solr got event WatchedEvent state:SyncConnected type:None path:null path:null type:None
   [junit4]   2> 576515 INFO  (TEST-HttpPartitionTest.test-seed#[AE9B26581EE7AA43]) [    ] o.a.s.c.c.ConnectionManager Client is connected to ZooKeeper
   [junit4]   2> 576515 INFO  (TEST-HttpPartitionTest.test-seed#[AE9B26581EE7AA43]) [    ] o.a.s.c.c.SolrZkClient Using default ZkACLProvider
   [junit4]   2> 576516 INFO  (TEST-HttpPartitionTest.test-seed#[AE9B26581EE7AA43]) [    ] o.a.s.s.SolrDispatchFilter Loading solr.xml from SolrHome (not found in ZooKeeper)
   [junit4]   2> 576516 INFO  (TEST-HttpPartitionTest.test-seed#[AE9B26581EE7AA43]) [    ] o.a.s.c.SolrXmlConfig Loading container configuration from /home/jenkins/workspace/Lucene-Solr-trunk-Linux/solr/build/solr-core/test/J0/temp/solr.cloud.HttpPartitionTest_AE9B26581EE7AA43-001/shard-1-001/solr.xml
   [junit4]   2> 576518 INFO  (TEST-HttpPartitionTest.test-seed#[AE9B26581EE7AA43]) [    ] o.a.s.c.CoresLocator Config-defined core root directory: /home/jenkins/workspace/Lucene-Solr-trunk-Linux/solr/build/solr-core/test/J0/temp/solr.cloud.HttpPartitionTest_AE9B26581EE7AA43-001/shard-1-001/cores
   [junit4]   2> 576518 INFO  (TEST-HttpPartitionTest.test-seed#[AE9B26581EE7AA43]) [    ] o.a.s.c.CoreContainer New CoreContainer 32870555
   [junit4]   2> 576518 INFO  (TEST-HttpPartitionTest.test-seed#[AE9B26581EE7AA43]) [    ] o.a.s.c.CoreContainer Loading cores into CoreContainer [instanceDir=/home/jenkins/workspace/Lucene-Solr-trunk-Linux/solr/build/solr-core/test/J0/temp/solr.cloud.HttpPartitionTest_AE9B26581EE7AA43-001/shard-1-001/]
   [junit4]   2> 576518 INFO  (TEST-HttpPartitionTest.test-seed#[AE9B26581EE7AA43]) [    ] o.a.s.c.CoreContainer loading shared library: /home/jenkins/workspace/Lucene-Solr-trunk-Linux/solr/build/solr-core/test/J0/temp/solr.cloud.HttpPartitionTest_AE9B26581EE7AA43-001/shard-1-001/lib
   [junit4]   2> 576518 WARN  (TEST-HttpPartitionTest.test-seed#[AE9B26581EE7AA43]) [    ] o.a.s.c.SolrResourceLoader Can't find (or read) directory to add to classloader: lib (resolved as: /home/jenkins/workspace/Lucene-Solr-trunk-Linux/solr/build/solr-core/test/J0/temp/solr.cloud.HttpPartitionTest_AE9B26581EE7AA43-001/shard-1-001/lib).
   [junit4]   2> 576522 INFO  (TEST-HttpPartitionTest.test-seed#[AE9B26581EE7AA43]) [    ] o.a.s.h.c.HttpShardHandlerFactory created with socketTimeout : 90000,urlScheme : ,connTimeout : 15000,maxConnectionsPerHost : 20,maxConnections : 10000,corePoolSize : 0,maximumPoolSize : 2147483647,maxThreadIdleTime : 5,sizeOfQueue : -1,fairnessPolicy : false,useRetries : false,
   [junit4]   2> 576524 INFO  (TEST-HttpPartitionTest.test-seed#[AE9B26581EE7AA43]) [    ] o.a.s.u.UpdateShardHandler Creating UpdateShardHandler HTTP client with params: socketTimeout=340000&connTimeout=45000&retry=true
   [junit4]   2> 576524 INFO  (TEST-HttpPartitionTest.test-seed#[AE9B26581EE7AA43]) [    ] o.a.s.l.LogWatcher SLF4J impl is org.slf4j.impl.Log4jLoggerFactory
   [junit4]   2> 576524 INFO  (TEST-HttpPartitionTest.test-seed#[AE9B26581EE7AA43]) [    ] o.a.s.l.LogWatcher Registering Log Listener [Log4j (org.slf4j.impl.Log4jLoggerFactory)]
   [junit4]   2> 576524 INFO  (TEST-HttpPartitionTest.test-seed#[AE9B26581EE7AA43]) [    ] o.a.s.c.ZkContainer Zookeeper client=127.0.0.1:43634/solr
   [junit4]   2> 576524 INFO  (TEST-HttpPartitionTest.test-seed#[AE9B26581EE7AA43]) [    ] o.a.s.c.ZkController zkHost includes chroot
   [junit4]   2> 576524 INFO  (TEST-HttpPartitionTest.test-seed#[AE9B26581EE7AA43]) [    ] o.a.s.c.c.SolrZkClient Using default ZkCredentialsProvider
   [junit4]   2> 576524 INFO  (TEST-HttpPartitionTest.test-seed#[AE9B26581EE7AA43]) [    ] o.a.s.c.c.ConnectionManager Waiting for client to connect to ZooKeeper
   [junit4]   2> 576525 INFO  (zkCallback-624-thread-1) [    ] o.a.s.c.c.ConnectionManager Watcher org.apache.solr.common.cloud.ConnectionManager@1cdd650 name:ZooKeeperConnection Watcher:127.0.0.1:43634 got event WatchedEvent state:SyncConnected type:None path:null path:null type:None
   [junit4]   2> 576525 INFO  (TEST-HttpPartitionTest.test-seed#[AE9B26581EE7AA43]) [    ] o.a.s.c.c.ConnectionManager Client is connected to ZooKeeper
   [junit4]   2> 576526 INFO  (TEST-HttpPartitionTest.test-seed#[AE9B26581EE7AA43]) [    ] o.a.s.c.c.SolrZkClient Using default ZkACLProvider
   [junit4]   2> 576526 INFO  (TEST-HttpPartitionTest.test-seed#[AE9B26581EE7AA43]) [n:127.0.0.1:55478_    ] o.a.s.c.c.ConnectionManager Waiting for client to connect to ZooKeeper
   [junit4]   2> 576527 INFO  (zkCallback-625-thread-1-processing-n:127.0.0.1:55478_) [n:127.0.0.1:55478_    ] o.a.s.c.c.ConnectionManager Watcher org.apache.solr.common.cloud.ConnectionManager@17570fe name:ZooKeeperConnection Watcher:127.0.0.1:43634/solr got event WatchedEvent state:SyncConnected type:None path:null path:null type:None
   [junit4]   2> 576527 INFO  (TEST-HttpPartitionTest.test-seed#[AE9B26581EE7AA43]) [n:127.0.0.1:55478_    ] o.a.s.c.c.ConnectionManager Client is connected to ZooKeeper
   [junit4]   2> 576529 INFO  (TEST-HttpPartitionTest.test-seed#[AE9B26581EE7AA43]) [n:127.0.0.1:55478_    ] o.a.s.c.c.ZkStateReader Updating cluster state from ZooKeeper... 
   [junit4]   2> 576549 INFO  (OverseerStateUpdate-94729634352594948-127.0.0.1:60147_-n_0000000000) [n:127.0.0.1:60147_    ] o.a.s.c.o.ZkStateWriter going to create_collection /collections/collection1/state.json
   [junit4]   2> 577531 INFO  (TEST-HttpPartitionTest.test-seed#[AE9B26581EE7AA43]) [n:127.0.0.1:55478_    ] o.a.s.c.ZkController Register node as live in ZooKeeper:/live_nodes/127.0.0.1:55478_
   [junit4]   2> 577531 INFO  (TEST-HttpPartitionTest.test-seed#[AE9B26581EE7AA43]) [n:127.0.0.1:55478_    ] o.a.s.c.c.SolrZkClient makePath: /live_nodes/127.0.0.1:55478_
   [junit4]   2> 577532 INFO  (zkCallback-618-thread-1-processing-n:127.0.0.1:60147_) [n:127.0.0.1:60147_    ] o.a.s.c.c.ZkStateReader A live node change: WatchedEvent state:SyncConnected type:NodeChildrenChanged path:/live_nodes, has occurred - updating... (live nodes size: 1)
   [junit4]   2> 577532 INFO  (zkCallback-620-thread-1) [    ] o.a.s.c.c.ZkStateReader A live node change: WatchedEvent state:SyncConnected type:NodeChildrenChanged path:/live_nodes, has occurred - updating... (live nodes size: 1)
   [junit4]   2> 577532 INFO  (zkCallback-625-thread-1-processing-n:127.0.0.1:55478_) [n:127.0.0.1:55478_    ] o.a.s.c.c.ZkStateReader A live node change: WatchedEvent state:SyncConnected type:NodeChildrenChanged path:/live_nodes, has occurred - updating... (live nodes size: 1)
   [junit4]   2> 577533 INFO  (TEST-HttpPartitionTest.test-seed#[AE9B26581EE7AA43]) [n:127.0.0.1:55478_    ] o.a.s.c.Overseer Overseer (id=null) closing
   [junit4]   2> 577533 INFO  (TEST-HttpPartitionTest.test-seed#[AE9B26581EE7AA43]) [n:127.0.0.1:55478_    ] o.a.s.c.LeaderElector Joined leadership election with path: /overseer_elect/election/94729634352594953-127.0.0.1:55478_-n_0000000001
   [junit4]   2> 577533 INFO  (TEST-HttpPartitionTest.test-seed#[AE9B26581EE7AA43]) [n:127.0.0.1:55478_    ] o.a.s.c.LeaderElector Watching path /overseer_elect/election/94729634352594948-127.0.0.1:60147_-n_0000000000 to know if I could be the leader
   [junit4]   2> 577542 INFO  (TEST-HttpPartitionTest.test-seed#[AE9B26581EE7AA43]) [n:127.0.0.1:55478_    ] o.a.s.c.CoreContainer Security conf doesn't exist. Skipping setup for authorization module.
   [junit4]   2> 577543 INFO  (TEST-HttpPartitionTest.test-seed#[AE9B26581EE7AA43]) [n:127.0.0.1:55478_    ] o.a.s.c.CoreContainer No authentication plugin used.
   [junit4]   2> 577543 INFO  (TEST-HttpPartitionTest.test-seed#[AE9B26581EE7AA43]) [n:127.0.0.1:55478_    ] o.a.s.c.CoresLocator Looking for core definitions underneath /home/jenkins/workspace/Lucene-Solr-trunk-Linux/solr/build/solr-core/test/J0/temp/solr.cloud.HttpPartitionTest_AE9B26581EE7AA43-001/shard-1-001/cores
   [junit4]   2> 577544 INFO  (TEST-HttpPartitionTest.test-seed#[AE9B26581EE7AA43]) [n:127.0.0.1:55478_    ] o.a.s.c.SolrCore Created CoreDescriptor: {name=collection1, config=solrconfig.xml, transient=false, schema=schema.xml, loadOnStartup=true, configSetProperties=configsetprops.json, instanceDir=/home/jenkins/workspace/Lucene-Solr-trunk-Linux/solr/build/solr-core/test/J0/temp/solr.cloud.HttpPartitionTest_AE9B26581EE7AA43-001/shard-1-001/cores/collection1, collection=collection1, absoluteInstDir=/home/jenkins/workspace/Lucene-Solr-trunk-Linux/solr/build/solr-core/test/J0/temp/solr.cloud.HttpPartitionTest_AE9B26581EE7AA43-001/shard-1-001/cores/collection1/, coreNodeName=, dataDir=data/, shard=}
   [junit4]   2> 577544 INFO  (TEST-HttpPartitionTest.test-seed#[AE9B26581EE7AA43]) [n:127.0.0.1:55478_    ] o.a.s.c.CoresLocator Found core collection1 in /home/jenkins/workspace/Lucene-Solr-trunk-Linux/solr/build/solr-core/test/J0/temp/solr.cloud.HttpPartitionTest_AE9B26581EE7AA43-001/shard-1-001/cores/collection1/
   [junit4]   2> 577544 INFO  (TEST-HttpPartitionTest.test-seed#[AE9B26581EE7AA43]) [n:127.0.0.1:55478_    ] o.a.s.c.CoresLocator Found 1 core definitions
   [junit4]   2> 577544 INFO  (TEST-HttpPartitionTest.test-seed#[AE9B26581EE7AA43]) [n:127.0.0.1:55478_    ] o.a.s.s.SolrDispatchFilter user.dir=/home/jenkins/workspace/Lucene-Solr-trunk-Linux/solr/build/solr-core/test/J0
   [junit4]   2> 577544 INFO  (TEST-HttpPartitionTest.test-seed#[AE9B26581EE7AA43]) [n:127.0.0.1:55478_    ] o.a.s.s.SolrDispatchFilter SolrDispatchFilter.init() done
   [junit4]   2> 577544 INFO  (coreLoadExecutor-1337-thread-1-processing-n:127.0.0.1:55478_) [n:127.0.0.1:55478_ c:collection1   x:collection1] o.a.s.c.ZkController publishing state=down
   [junit4]   2> 577545 INFO  (coreLoadExecutor-1337-thread-1-processing-n:127.0.0.1:55478_) [n:127.0.0.1:55478_ c:collection1   x:collection1] o.a.s.c.ZkController numShards not found on descriptor - reading it from system property
   [junit4]   2> 577545 INFO  (coreLoadExecutor-1337-thread-1-processing-n:127.0.0.1:55478_) [n:127.0.0.1:55478_ c:collection1   x:collection1] o.a.s.c.ZkController Registering watch for collection collection1
   [junit4]   2> 577545 INFO  (coreLoadExecutor-1337-thread-1-processing-n:127.0.0.1:55478_) [n:127.0.0.1:55478_ c:collection1   x:collection1] o.a.s.c.c.ZkStateReader addZkWatch collection1
   [junit4]   2> 577545 INFO  (OverseerStateUpdate-94729634352594948-127.0.0.1:60147_-n_0000000000) [n:127.0.0.1:60147_    ] o.a.s.c.Overseer processMessage: queueSize: 1, message = {
   [junit4]   2>   "core":"collection1",
   [junit4]   2>   "roles":null,
   [junit4]   2>   "base_url":"http://127.0.0.1:55478",
   [junit4]   2>   "node_name":"127.0.0.1:55478_",
   [junit4]   2>   "numShards":"2",
   [junit4]   2>   "state":"down",
   [junit4]   2>   "shard":null,
   [junit4]   2>   "collection":"collection1",
   [junit4]   2>   "operation":"state"} current state version: 3
   [junit4]   2> 577545 INFO  (coreLoadExecutor-1337-thread-1-processing-n:127.0.0.1:55478_) [n:127.0.0.1:55478_ c:collection1   x:collection1] o.a.s.c.c.ZkStateReader Add data for collection1 ver 0 
   [junit4]   2> 577545 INFO  (coreLoadExecutor-1337-thread-1-processing-n:127.0.0.1:55478_) [n:127.0.0.1:55478_ c:collection1   x:collection1] o.a.s.c.ZkController look for our core node name
   [junit4]   2> 577545 INFO  (OverseerStateUpdate-94729634352594948-127.0.0.1:60147_-n_0000000000) [n:127.0.0.1:60147_    ] o.a.s.c.o.ReplicaMutator Update state numShards=2 message={
   [junit4]   2>   "core":"collection1",
   [junit4]   2>   "roles":null,
   [junit4]   2>   "base_url":"http://127.0.0.1:55478",
   [junit4]   2>   "node_name":"127.0.0.1:55478_",
   [junit4]   2>   "numShards":"2",
   [junit4]   2>   "state":"down",
   [junit4]   2>   "shard":null,
   [junit4]   2>   "collection":"collection1",
   [junit4]   2>   "operation":"state"}
   [junit4]   2> 577545 INFO  (OverseerStateUpdate-94729634352594948-127.0.0.1:60147_-n_0000000000) [n:127.0.0.1:60147_    ] o.a.s.c.o.ReplicaMutator Collection already exists with numShards=2
   [junit4]   2> 577545 INFO  (OverseerStateUpdate-94729634352594948-127.0.0.1:60147_-n_0000000000) [n:127.0.0.1:60147_    ] o.a.s.c.o.ReplicaMutator Assigning new node to shard shard=shard2
   [junit4]   2> 577646 INFO  (OverseerStateUpdate-94729634352594948-127.0.0.1:60147_-n_0000000000) [n:127.0.0.1:60147_    ] o.a.s.c.o.ZkStateWriter going to update_collection /collections/collection1/state.json version: 0
   [junit4]   2> 577647 INFO  (zkCallback-625-thread-1-processing-n:127.0.0.1:55478_) [n:127.0.0.1:55478_    ] o.a.s.c.c.ZkStateReader A cluster state change: WatchedEvent state:SyncConnected type:NodeDataChanged path:/collections/collection1/state.json for collection collection1 has occurred - updating... (live nodes size: 2)
   [junit4]   2> 577647 INFO  (zkCallback-625-thread-1-processing-n:127.0.0.1:55478_) [n:127.0.0.1:55478_    ] o.a.s.c.c.ZkStateReader Updating data for collection1 from 0 to 1 
   [junit4]   2> 578545 INFO  (coreLoadExecutor-1337-thread-1-processing-n:127.0.0.1:55478_) [n:127.0.0.1:55478_ c:collection1   x:collection1] o.a.s.c.ZkController waiting to find shard id in clusterstate for collection1
   [junit4]   2> 578545 INFO  (coreLoadExecutor-1337-thread-1-processing-n:127.0.0.1:55478_) [n:127.0.0.1:55478_ c:collection1   x:collection1] o.a.s.c.ZkController Check for collection zkNode:collection1
   [junit4]   2> 578546 INFO  (coreLoadExecutor-1337-thread-1-processing-n:127.0.0.1:55478_) [n:127.0.0.1:55478_ c:collection1   x:collection1] o.a.s.c.ZkController Collection zkNode exists
   [junit4]   2> 578546 INFO  (coreLoadExecutor-1337-thread-1-processing-n:127.0.0.1:55478_) [n:127.0.0.1:55478_ c:collection1   x:collection1] o.a.s.c.c.ZkStateReader Load collection config from:/collections/collection1
   [junit4]   2> 578546 INFO  (coreLoadExecutor-1337-thread-1-processing-n:127.0.0.1:55478_) [n:127.0.0.1:55478_ c:collection1   x:collection1] o.a.s.c.c.ZkStateReader path=/collections/collection1 configName=conf1 specified config exists in ZooKeeper
   [junit4]   2> 578546 INFO  (coreLoadExecutor-1337-thread-1-processing-n:127.0.0.1:55478_) [n:127.0.0.1:55478_ c:collection1   x:collection1] o.a.s.c.SolrResourceLoader new SolrResourceLoader for directory: '/home/jenkins/workspace/Lucene-Solr-trunk-Linux/solr/build/solr-core/test/J0/temp/solr.cloud.HttpPartitionTest_AE9B26581EE7AA43-001/shard-1-001/cores/collection1/'
   [junit4]   2> 578546 INFO  (coreLoadExecutor-1337-thread-1-processing-n:127.0.0.1:55478_) [n:127.0.0.1:55478_ c:collection1   x:collection1] o.a.s.c.SolrResourceLoader JNDI not configured for solr (NoInitialContextEx)
   [junit4]   2> 578546 INFO  (coreLoadExecutor-1337-thread-1-processing-n:127.0.0.1:55478_) [n:127.0.0.1:55478_ c:collection1   x:collection1] o.a.s.c.SolrResourceLoader solr home defaulted to 'solr/' (could not find system property or JNDI)
   [junit4]   2> 578554 INFO  (coreLoadExecutor-1337-thread-1-processing-n:127.0.0.1:55478_) [n:127.0.0.1:55478_ c:collection1   x:collection1] o.a.s.c.Config loaded config solrconfig.xml with version 0 
   [junit4]   2> 578558 INFO  (coreLoadExecutor-1337-thread-1-processing-n:127.0.0.1:55478_) [n:127.0.0.1:55478_ c:collection1   x:collection1] o.a.s.c.SolrConfig current version of requestparams : -1
   [junit4]   2> 578560 INFO  (coreLoadExecutor-1337-thread-1-processing-n:127.0.0.1:55478_) [n:127.0.0.1:55478_ c:collection1   x:collection1] o.a.s.c.SolrConfig Using Lucene MatchVersion: 6.0.0
   [junit4]   2> 578565 INFO  (coreLoadExecutor-1337-thread-1-processing-n:127.0.0.1:55478_) [n:127.0.0.1:55478_ c:collection1   x:collection1] o.a.s.c.Config Loaded SolrConfig: solrconfig.xml
   [junit4]   2> 578565 INFO  (coreLoadExecutor-1337-thread-1-processing-n:127.0.0.1:55478_) [n:127.0.0.1:55478_ c:collection1   x:collection1] o.a.s.s.IndexSchema Reading Solr Schema from /configs/conf1/schema.xml
   [junit4]   2> 578568 INFO  (coreLoadExecutor-1337-thread-1-processing-n:127.0.0.1:55478_) [n:127.0.0.1:55478_ c:collection1   x:collection1] o.a.s.s.IndexSchema [collection1] Schema name=test
   [junit4]   2> 578620 INFO  (coreLoadExecutor-1337-thread-1-processing-n:127.0.0.1:55478_) [n:127.0.0.1:55478_ c:collection1   x:collection1] o.a.s.s.OpenExchangeRatesOrgProvider Initialized with rates=open-exchange-rates.json, refreshInterval=1440.
   [junit4]   2> 578624 INFO  (coreLoadExecutor-1337-thread-1-processing-n:127.0.0.1:55478_) [n:127.0.0.1:55478_ c:collection1   x:collection1] o.a.s.s.IndexSchema default search field in schema is text
   [junit4]   2> 578624 INFO  (coreLoadExecutor-1337-thread-1-processing-n:127.0.0.1:55478_) [n:127.0.0.1:55478_ c:collection1   x:collection1] o.a.s.s.IndexSchema unique key field: id
   [junit4]   2> 578628 INFO  (coreLoadExecutor-1337-thread-1-processing-n:127.0.0.1:55478_) [n:127.0.0.1:55478_ c:collection1   x:collection1] o.a.s.s.FileExchangeRateProvider Reloading exchange rates from file currency.xml
   [junit4]   2> 578629 INFO  (coreLoadExecutor-1337-thread-1-processing-n:127.0.0.1:55478_) [n:127.0.0.1:55478_ c:collection1   x:collection1] o.a.s.s.FileExchangeRateProvider Reloading exchange rates from file currency.xml
   [junit4]   2> 578630 INFO  (coreLoadExecutor-1337-thread-1-processing-n:127.0.0.1:55478_) [n:127.0.0.1:55478_ c:collection1   x:collection1] o.a.s.s.OpenExchangeRatesOrgProvider Reloading exchange rates from open-exchange-rates.json
   [junit4]   2> 578630 WARN  (coreLoadExecutor-1337-thread-1-processing-n:127.0.0.1:55478_) [n:127.0.0.1:55478_ c:collection1   x:collection1] o.a.s.s.OpenExchangeRatesOrgProvider Unknown key IMPORTANT NOTE
   [junit4]   2> 578630 WARN  (coreLoadExecutor-1337-thread-1-processing-n:127.0.0.1:55478_) [n:127.0.0.1:55478_ c:collection1   x:collection1] o.a.s.s.OpenExchangeRatesOrgProvider Expected key, got STRING
   [junit4]   2> 578630 INFO  (coreLoadExecutor-1337-thread-1-processing-n:127.0.0.1:55478_) [n:127.0.0.1:55478_ c:collection1   x:collection1] o.a.s.s.OpenExchangeRatesOrgProvider Reloading exchange rates from open-exchange-rates.json
   [junit4]   2> 578630 WARN  (coreLoadExecutor-1337-thread-1-processing-n:127.0.0.1:55478_) [n:127.0.0.1:55478_ c:collection1   x:collection1] o.a.s.s.OpenExchangeRatesOrgProvider Unknown key IMPORTANT NOTE
   [junit4]   2> 578630 WARN  (coreLoadExecutor-1337-thread-1-processing-n:127.0.0.1:55478_) [n:127.0.0.1:55478_ c:collection1   x:collection1] o.a.s.s.OpenExchangeRatesOrgProvider Expected key, got STRING
   [junit4]   2> 578631 INFO  (coreLoadExecutor-1337-thread-1-processing-n:127.0.0.1:55478_) [n:127.0.0.1:55478_ c:collection1   x:collection1] o.a.s.c.ConfigSetProperties Did not find ConfigSet properties, assuming default properties: Can't find resource 'configsetprops.json' in classpath or '/configs/conf1', cwd=/home/jenkins/workspace/Lucene-Solr-trunk-Linux/solr/build/solr-core/test/J0
   [junit4]   2> 578631 INFO  (coreLoadExecutor-1337-thread-1-processing-n:127.0.0.1:55478_) [n:127.0.0.1:55478_ c:collection1   x:collection1] o.a.s.c.CoreContainer Creating SolrCore 'collection1' using configuration from collection collection1
   [junit4]   2> 578631 INFO  (coreLoadExecutor-1337-thread-1-processing-n:127.0.0.1:55478_) [n:127.0.0.1:55478_ c:collection1 s:shard2 r:core_node1 x:collection1] o.a.s.c.SolrCore org.apache.solr.core.MockDirectoryFactory
   [junit4]   2> 578631 INFO  (coreLoadExecutor-1337-thread-1-processing-n:127.0.0.1:55478_) [n:127.0.0.1:55478_ c:collection1 s:shard2 r:core_node1 x:collection1] o.a.s.c.SolrCore [[collection1] ] Opening new SolrCore at [/home/jenkins/workspace/Lucene-Solr-trunk-Linux/solr/build/solr-core/test/J0/temp/solr.cloud.HttpPartitionTest_AE9B26581EE7AA43-001/shard-1-001/cores/collection1/], dataDir=[null]
   [junit4]   2> 578632 INFO  (coreLoadExecutor-1337-thread-1-processing-n:127.0.0.1:55478_) [n:127.0.0.1:55478_ c:collection1 s:shard2 r:core_node1 x:collection1] o.a.s.c.JmxMonitoredMap JMX monitoring is enabled. Adding Solr mbeans to JMX Server: com.sun.jmx.mbeanserver.JmxMBeanServer@5d18c2
   [junit4]   2> 578632 INFO  (coreLoadExecutor-1337-thread-1-processing-n:127.0.0.1:55478_) [n:127.0.0.1:55478_ c:collection1 s:shard2 r:core_node1 x:collection1] o.a.s.c.CachingDirectoryFactory return new directory for /home/jenkins/workspace/Lucene-Solr-trunk-Linux/solr/build/solr-core/test/J0/temp/solr.cloud.HttpPartitionTest_AE9B26581EE7AA43-001/shard-1-001/cores/collection1/data
   [junit4]   2> 578632 INFO  (coreLoadExecutor-1337-thread-1-processing-n:127.0.0.1:55478_) [n:127.0.0.1:55478_ c:collection1 s:shard2 r:core_node1 x:collection1] o.a.s.c.SolrCore New index directory detected: old=null new=/home/jenkins/workspace/Lucene-Solr-trunk-Linux/solr/build/solr-core/test/J0/temp/solr.cloud.HttpPartitionTest_AE9B26581EE7AA43-001/shard-1-001/cores/collection1/data/index/
   [junit4]   2> 578632 WARN  (coreLoadExecutor-1337-thread-1-processing-n:127.0.0.1:55478_) [n:127.0.0.1:55478_ c:collection1 s:shard2 r:core_node1 x:collection1] o.a.s.c.SolrCore [collection1] Solr index directory '/home/jenkins/workspace/Lucene-Solr-trunk-Linux/solr/build/solr-core/test/J0/temp/solr.cloud.HttpPartitionTest_AE9B26581EE7AA43-001/shard-1-001/cores/collection1/data/index' doesn't exist. Creating new index...
   [junit4]   2> 578632 INFO  (coreLoadExecutor-1337-thread-1-processing-n:127.0.0.1:55478_) [n:127.0.0.1:55478_ c:collection1 s:shard2 r:core_node1 x:collection1] o.a.s.c.CachingDirectoryFactory return new directory for /home/jenkins/workspace/Lucene-Solr-trunk-Linux/solr/build/solr-core/test/J0/temp/solr.cloud.HttpPartitionTest_AE9B26581EE7AA43-001/shard-1-001/cores/collection1/data/index
   [junit4]   2> 578632 INFO  (coreLoadExecutor-1337-thread-1-processing-n:127.0.0.1:55478_) [n:127.0.0.1:55478_ c:collection1 s:shard2 r:core_node1 x:collection1] o.a.s.u.RandomMergePolicy RandomMergePolicy wrapping class org.apache.lucene.index.TieredMergePolicy: [TieredMergePolicy: maxMergeAtOnce=6, maxMergeAtOnceExplicit=4, maxMergedSegmentMB=30.1787109375, floorSegmentMB=1.98828125, forceMergeDeletesPctAllowed=7.253812654397162, segmentsPerTier=19.0, maxCFSSegmentSizeMB=8.796093022207999E12, noCFSRatio=1.0
   [junit4]   2> 578633 INFO  (coreLoadExecutor-1337-thread-1-processing-n:127.0.0.1:55478_) [n:127.0.0.1:55478_ c:collection1 s:shard2 r:core_node1 x:collection1] o.a.s.c.SolrCore SolrDeletionPolicy.onCommit: commits: num=1
   [junit4]   2> 	commit{dir=MockDirectoryWrapper(NRTCachingDirectory(RAMDirectory@fc56c3 lockFactory=org.apache.lucene.store.SingleInstanceLockFactory@61f151; maxCacheMB=0.8544921875 maxMergeSizeMB=0.04296875)),segFN=segments_1,generation=1}
   [junit4]   2> 578633 INFO  (coreLoadExecutor-1337-thread-1-processing-n:127.0.0.1:55478_) [n:127.0.0.1:55478_ c:collection1 s:shard2 r:core_node1 x:collection1] o.a.s.c.SolrCore newest commit generation = 1
   [junit4]   2> 578633 INFO  (OldIndexDirectoryCleanupThreadForCore-collection1) [n:127.0.0.1:55478_ c:collection1 s:shard2 r:core_node1 x:collection1] o.a.s.c.SolrCore Looking for old index directories to cleanup for core collection1 in /home/jenkins/workspace/Lucene-Solr-trunk-Linux/solr/build/solr-core/test/J0/temp/solr.cloud.HttpPartitionTest_AE9B26581EE7AA43-001/shard-1-001/cores/collection1/data/
   [junit4]   2> 578633 WARN  (OldIndexDirectoryCleanupThreadForCore-collection1) [n:127.0.0.1:55478_ c:collection1 s:shard2 r:core_node1 x:collection1] o.a.s.c.DirectoryFactory /home/jenkins/workspace/Lucene-Solr-trunk-Linux/solr/build/solr-core/test/J0/temp/solr.cloud.HttpPartitionTest_AE9B26581EE7AA43-001/shard-1-001/cores/collection1/data/ does not point to a valid data directory; skipping clean-up of old index directories.
   [junit4]   2> 578639 INFO  (coreLoadExecutor-1337-thread-1-processing-n:127.0.0.1:55478_) [n:127.0.0.1:55478_ c:collecti

[...truncated too long message...]

olr.cloud.ElectionContext.cancelElection(ElectionContext.java:85)
   [junit4]   2> 	at org.apache.solr.cloud.ShardLeaderElectionContextBase.cancelElection(ElectionContext.java:166)
   [junit4]   2> 	at org.apache.solr.cloud.ShardLeaderElectionContext.cancelElection(ElectionContext.java:267)
   [junit4]   2> 	at org.apache.solr.cloud.ShardLeaderElectionContext.runLeaderProcess(ElectionContext.java:449)
   [junit4]   2> 	at org.apache.solr.cloud.LeaderElector.runIamLeaderProcess(LeaderElector.java:197)
   [junit4]   2> 	at org.apache.solr.cloud.LeaderElector.checkIfIamLeader(LeaderElector.java:157)
   [junit4]   2> 	at org.apache.solr.cloud.LeaderElector.access$200(LeaderElector.java:58)
   [junit4]   2> 	at org.apache.solr.cloud.LeaderElector$ElectionWatcher.process(LeaderElector.java:388)
   [junit4]   2> 	at org.apache.solr.common.cloud.SolrZkClient$3$1.run(SolrZkClient.java:269)
   [junit4]   2> 	at java.util.concurrent.Executors$RunnableAdapter.call(Executors.java:511)
   [junit4]   2> 	at java.util.concurrent.FutureTask.run(FutureTask.java:265)
   [junit4]   2> 	at org.apache.solr.common.util.ExecutorUtil$MDCAwareThreadPoolExecutor$1.run(ExecutorUtil.java:231)
   [junit4]   2> 	at java.util.concurrent.ThreadPoolExecutor.runWorker(ThreadPoolExecutor.java:1142)
   [junit4]   2> 	at java.util.concurrent.ThreadPoolExecutor$Worker.run(ThreadPoolExecutor.java:617)
   [junit4]   2> 	at java.lang.Thread.run(Thread.java:747)
   [junit4]   2> 744785 INFO  (TEST-HttpPartitionTest.test-seed#[AE9B26581EE7AA43]) [    ] o.e.j.s.ServerConnector Stopped ServerConnector@d2438e{HTTP/1.1}{127.0.0.1:0}
   [junit4]   2> 744786 INFO  (TEST-HttpPartitionTest.test-seed#[AE9B26581EE7AA43]) [    ] o.e.j.s.h.ContextHandler Stopped o.e.j.s.ServletContextHandler@f25f40{/,null,UNAVAILABLE}
   [junit4]   2> 744786 INFO  (TEST-HttpPartitionTest.test-seed#[AE9B26581EE7AA43]) [n:127.0.0.1:57887_ c:c8n_1x2_leader_session_loss s:shard1 r:core_node1 x:c8n_1x2_leader_session_loss_shard1_replica2] o.a.s.c.ZkTestServer connecting to 127.0.0.1:43634 43634
   [junit4]   2> 744821 INFO  (Thread-1178) [    ] o.a.s.c.ZkTestServer connecting to 127.0.0.1:43634 43634
   [junit4]   2> 744822 WARN  (Thread-1178) [    ] o.a.s.c.ZkTestServer Watch limit violations: 
   [junit4]   2> Maximum concurrent create/delete watches above limit:
   [junit4]   2> 
   [junit4]   2> 	5	/solr/aliases.json
   [junit4]   2> 	4	/solr/security.json
   [junit4]   2> 	4	/solr/configs/conf1
   [junit4]   2> 
   [junit4]   2> Maximum concurrent data watches above limit:
   [junit4]   2> 
   [junit4]   2> 	5	/solr/clusterstate.json
   [junit4]   2> 	3	/solr/collections/collection1/state.json
   [junit4]   2> 	3	/solr/collections/c8n_1x3/state.json
   [junit4]   2> 	3	/solr/collections/collMinRf_1x3/state.json
   [junit4]   2> 	2	/solr/collections/c8n_1x2/state.json
   [junit4]   2> 	2	/solr/collections/collMinRf_1x3/leader_elect/shard1/election/94729634352594956-core_node2-n_0000000000
   [junit4]   2> 	2	/solr/collections/c8n_crud_1x2/state.json
   [junit4]   2> 	2	/solr/collections/c8n_1x2_leader_session_loss/state.json
   [junit4]   2> 
   [junit4]   2> Maximum concurrent children watches above limit:
   [junit4]   2> 
   [junit4]   2> 	5	/solr/live_nodes
   [junit4]   2> 	5	/solr/collections
   [junit4]   2> 	4	/solr/overseer/queue
   [junit4]   2> 	4	/solr/overseer/collection-queue-work
   [junit4]   2> 	2	/solr/overseer/queue-work
   [junit4]   2> 
   [junit4]   2> 744822 WARN  (TEST-HttpPartitionTest.test-seed#[AE9B26581EE7AA43]) [n:127.0.0.1:57887_ c:c8n_1x2_leader_session_loss s:shard1 r:core_node1 x:c8n_1x2_leader_session_loss_shard1_replica2] o.a.s.c.SocketProxy Closing 5 connections to: http://127.0.0.1:59477/, target: http://127.0.0.1:43437/
   [junit4]   2> 744822 WARN  (TEST-HttpPartitionTest.test-seed#[AE9B26581EE7AA43]) [n:127.0.0.1:57887_ c:c8n_1x2_leader_session_loss s:shard1 r:core_node1 x:c8n_1x2_leader_session_loss_shard1_replica2] o.a.s.c.SocketProxy Closing 9 connections to: http://127.0.0.1:60147/, target: http://127.0.0.1:59439/
   [junit4]   2> 744822 WARN  (TEST-HttpPartitionTest.test-seed#[AE9B26581EE7AA43]) [n:127.0.0.1:57887_ c:c8n_1x2_leader_session_loss s:shard1 r:core_node1 x:c8n_1x2_leader_session_loss_shard1_replica2] o.a.s.c.SocketProxy Closing 17 connections to: http://127.0.0.1:55478/, target: http://127.0.0.1:39773/
   [junit4]   2> 744822 WARN  (TEST-HttpPartitionTest.test-seed#[AE9B26581EE7AA43]) [n:127.0.0.1:57887_ c:c8n_1x2_leader_session_loss s:shard1 r:core_node1 x:c8n_1x2_leader_session_loss_shard1_replica2] o.a.s.c.SocketProxy Closing 18 connections to: http://127.0.0.1:57887/, target: http://127.0.0.1:53650/
   [junit4]   2> NOTE: reproduce with: ant test  -Dtestcase=HttpPartitionTest -Dtests.method=test -Dtests.seed=AE9B26581EE7AA43 -Dtests.multiplier=3 -Dtests.slow=true -Dtests.locale=km -Dtests.timezone=Australia/Tasmania -Dtests.asserts=true -Dtests.file.encoding=ISO-8859-1
   [junit4] FAILURE  170s J0 | HttpPartitionTest.test <<<
   [junit4]    > Throwable #1: java.lang.AssertionError: Doc with id=2 not found in http://127.0.0.1:60147/c8n_1x2_leader_session_loss due to: Path not found: /id; rsp={doc=null}
   [junit4]    > 	at __randomizedtesting.SeedInfo.seed([AE9B26581EE7AA43:26CF1982B01BC7BB]:0)
   [junit4]    > 	at org.apache.solr.cloud.HttpPartitionTest.assertDocExists(HttpPartitionTest.java:622)
   [junit4]    > 	at org.apache.solr.cloud.HttpPartitionTest.assertDocsExistInAllReplicas(HttpPartitionTest.java:577)
   [junit4]    > 	at org.apache.solr.cloud.HttpPartitionTest.testLeaderZkSessionLoss(HttpPartitionTest.java:525)
   [junit4]    > 	at org.apache.solr.cloud.HttpPartitionTest.test(HttpPartitionTest.java:121)
   [junit4]    > 	at org.apache.solr.BaseDistributedSearchTestCase$ShardsRepeatRule$ShardsFixedStatement.callStatement(BaseDistributedSearchTestCase.java:963)
   [junit4]    > 	at org.apache.solr.BaseDistributedSearchTestCase$ShardsRepeatRule$ShardsStatement.evaluate(BaseDistributedSearchTestCase.java:938)
   [junit4]    > 	at java.lang.Thread.run(Thread.java:747)
   [junit4]   2> 744826 INFO  (SUITE-HttpPartitionTest-seed#[AE9B26581EE7AA43]-worker) [n:127.0.0.1:57887_ c:c8n_1x2_leader_session_loss s:shard1 r:core_node1 x:c8n_1x2_leader_session_loss_shard1_replica2] o.a.s.SolrTestCaseJ4 ###deleteCore
   [junit4]   2> NOTE: leaving temporary files on disk at: /home/jenkins/workspace/Lucene-Solr-trunk-Linux/solr/build/solr-core/test/J0/temp/solr.cloud.HttpPartitionTest_AE9B26581EE7AA43-001
   [junit4]   2> Oct 21, 2015 8:34:38 PM com.carrotsearch.randomizedtesting.ThreadLeakControl checkThreadLeaks
   [junit4]   2> WARNING: Will linger awaiting termination of 1 leaked thread(s).
   [junit4]   2> NOTE: test params are: codec=Asserting(Lucene53): {range_facet_l_dv=TestBloomFilteredLucenePostings(BloomFilteringPostingsFormat(Lucene50(blocksize=128))), _version_=PostingsFormat(name=LuceneFixedGap), multiDefault=PostingsFormat(name=LuceneVarGapFixedInterval), a_t=PostingsFormat(name=LuceneFixedGap), intDefault=PostingsFormat(name=LuceneFixedGap), id=TestBloomFilteredLucenePostings(BloomFilteringPostingsFormat(Lucene50(blocksize=128))), range_facet_i_dv=PostingsFormat(name=LuceneFixedGap), text=FST50, range_facet_l=PostingsFormat(name=LuceneFixedGap), timestamp=PostingsFormat(name=LuceneFixedGap)}, docValues:{range_facet_l_dv=DocValuesFormat(name=Lucene50), range_facet_i_dv=DocValuesFormat(name=Direct), timestamp=DocValuesFormat(name=Direct)}, sim=RandomSimilarityProvider(queryNorm=false,coord=yes): {}, locale=km, timezone=Australia/Tasmania
   [junit4]   2> NOTE: Linux 3.19.0-31-generic i386/Oracle Corporation 1.9.0-ea (32-bit)/cpus=12,threads=1,free=97572120,total=310640640
   [junit4]   2> NOTE: All tests run in this JVM: [TestDocSet, CdcrReplicationHandlerTest, SegmentsInfoRequestHandlerTest, DeleteInactiveReplicaTest, TestNoOpRegenerator, DataDrivenBlockJoinTest, TestClusterStateMutator, CollectionStateFormat2Test, CdcrReplicationDistributedZkTest, TestSolr4Spatial2, TestHdfsUpdateLog, SyncSliceTest, BlockDirectoryTest, TestHighFrequencyDictionaryFactory, TestNamedUpdateProcessors, ResponseLogComponentTest, AnalysisAfterCoreReloadTest, DistribJoinFromCollectionTest, TestExclusionRuleCollectionAccess, ResourceLoaderTest, TestRecoveryHdfs, RankQueryTest, TestManagedSchemaFieldResource, LeaderElectionIntegrationTest, TestFoldingMultitermQuery, MigrateRouteKeyTest, CurrencyFieldOpenExchangeTest, HdfsBasicDistributedZk2Test, CollectionTooManyReplicasTest, SignatureUpdateProcessorFactoryTest, TestFaceting, HdfsChaosMonkeyNothingIsSafeTest, HdfsThreadLeakTest, PrimUtilsTest, SOLR749Test, HttpPartitionTest]
   [junit4] Completed [197/552] on J0 in 170.63s, 1 test, 1 failure <<< FAILURES!

[...truncated 1115 lines...]
BUILD FAILED
/home/jenkins/workspace/Lucene-Solr-trunk-Linux/build.xml:775: The following error occurred while executing this line:
/home/jenkins/workspace/Lucene-Solr-trunk-Linux/build.xml:719: The following error occurred while executing this line:
/home/jenkins/workspace/Lucene-Solr-trunk-Linux/build.xml:59: The following error occurred while executing this line:
/home/jenkins/workspace/Lucene-Solr-trunk-Linux/solr/build.xml:233: The following error occurred while executing this line:
/home/jenkins/workspace/Lucene-Solr-trunk-Linux/solr/common-build.xml:516: The following error occurred while executing this line:
/home/jenkins/workspace/Lucene-Solr-trunk-Linux/lucene/common-build.xml:1432: The following error occurred while executing this line:
/home/jenkins/workspace/Lucene-Solr-trunk-Linux/lucene/common-build.xml:987: There were test failures: 552 suites (8 ignored), 2171 tests, 1 failure, 75 ignored (38 assumptions) [seed: AE9B26581EE7AA43]

Total time: 46 minutes 24 seconds
Build step 'Invoke Ant' marked build as failure
Archiving artifacts
[WARNINGS] Skipping publisher since build result is FAILURE
Recording test results
Email was triggered for: Failure - Any
Sending email for trigger: Failure - Any