You are viewing a plain text version of this content. The canonical link for it is here.
Posted to dev@lucene.apache.org by Policeman Jenkins Server <je...@thetaphi.de> on 2015/11/22 10:22:07 UTC
[JENKINS] Lucene-Solr-5.x-Linux (64bit/jdk1.7.0_80) - Build # 14706
- Failure!
Build: http://jenkins.thetaphi.de/job/Lucene-Solr-5.x-Linux/14706/
Java: 64bit/jdk1.7.0_80 -XX:-UseCompressedOops -XX:+UseConcMarkSweepGC
1 tests failed.
FAILED: org.apache.solr.cloud.CollectionsAPIDistributedZkTest.test
Error Message:
Error from server at http://127.0.0.1:40671/dt_/p/awholynewcollection_0: non ok status: 500, message:Server Error
Stack Trace:
org.apache.solr.client.solrj.impl.HttpSolrClient$RemoteSolrException: Error from server at http://127.0.0.1:40671/dt_/p/awholynewcollection_0: non ok status: 500, message:Server Error
at __randomizedtesting.SeedInfo.seed([99013C7C0ABDF2BA:115503A6A4419F42]:0)
at org.apache.solr.client.solrj.impl.HttpSolrClient.executeMethod(HttpSolrClient.java:508)
at org.apache.solr.client.solrj.impl.HttpSolrClient.request(HttpSolrClient.java:241)
at org.apache.solr.client.solrj.impl.HttpSolrClient.request(HttpSolrClient.java:230)
at org.apache.solr.client.solrj.SolrRequest.process(SolrRequest.java:150)
at org.apache.solr.client.solrj.SolrClient.query(SolrClient.java:943)
at org.apache.solr.client.solrj.SolrClient.query(SolrClient.java:958)
at org.apache.solr.cloud.AbstractFullDistribZkTestBase.waitForNon403or404or503(AbstractFullDistribZkTestBase.java:1753)
at org.apache.solr.cloud.CollectionsAPIDistributedZkTest.testCollectionsAPI(CollectionsAPIDistributedZkTest.java:653)
at org.apache.solr.cloud.CollectionsAPIDistributedZkTest.test(CollectionsAPIDistributedZkTest.java:155)
at sun.reflect.NativeMethodAccessorImpl.invoke0(Native Method)
at sun.reflect.NativeMethodAccessorImpl.invoke(NativeMethodAccessorImpl.java:57)
at sun.reflect.DelegatingMethodAccessorImpl.invoke(DelegatingMethodAccessorImpl.java:43)
at java.lang.reflect.Method.invoke(Method.java:606)
at com.carrotsearch.randomizedtesting.RandomizedRunner.invoke(RandomizedRunner.java:1764)
at com.carrotsearch.randomizedtesting.RandomizedRunner$8.evaluate(RandomizedRunner.java:871)
at com.carrotsearch.randomizedtesting.RandomizedRunner$9.evaluate(RandomizedRunner.java:907)
at com.carrotsearch.randomizedtesting.RandomizedRunner$10.evaluate(RandomizedRunner.java:921)
at org.apache.solr.BaseDistributedSearchTestCase$ShardsRepeatRule$ShardsFixedStatement.callStatement(BaseDistributedSearchTestCase.java:963)
at org.apache.solr.BaseDistributedSearchTestCase$ShardsRepeatRule$ShardsStatement.evaluate(BaseDistributedSearchTestCase.java:938)
at com.carrotsearch.randomizedtesting.rules.SystemPropertiesRestoreRule$1.evaluate(SystemPropertiesRestoreRule.java:57)
at org.apache.lucene.util.TestRuleSetupTeardownChained$1.evaluate(TestRuleSetupTeardownChained.java:50)
at org.apache.lucene.util.AbstractBeforeAfterRule$1.evaluate(AbstractBeforeAfterRule.java:46)
at org.apache.lucene.util.TestRuleThreadAndTestName$1.evaluate(TestRuleThreadAndTestName.java:49)
at org.apache.lucene.util.TestRuleIgnoreAfterMaxFailures$1.evaluate(TestRuleIgnoreAfterMaxFailures.java:65)
at org.apache.lucene.util.TestRuleMarkFailure$1.evaluate(TestRuleMarkFailure.java:48)
at com.carrotsearch.randomizedtesting.rules.StatementAdapter.evaluate(StatementAdapter.java:36)
at com.carrotsearch.randomizedtesting.ThreadLeakControl$StatementRunner.run(ThreadLeakControl.java:367)
at com.carrotsearch.randomizedtesting.ThreadLeakControl.forkTimeoutingTask(ThreadLeakControl.java:809)
at com.carrotsearch.randomizedtesting.ThreadLeakControl$3.evaluate(ThreadLeakControl.java:460)
at com.carrotsearch.randomizedtesting.RandomizedRunner.runSingleTest(RandomizedRunner.java:880)
at com.carrotsearch.randomizedtesting.RandomizedRunner$5.evaluate(RandomizedRunner.java:781)
at com.carrotsearch.randomizedtesting.RandomizedRunner$6.evaluate(RandomizedRunner.java:816)
at com.carrotsearch.randomizedtesting.RandomizedRunner$7.evaluate(RandomizedRunner.java:827)
at com.carrotsearch.randomizedtesting.rules.StatementAdapter.evaluate(StatementAdapter.java:36)
at com.carrotsearch.randomizedtesting.rules.SystemPropertiesRestoreRule$1.evaluate(SystemPropertiesRestoreRule.java:57)
at org.apache.lucene.util.AbstractBeforeAfterRule$1.evaluate(AbstractBeforeAfterRule.java:46)
at com.carrotsearch.randomizedtesting.rules.StatementAdapter.evaluate(StatementAdapter.java:36)
at org.apache.lucene.util.TestRuleStoreClassName$1.evaluate(TestRuleStoreClassName.java:42)
at com.carrotsearch.randomizedtesting.rules.NoShadowingOrOverridesOnMethodsRule$1.evaluate(NoShadowingOrOverridesOnMethodsRule.java:40)
at com.carrotsearch.randomizedtesting.rules.NoShadowingOrOverridesOnMethodsRule$1.evaluate(NoShadowingOrOverridesOnMethodsRule.java:40)
at com.carrotsearch.randomizedtesting.rules.StatementAdapter.evaluate(StatementAdapter.java:36)
at com.carrotsearch.randomizedtesting.rules.StatementAdapter.evaluate(StatementAdapter.java:36)
at com.carrotsearch.randomizedtesting.rules.StatementAdapter.evaluate(StatementAdapter.java:36)
at org.apache.lucene.util.TestRuleAssertionsRequired$1.evaluate(TestRuleAssertionsRequired.java:54)
at org.apache.lucene.util.TestRuleMarkFailure$1.evaluate(TestRuleMarkFailure.java:48)
at org.apache.lucene.util.TestRuleIgnoreAfterMaxFailures$1.evaluate(TestRuleIgnoreAfterMaxFailures.java:65)
at org.apache.lucene.util.TestRuleIgnoreTestSuites$1.evaluate(TestRuleIgnoreTestSuites.java:55)
at com.carrotsearch.randomizedtesting.rules.StatementAdapter.evaluate(StatementAdapter.java:36)
at com.carrotsearch.randomizedtesting.ThreadLeakControl$StatementRunner.run(ThreadLeakControl.java:367)
at java.lang.Thread.run(Thread.java:745)
Build Log:
[...truncated 10589 lines...]
[junit4] Suite: org.apache.solr.cloud.CollectionsAPIDistributedZkTest
[junit4] 2> Creating dataDir: /home/jenkins/workspace/Lucene-Solr-5.x-Linux/solr/build/solr-core/test/J1/temp/solr.cloud.CollectionsAPIDistributedZkTest_99013C7C0ABDF2BA-001/init-core-data-001
[junit4] 2> 723879 INFO (SUITE-CollectionsAPIDistributedZkTest-seed#[99013C7C0ABDF2BA]-worker) [ ] o.a.s.SolrTestCaseJ4 Randomized ssl (false) and clientAuth (false)
[junit4] 2> 723879 INFO (SUITE-CollectionsAPIDistributedZkTest-seed#[99013C7C0ABDF2BA]-worker) [ ] o.a.s.BaseDistributedSearchTestCase Setting hostContext system property: /dt_/p
[junit4] 2> 723882 INFO (TEST-CollectionsAPIDistributedZkTest.test-seed#[99013C7C0ABDF2BA]) [ ] o.a.s.c.ZkTestServer STARTING ZK TEST SERVER
[junit4] 2> 723882 INFO (Thread-2579) [ ] o.a.s.c.ZkTestServer client port:0.0.0.0/0.0.0.0:0
[junit4] 2> 723882 INFO (Thread-2579) [ ] o.a.s.c.ZkTestServer Starting server
[junit4] 2> 723982 INFO (TEST-CollectionsAPIDistributedZkTest.test-seed#[99013C7C0ABDF2BA]) [ ] o.a.s.c.ZkTestServer start zk server on port:60677
[junit4] 2> 723982 INFO (TEST-CollectionsAPIDistributedZkTest.test-seed#[99013C7C0ABDF2BA]) [ ] o.a.s.c.c.SolrZkClient Using default ZkCredentialsProvider
[junit4] 2> 723982 INFO (TEST-CollectionsAPIDistributedZkTest.test-seed#[99013C7C0ABDF2BA]) [ ] o.a.s.c.c.ConnectionManager Waiting for client to connect to ZooKeeper
[junit4] 2> 723984 INFO (zkCallback-1303-thread-1) [ ] o.a.s.c.c.ConnectionManager Watcher org.apache.solr.common.cloud.ConnectionManager@5fc29e6b name:ZooKeeperConnection Watcher:127.0.0.1:60677 got event WatchedEvent state:SyncConnected type:None path:null path:null type:None
[junit4] 2> 723984 INFO (TEST-CollectionsAPIDistributedZkTest.test-seed#[99013C7C0ABDF2BA]) [ ] o.a.s.c.c.ConnectionManager Client is connected to ZooKeeper
[junit4] 2> 723984 INFO (TEST-CollectionsAPIDistributedZkTest.test-seed#[99013C7C0ABDF2BA]) [ ] o.a.s.c.c.SolrZkClient Using default ZkACLProvider
[junit4] 2> 723984 INFO (TEST-CollectionsAPIDistributedZkTest.test-seed#[99013C7C0ABDF2BA]) [ ] o.a.s.c.c.SolrZkClient makePath: /solr
[junit4] 2> 723986 INFO (TEST-CollectionsAPIDistributedZkTest.test-seed#[99013C7C0ABDF2BA]) [ ] o.a.s.c.c.SolrZkClient Using default ZkCredentialsProvider
[junit4] 2> 723986 INFO (TEST-CollectionsAPIDistributedZkTest.test-seed#[99013C7C0ABDF2BA]) [ ] o.a.s.c.c.ConnectionManager Waiting for client to connect to ZooKeeper
[junit4] 2> 723987 INFO (zkCallback-1304-thread-1) [ ] o.a.s.c.c.ConnectionManager Watcher org.apache.solr.common.cloud.ConnectionManager@6e6b52a5 name:ZooKeeperConnection Watcher:127.0.0.1:60677/solr got event WatchedEvent state:SyncConnected type:None path:null path:null type:None
[junit4] 2> 723987 INFO (TEST-CollectionsAPIDistributedZkTest.test-seed#[99013C7C0ABDF2BA]) [ ] o.a.s.c.c.ConnectionManager Client is connected to ZooKeeper
[junit4] 2> 723987 INFO (TEST-CollectionsAPIDistributedZkTest.test-seed#[99013C7C0ABDF2BA]) [ ] o.a.s.c.c.SolrZkClient Using default ZkACLProvider
[junit4] 2> 723987 INFO (TEST-CollectionsAPIDistributedZkTest.test-seed#[99013C7C0ABDF2BA]) [ ] o.a.s.c.c.SolrZkClient makePath: /collections/collection1
[junit4] 2> 723988 INFO (TEST-CollectionsAPIDistributedZkTest.test-seed#[99013C7C0ABDF2BA]) [ ] o.a.s.c.c.SolrZkClient makePath: /collections/collection1/shards
[junit4] 2> 723988 INFO (TEST-CollectionsAPIDistributedZkTest.test-seed#[99013C7C0ABDF2BA]) [ ] o.a.s.c.c.SolrZkClient makePath: /collections/control_collection
[junit4] 2> 723988 INFO (TEST-CollectionsAPIDistributedZkTest.test-seed#[99013C7C0ABDF2BA]) [ ] o.a.s.c.c.SolrZkClient makePath: /collections/control_collection/shards
[junit4] 2> 723989 INFO (TEST-CollectionsAPIDistributedZkTest.test-seed#[99013C7C0ABDF2BA]) [ ] o.a.s.c.AbstractZkTestCase put /home/jenkins/workspace/Lucene-Solr-5.x-Linux/solr/core/src/test-files/solr/collection1/conf/solrconfig-tlog.xml to /configs/conf1/solrconfig.xml
[junit4] 2> 723989 INFO (TEST-CollectionsAPIDistributedZkTest.test-seed#[99013C7C0ABDF2BA]) [ ] o.a.s.c.c.SolrZkClient makePath: /configs/conf1/solrconfig.xml
[junit4] 2> 723990 INFO (TEST-CollectionsAPIDistributedZkTest.test-seed#[99013C7C0ABDF2BA]) [ ] o.a.s.c.AbstractZkTestCase put /home/jenkins/workspace/Lucene-Solr-5.x-Linux/solr/core/src/test-files/solr/collection1/conf/schema.xml to /configs/conf1/schema.xml
[junit4] 2> 723990 INFO (TEST-CollectionsAPIDistributedZkTest.test-seed#[99013C7C0ABDF2BA]) [ ] o.a.s.c.c.SolrZkClient makePath: /configs/conf1/schema.xml
[junit4] 2> 723990 INFO (TEST-CollectionsAPIDistributedZkTest.test-seed#[99013C7C0ABDF2BA]) [ ] o.a.s.c.AbstractZkTestCase put /home/jenkins/workspace/Lucene-Solr-5.x-Linux/solr/core/src/test-files/solr/collection1/conf/solrconfig.snippet.randomindexconfig.xml to /configs/conf1/solrconfig.snippet.randomindexconfig.xml
[junit4] 2> 723990 INFO (TEST-CollectionsAPIDistributedZkTest.test-seed#[99013C7C0ABDF2BA]) [ ] o.a.s.c.c.SolrZkClient makePath: /configs/conf1/solrconfig.snippet.randomindexconfig.xml
[junit4] 2> 723991 INFO (TEST-CollectionsAPIDistributedZkTest.test-seed#[99013C7C0ABDF2BA]) [ ] o.a.s.c.AbstractZkTestCase put /home/jenkins/workspace/Lucene-Solr-5.x-Linux/solr/core/src/test-files/solr/collection1/conf/stopwords.txt to /configs/conf1/stopwords.txt
[junit4] 2> 723991 INFO (TEST-CollectionsAPIDistributedZkTest.test-seed#[99013C7C0ABDF2BA]) [ ] o.a.s.c.c.SolrZkClient makePath: /configs/conf1/stopwords.txt
[junit4] 2> 723991 INFO (TEST-CollectionsAPIDistributedZkTest.test-seed#[99013C7C0ABDF2BA]) [ ] o.a.s.c.AbstractZkTestCase put /home/jenkins/workspace/Lucene-Solr-5.x-Linux/solr/core/src/test-files/solr/collection1/conf/protwords.txt to /configs/conf1/protwords.txt
[junit4] 2> 723991 INFO (TEST-CollectionsAPIDistributedZkTest.test-seed#[99013C7C0ABDF2BA]) [ ] o.a.s.c.c.SolrZkClient makePath: /configs/conf1/protwords.txt
[junit4] 2> 723992 INFO (TEST-CollectionsAPIDistributedZkTest.test-seed#[99013C7C0ABDF2BA]) [ ] o.a.s.c.AbstractZkTestCase put /home/jenkins/workspace/Lucene-Solr-5.x-Linux/solr/core/src/test-files/solr/collection1/conf/currency.xml to /configs/conf1/currency.xml
[junit4] 2> 723992 INFO (TEST-CollectionsAPIDistributedZkTest.test-seed#[99013C7C0ABDF2BA]) [ ] o.a.s.c.c.SolrZkClient makePath: /configs/conf1/currency.xml
[junit4] 2> 723993 INFO (TEST-CollectionsAPIDistributedZkTest.test-seed#[99013C7C0ABDF2BA]) [ ] o.a.s.c.AbstractZkTestCase put /home/jenkins/workspace/Lucene-Solr-5.x-Linux/solr/core/src/test-files/solr/collection1/conf/enumsConfig.xml to /configs/conf1/enumsConfig.xml
[junit4] 2> 723993 INFO (TEST-CollectionsAPIDistributedZkTest.test-seed#[99013C7C0ABDF2BA]) [ ] o.a.s.c.c.SolrZkClient makePath: /configs/conf1/enumsConfig.xml
[junit4] 2> 723993 INFO (TEST-CollectionsAPIDistributedZkTest.test-seed#[99013C7C0ABDF2BA]) [ ] o.a.s.c.AbstractZkTestCase put /home/jenkins/workspace/Lucene-Solr-5.x-Linux/solr/core/src/test-files/solr/collection1/conf/open-exchange-rates.json to /configs/conf1/open-exchange-rates.json
[junit4] 2> 723993 INFO (TEST-CollectionsAPIDistributedZkTest.test-seed#[99013C7C0ABDF2BA]) [ ] o.a.s.c.c.SolrZkClient makePath: /configs/conf1/open-exchange-rates.json
[junit4] 2> 723994 INFO (TEST-CollectionsAPIDistributedZkTest.test-seed#[99013C7C0ABDF2BA]) [ ] o.a.s.c.AbstractZkTestCase put /home/jenkins/workspace/Lucene-Solr-5.x-Linux/solr/core/src/test-files/solr/collection1/conf/mapping-ISOLatin1Accent.txt to /configs/conf1/mapping-ISOLatin1Accent.txt
[junit4] 2> 723994 INFO (TEST-CollectionsAPIDistributedZkTest.test-seed#[99013C7C0ABDF2BA]) [ ] o.a.s.c.c.SolrZkClient makePath: /configs/conf1/mapping-ISOLatin1Accent.txt
[junit4] 2> 723994 INFO (TEST-CollectionsAPIDistributedZkTest.test-seed#[99013C7C0ABDF2BA]) [ ] o.a.s.c.AbstractZkTestCase put /home/jenkins/workspace/Lucene-Solr-5.x-Linux/solr/core/src/test-files/solr/collection1/conf/old_synonyms.txt to /configs/conf1/old_synonyms.txt
[junit4] 2> 723995 INFO (TEST-CollectionsAPIDistributedZkTest.test-seed#[99013C7C0ABDF2BA]) [ ] o.a.s.c.c.SolrZkClient makePath: /configs/conf1/old_synonyms.txt
[junit4] 2> 723995 INFO (TEST-CollectionsAPIDistributedZkTest.test-seed#[99013C7C0ABDF2BA]) [ ] o.a.s.c.AbstractZkTestCase put /home/jenkins/workspace/Lucene-Solr-5.x-Linux/solr/core/src/test-files/solr/collection1/conf/synonyms.txt to /configs/conf1/synonyms.txt
[junit4] 2> 723995 INFO (TEST-CollectionsAPIDistributedZkTest.test-seed#[99013C7C0ABDF2BA]) [ ] o.a.s.c.c.SolrZkClient makePath: /configs/conf1/synonyms.txt
[junit4] 2> 723996 INFO (TEST-CollectionsAPIDistributedZkTest.test-seed#[99013C7C0ABDF2BA]) [ ] o.a.s.c.c.SolrZkClient Using default ZkCredentialsProvider
[junit4] 2> 723996 INFO (TEST-CollectionsAPIDistributedZkTest.test-seed#[99013C7C0ABDF2BA]) [ ] o.a.s.c.c.ConnectionManager Waiting for client to connect to ZooKeeper
[junit4] 2> 723997 INFO (zkCallback-1305-thread-1) [ ] o.a.s.c.c.ConnectionManager Watcher org.apache.solr.common.cloud.ConnectionManager@2232f6a7 name:ZooKeeperConnection Watcher:127.0.0.1:60677 got event WatchedEvent state:SyncConnected type:None path:null path:null type:None
[junit4] 2> 723997 INFO (TEST-CollectionsAPIDistributedZkTest.test-seed#[99013C7C0ABDF2BA]) [ ] o.a.s.c.c.ConnectionManager Client is connected to ZooKeeper
[junit4] 2> 723997 INFO (TEST-CollectionsAPIDistributedZkTest.test-seed#[99013C7C0ABDF2BA]) [ ] o.a.s.c.c.SolrZkClient Using default ZkACLProvider
[junit4] 2> 723997 INFO (TEST-CollectionsAPIDistributedZkTest.test-seed#[99013C7C0ABDF2BA]) [ ] o.a.s.c.c.SolrZkClient makePath: /solr
[junit4] 2> 723998 INFO (TEST-CollectionsAPIDistributedZkTest.test-seed#[99013C7C0ABDF2BA]) [ ] o.a.s.c.c.SolrZkClient Using default ZkCredentialsProvider
[junit4] 2> 723998 INFO (TEST-CollectionsAPIDistributedZkTest.test-seed#[99013C7C0ABDF2BA]) [ ] o.a.s.c.c.ConnectionManager Waiting for client to connect to ZooKeeper
[junit4] 2> 723999 INFO (zkCallback-1306-thread-1) [ ] o.a.s.c.c.ConnectionManager Watcher org.apache.solr.common.cloud.ConnectionManager@264cb392 name:ZooKeeperConnection Watcher:127.0.0.1:60677/solr got event WatchedEvent state:SyncConnected type:None path:null path:null type:None
[junit4] 2> 723999 INFO (TEST-CollectionsAPIDistributedZkTest.test-seed#[99013C7C0ABDF2BA]) [ ] o.a.s.c.c.ConnectionManager Client is connected to ZooKeeper
[junit4] 2> 723999 INFO (TEST-CollectionsAPIDistributedZkTest.test-seed#[99013C7C0ABDF2BA]) [ ] o.a.s.c.c.SolrZkClient Using default ZkACLProvider
[junit4] 2> 723999 INFO (TEST-CollectionsAPIDistributedZkTest.test-seed#[99013C7C0ABDF2BA]) [ ] o.a.s.c.AbstractZkTestCase put /home/jenkins/workspace/Lucene-Solr-5.x-Linux/solr/core/src/test-files/solr/collection1/conf/solrconfig-tlog.xml to /configs/conf2/solrconfig.xml
[junit4] 2> 723999 INFO (TEST-CollectionsAPIDistributedZkTest.test-seed#[99013C7C0ABDF2BA]) [ ] o.a.s.c.c.SolrZkClient makePath: /configs/conf2/solrconfig.xml
[junit4] 2> 724000 INFO (TEST-CollectionsAPIDistributedZkTest.test-seed#[99013C7C0ABDF2BA]) [ ] o.a.s.c.AbstractZkTestCase put /home/jenkins/workspace/Lucene-Solr-5.x-Linux/solr/core/src/test-files/solr/collection1/conf/schema.xml to /configs/conf2/schema.xml
[junit4] 2> 724000 INFO (TEST-CollectionsAPIDistributedZkTest.test-seed#[99013C7C0ABDF2BA]) [ ] o.a.s.c.c.SolrZkClient makePath: /configs/conf2/schema.xml
[junit4] 2> 724001 INFO (TEST-CollectionsAPIDistributedZkTest.test-seed#[99013C7C0ABDF2BA]) [ ] o.a.s.c.AbstractZkTestCase put /home/jenkins/workspace/Lucene-Solr-5.x-Linux/solr/core/src/test-files/solr/collection1/conf/enumsConfig.xml to /configs/conf2/enumsConfig.xml
[junit4] 2> 724001 INFO (TEST-CollectionsAPIDistributedZkTest.test-seed#[99013C7C0ABDF2BA]) [ ] o.a.s.c.c.SolrZkClient makePath: /configs/conf2/enumsConfig.xml
[junit4] 2> 724001 INFO (TEST-CollectionsAPIDistributedZkTest.test-seed#[99013C7C0ABDF2BA]) [ ] o.a.s.c.AbstractZkTestCase put /home/jenkins/workspace/Lucene-Solr-5.x-Linux/solr/core/src/test-files/solr/collection1/conf/solrconfig.snippet.randomindexconfig.xml to /configs/conf2/solrconfig.snippet.randomindexconfig.xml
[junit4] 2> 724001 INFO (TEST-CollectionsAPIDistributedZkTest.test-seed#[99013C7C0ABDF2BA]) [ ] o.a.s.c.c.SolrZkClient makePath: /configs/conf2/solrconfig.snippet.randomindexconfig.xml
[junit4] 2> 724002 INFO (TEST-CollectionsAPIDistributedZkTest.test-seed#[99013C7C0ABDF2BA]) [ ] o.a.s.c.AbstractZkTestCase put /home/jenkins/workspace/Lucene-Solr-5.x-Linux/solr/core/src/test-files/solr/collection1/conf/stopwords.txt to /configs/conf2/stopwords.txt
[junit4] 2> 724002 INFO (TEST-CollectionsAPIDistributedZkTest.test-seed#[99013C7C0ABDF2BA]) [ ] o.a.s.c.c.SolrZkClient makePath: /configs/conf2/stopwords.txt
[junit4] 2> 724002 INFO (TEST-CollectionsAPIDistributedZkTest.test-seed#[99013C7C0ABDF2BA]) [ ] o.a.s.c.AbstractZkTestCase put /home/jenkins/workspace/Lucene-Solr-5.x-Linux/solr/core/src/test-files/solr/collection1/conf/protwords.txt to /configs/conf2/protwords.txt
[junit4] 2> 724003 INFO (TEST-CollectionsAPIDistributedZkTest.test-seed#[99013C7C0ABDF2BA]) [ ] o.a.s.c.c.SolrZkClient makePath: /configs/conf2/protwords.txt
[junit4] 2> 724003 INFO (TEST-CollectionsAPIDistributedZkTest.test-seed#[99013C7C0ABDF2BA]) [ ] o.a.s.c.AbstractZkTestCase put /home/jenkins/workspace/Lucene-Solr-5.x-Linux/solr/core/src/test-files/solr/collection1/conf/currency.xml to /configs/conf2/currency.xml
[junit4] 2> 724003 INFO (TEST-CollectionsAPIDistributedZkTest.test-seed#[99013C7C0ABDF2BA]) [ ] o.a.s.c.c.SolrZkClient makePath: /configs/conf2/currency.xml
[junit4] 2> 724004 INFO (TEST-CollectionsAPIDistributedZkTest.test-seed#[99013C7C0ABDF2BA]) [ ] o.a.s.c.AbstractZkTestCase put /home/jenkins/workspace/Lucene-Solr-5.x-Linux/solr/core/src/test-files/solr/collection1/conf/open-exchange-rates.json to /configs/conf2/open-exchange-rates.json
[junit4] 2> 724004 INFO (TEST-CollectionsAPIDistributedZkTest.test-seed#[99013C7C0ABDF2BA]) [ ] o.a.s.c.c.SolrZkClient makePath: /configs/conf2/open-exchange-rates.json
[junit4] 2> 724005 INFO (TEST-CollectionsAPIDistributedZkTest.test-seed#[99013C7C0ABDF2BA]) [ ] o.a.s.c.AbstractZkTestCase put /home/jenkins/workspace/Lucene-Solr-5.x-Linux/solr/core/src/test-files/solr/collection1/conf/mapping-ISOLatin1Accent.txt to /configs/conf2/mapping-ISOLatin1Accent.txt
[junit4] 2> 724005 INFO (TEST-CollectionsAPIDistributedZkTest.test-seed#[99013C7C0ABDF2BA]) [ ] o.a.s.c.c.SolrZkClient makePath: /configs/conf2/mapping-ISOLatin1Accent.txt
[junit4] 2> 724005 INFO (TEST-CollectionsAPIDistributedZkTest.test-seed#[99013C7C0ABDF2BA]) [ ] o.a.s.c.AbstractZkTestCase put /home/jenkins/workspace/Lucene-Solr-5.x-Linux/solr/core/src/test-files/solr/collection1/conf/old_synonyms.txt to /configs/conf2/old_synonyms.txt
[junit4] 2> 724005 INFO (TEST-CollectionsAPIDistributedZkTest.test-seed#[99013C7C0ABDF2BA]) [ ] o.a.s.c.c.SolrZkClient makePath: /configs/conf2/old_synonyms.txt
[junit4] 2> 724006 INFO (TEST-CollectionsAPIDistributedZkTest.test-seed#[99013C7C0ABDF2BA]) [ ] o.a.s.c.AbstractZkTestCase put /home/jenkins/workspace/Lucene-Solr-5.x-Linux/solr/core/src/test-files/solr/collection1/conf/synonyms.txt to /configs/conf2/synonyms.txt
[junit4] 2> 724006 INFO (TEST-CollectionsAPIDistributedZkTest.test-seed#[99013C7C0ABDF2BA]) [ ] o.a.s.c.c.SolrZkClient makePath: /configs/conf2/synonyms.txt
[junit4] 2> 724007 INFO (TEST-CollectionsAPIDistributedZkTest.test-seed#[99013C7C0ABDF2BA]) [ ] o.a.s.c.AbstractZkTestCase put /home/jenkins/workspace/Lucene-Solr-5.x-Linux/solr/core/src/test-files/solr/collection1/conf/elevate.xml to /configs/conf2/elevate.xml
[junit4] 2> 724007 INFO (TEST-CollectionsAPIDistributedZkTest.test-seed#[99013C7C0ABDF2BA]) [ ] o.a.s.c.c.SolrZkClient makePath: /configs/conf2/elevate.xml
[junit4] 2> 724051 INFO (TEST-CollectionsAPIDistributedZkTest.test-seed#[99013C7C0ABDF2BA]) [ ] o.a.s.SolrTestCaseJ4 Writing core.properties file to /home/jenkins/workspace/Lucene-Solr-5.x-Linux/solr/build/solr-core/test/J1/temp/solr.cloud.CollectionsAPIDistributedZkTest_99013C7C0ABDF2BA-001/control-001/cores/collection1
[junit4] 2> 724052 INFO (TEST-CollectionsAPIDistributedZkTest.test-seed#[99013C7C0ABDF2BA]) [ ] o.e.j.s.Server jetty-9.2.13.v20150730
[junit4] 2> 724053 INFO (TEST-CollectionsAPIDistributedZkTest.test-seed#[99013C7C0ABDF2BA]) [ ] o.e.j.s.h.ContextHandler Started o.e.j.s.ServletContextHandler@782667d6{/dt_/p,null,AVAILABLE}
[junit4] 2> 724055 INFO (TEST-CollectionsAPIDistributedZkTest.test-seed#[99013C7C0ABDF2BA]) [ ] o.e.j.s.ServerConnector Started ServerConnector@c6020fa{HTTP/1.1}{127.0.0.1:58083}
[junit4] 2> 724055 INFO (TEST-CollectionsAPIDistributedZkTest.test-seed#[99013C7C0ABDF2BA]) [ ] o.e.j.s.Server Started @725564ms
[junit4] 2> 724055 INFO (TEST-CollectionsAPIDistributedZkTest.test-seed#[99013C7C0ABDF2BA]) [ ] o.a.s.c.s.e.JettySolrRunner Jetty properties: {solr.data.dir=/home/jenkins/workspace/Lucene-Solr-5.x-Linux/solr/build/solr-core/test/J1/temp/solr.cloud.CollectionsAPIDistributedZkTest_99013C7C0ABDF2BA-001/tempDir-001/control/data, hostPort=58083, coreRootDirectory=/home/jenkins/workspace/Lucene-Solr-5.x-Linux/solr/build/solr-core/test/J1/temp/solr.cloud.CollectionsAPIDistributedZkTest_99013C7C0ABDF2BA-001/control-001/cores, hostContext=/dt_/p}
[junit4] 2> 724055 INFO (TEST-CollectionsAPIDistributedZkTest.test-seed#[99013C7C0ABDF2BA]) [ ] o.a.s.s.SolrDispatchFilter SolrDispatchFilter.init(): sun.misc.Launcher$AppClassLoader@8f8acd0
[junit4] 2> 724055 INFO (TEST-CollectionsAPIDistributedZkTest.test-seed#[99013C7C0ABDF2BA]) [ ] o.a.s.c.SolrResourceLoader new SolrResourceLoader for directory: '/home/jenkins/workspace/Lucene-Solr-5.x-Linux/solr/build/solr-core/test/J1/temp/solr.cloud.CollectionsAPIDistributedZkTest_99013C7C0ABDF2BA-001/control-001'
[junit4] 2> 724055 INFO (TEST-CollectionsAPIDistributedZkTest.test-seed#[99013C7C0ABDF2BA]) [ ] o.a.s.c.SolrResourceLoader JNDI not configured for solr (NoInitialContextEx)
[junit4] 2> 724055 INFO (TEST-CollectionsAPIDistributedZkTest.test-seed#[99013C7C0ABDF2BA]) [ ] o.a.s.c.SolrResourceLoader solr home defaulted to 'solr/' (could not find system property or JNDI)
[junit4] 2> 724055 INFO (TEST-CollectionsAPIDistributedZkTest.test-seed#[99013C7C0ABDF2BA]) [ ] o.a.s.c.c.SolrZkClient Using default ZkCredentialsProvider
[junit4] 2> 724055 INFO (TEST-CollectionsAPIDistributedZkTest.test-seed#[99013C7C0ABDF2BA]) [ ] o.a.s.c.c.ConnectionManager Waiting for client to connect to ZooKeeper
[junit4] 2> 724057 INFO (zkCallback-1307-thread-1) [ ] o.a.s.c.c.ConnectionManager Watcher org.apache.solr.common.cloud.ConnectionManager@58fbf769 name:ZooKeeperConnection Watcher:127.0.0.1:60677/solr got event WatchedEvent state:SyncConnected type:None path:null path:null type:None
[junit4] 2> 724057 INFO (TEST-CollectionsAPIDistributedZkTest.test-seed#[99013C7C0ABDF2BA]) [ ] o.a.s.c.c.ConnectionManager Client is connected to ZooKeeper
[junit4] 2> 724057 INFO (TEST-CollectionsAPIDistributedZkTest.test-seed#[99013C7C0ABDF2BA]) [ ] o.a.s.c.c.SolrZkClient Using default ZkACLProvider
[junit4] 2> 724057 INFO (TEST-CollectionsAPIDistributedZkTest.test-seed#[99013C7C0ABDF2BA]) [ ] o.a.s.s.SolrDispatchFilter Loading solr.xml from SolrHome (not found in ZooKeeper)
[junit4] 2> 724057 INFO (TEST-CollectionsAPIDistributedZkTest.test-seed#[99013C7C0ABDF2BA]) [ ] o.a.s.c.SolrXmlConfig Loading container configuration from /home/jenkins/workspace/Lucene-Solr-5.x-Linux/solr/build/solr-core/test/J1/temp/solr.cloud.CollectionsAPIDistributedZkTest_99013C7C0ABDF2BA-001/control-001/solr.xml
[junit4] 2> 724065 INFO (TEST-CollectionsAPIDistributedZkTest.test-seed#[99013C7C0ABDF2BA]) [ ] o.a.s.c.CoresLocator Config-defined core root directory: /home/jenkins/workspace/Lucene-Solr-5.x-Linux/solr/build/solr-core/test/J1/temp/solr.cloud.CollectionsAPIDistributedZkTest_99013C7C0ABDF2BA-001/control-001/cores
[junit4] 2> 724066 INFO (TEST-CollectionsAPIDistributedZkTest.test-seed#[99013C7C0ABDF2BA]) [ ] o.a.s.c.CoreContainer New CoreContainer 817499000
[junit4] 2> 724066 INFO (TEST-CollectionsAPIDistributedZkTest.test-seed#[99013C7C0ABDF2BA]) [ ] o.a.s.c.CoreContainer Loading cores into CoreContainer [instanceDir=/home/jenkins/workspace/Lucene-Solr-5.x-Linux/solr/build/solr-core/test/J1/temp/solr.cloud.CollectionsAPIDistributedZkTest_99013C7C0ABDF2BA-001/control-001]
[junit4] 2> 724066 WARN (TEST-CollectionsAPIDistributedZkTest.test-seed#[99013C7C0ABDF2BA]) [ ] o.a.s.c.CoreContainer Couldn't add files from /home/jenkins/workspace/Lucene-Solr-5.x-Linux/solr/build/solr-core/test/J1/temp/solr.cloud.CollectionsAPIDistributedZkTest_99013C7C0ABDF2BA-001/control-001/lib to classpath: /home/jenkins/workspace/Lucene-Solr-5.x-Linux/solr/build/solr-core/test/J1/temp/solr.cloud.CollectionsAPIDistributedZkTest_99013C7C0ABDF2BA-001/control-001/lib
[junit4] 2> 724066 INFO (TEST-CollectionsAPIDistributedZkTest.test-seed#[99013C7C0ABDF2BA]) [ ] o.a.s.h.c.HttpShardHandlerFactory created with socketTimeout : 90000,urlScheme : ,connTimeout : 15000,maxConnectionsPerHost : 20,maxConnections : 10000,corePoolSize : 0,maximumPoolSize : 2147483647,maxThreadIdleTime : 5,sizeOfQueue : -1,fairnessPolicy : false,useRetries : false,
[junit4] 2> 724067 INFO (TEST-CollectionsAPIDistributedZkTest.test-seed#[99013C7C0ABDF2BA]) [ ] o.a.s.u.UpdateShardHandler Creating UpdateShardHandler HTTP client with params: socketTimeout=340000&connTimeout=45000&retry=true
[junit4] 2> 724067 INFO (TEST-CollectionsAPIDistributedZkTest.test-seed#[99013C7C0ABDF2BA]) [ ] o.a.s.l.LogWatcher SLF4J impl is org.slf4j.impl.Log4jLoggerFactory
[junit4] 2> 724067 INFO (TEST-CollectionsAPIDistributedZkTest.test-seed#[99013C7C0ABDF2BA]) [ ] o.a.s.l.LogWatcher Registering Log Listener [Log4j (org.slf4j.impl.Log4jLoggerFactory)]
[junit4] 2> 724067 INFO (TEST-CollectionsAPIDistributedZkTest.test-seed#[99013C7C0ABDF2BA]) [ ] o.a.s.c.ZkContainer Zookeeper client=127.0.0.1:60677/solr
[junit4] 2> 724067 INFO (TEST-CollectionsAPIDistributedZkTest.test-seed#[99013C7C0ABDF2BA]) [ ] o.a.s.c.ZkController zkHost includes chroot
[junit4] 2> 724067 INFO (TEST-CollectionsAPIDistributedZkTest.test-seed#[99013C7C0ABDF2BA]) [ ] o.a.s.c.c.SolrZkClient Using default ZkCredentialsProvider
[junit4] 2> 724067 INFO (TEST-CollectionsAPIDistributedZkTest.test-seed#[99013C7C0ABDF2BA]) [ ] o.a.s.c.c.ConnectionManager Waiting for client to connect to ZooKeeper
[junit4] 2> 724069 INFO (zkCallback-1309-thread-1) [ ] o.a.s.c.c.ConnectionManager Watcher org.apache.solr.common.cloud.ConnectionManager@2cf7774a name:ZooKeeperConnection Watcher:127.0.0.1:60677 got event WatchedEvent state:SyncConnected type:None path:null path:null type:None
[junit4] 2> 724069 INFO (TEST-CollectionsAPIDistributedZkTest.test-seed#[99013C7C0ABDF2BA]) [ ] o.a.s.c.c.ConnectionManager Client is connected to ZooKeeper
[junit4] 2> 724070 INFO (TEST-CollectionsAPIDistributedZkTest.test-seed#[99013C7C0ABDF2BA]) [ ] o.a.s.c.c.SolrZkClient Using default ZkACLProvider
[junit4] 2> 724070 INFO (TEST-CollectionsAPIDistributedZkTest.test-seed#[99013C7C0ABDF2BA]) [n:127.0.0.1:58083_dt_%2Fp ] o.a.s.c.c.ConnectionManager Waiting for client to connect to ZooKeeper
[junit4] 2> 724071 INFO (zkCallback-1310-thread-1-processing-n:127.0.0.1:58083_dt_%2Fp) [n:127.0.0.1:58083_dt_%2Fp ] o.a.s.c.c.ConnectionManager Watcher org.apache.solr.common.cloud.ConnectionManager@4d5f1cb8 name:ZooKeeperConnection Watcher:127.0.0.1:60677/solr got event WatchedEvent state:SyncConnected type:None path:null path:null type:None
[junit4] 2> 724071 INFO (TEST-CollectionsAPIDistributedZkTest.test-seed#[99013C7C0ABDF2BA]) [n:127.0.0.1:58083_dt_%2Fp ] o.a.s.c.c.ConnectionManager Client is connected to ZooKeeper
[junit4] 2> 724072 INFO (TEST-CollectionsAPIDistributedZkTest.test-seed#[99013C7C0ABDF2BA]) [n:127.0.0.1:58083_dt_%2Fp ] o.a.s.c.c.SolrZkClient makePath: /overseer/queue
[junit4] 2> 724072 INFO (TEST-CollectionsAPIDistributedZkTest.test-seed#[99013C7C0ABDF2BA]) [n:127.0.0.1:58083_dt_%2Fp ] o.a.s.c.c.SolrZkClient makePath: /overseer/collection-queue-work
[junit4] 2> 724073 INFO (TEST-CollectionsAPIDistributedZkTest.test-seed#[99013C7C0ABDF2BA]) [n:127.0.0.1:58083_dt_%2Fp ] o.a.s.c.c.SolrZkClient makePath: /overseer/collection-map-running
[junit4] 2> 724074 INFO (TEST-CollectionsAPIDistributedZkTest.test-seed#[99013C7C0ABDF2BA]) [n:127.0.0.1:58083_dt_%2Fp ] o.a.s.c.c.SolrZkClient makePath: /overseer/collection-map-completed
[junit4] 2> 724074 INFO (TEST-CollectionsAPIDistributedZkTest.test-seed#[99013C7C0ABDF2BA]) [n:127.0.0.1:58083_dt_%2Fp ] o.a.s.c.c.SolrZkClient makePath: /overseer/collection-map-failure
[junit4] 2> 724075 INFO (TEST-CollectionsAPIDistributedZkTest.test-seed#[99013C7C0ABDF2BA]) [n:127.0.0.1:58083_dt_%2Fp ] o.a.s.c.c.SolrZkClient makePath: /live_nodes
[junit4] 2> 724075 INFO (TEST-CollectionsAPIDistributedZkTest.test-seed#[99013C7C0ABDF2BA]) [n:127.0.0.1:58083_dt_%2Fp ] o.a.s.c.c.SolrZkClient makePath: /aliases.json
[junit4] 2> 724076 INFO (TEST-CollectionsAPIDistributedZkTest.test-seed#[99013C7C0ABDF2BA]) [n:127.0.0.1:58083_dt_%2Fp ] o.a.s.c.c.SolrZkClient makePath: /clusterstate.json
[junit4] 2> 724076 INFO (TEST-CollectionsAPIDistributedZkTest.test-seed#[99013C7C0ABDF2BA]) [n:127.0.0.1:58083_dt_%2Fp ] o.a.s.c.c.SolrZkClient makePath: /security.json
[junit4] 2> 724077 INFO (TEST-CollectionsAPIDistributedZkTest.test-seed#[99013C7C0ABDF2BA]) [n:127.0.0.1:58083_dt_%2Fp ] o.a.s.c.ZkController Register node as live in ZooKeeper:/live_nodes/127.0.0.1:58083_dt_%2Fp
[junit4] 2> 724077 INFO (TEST-CollectionsAPIDistributedZkTest.test-seed#[99013C7C0ABDF2BA]) [n:127.0.0.1:58083_dt_%2Fp ] o.a.s.c.c.SolrZkClient makePath: /live_nodes/127.0.0.1:58083_dt_%2Fp
[junit4] 2> 724077 INFO (TEST-CollectionsAPIDistributedZkTest.test-seed#[99013C7C0ABDF2BA]) [n:127.0.0.1:58083_dt_%2Fp ] o.a.s.c.c.SolrZkClient makePath: /overseer_elect
[junit4] 2> 724078 INFO (TEST-CollectionsAPIDistributedZkTest.test-seed#[99013C7C0ABDF2BA]) [n:127.0.0.1:58083_dt_%2Fp ] o.a.s.c.c.SolrZkClient makePath: /overseer_elect/election
[junit4] 2> 724078 INFO (TEST-CollectionsAPIDistributedZkTest.test-seed#[99013C7C0ABDF2BA]) [n:127.0.0.1:58083_dt_%2Fp ] o.a.s.c.Overseer Overseer (id=null) closing
[junit4] 2> 724078 INFO (TEST-CollectionsAPIDistributedZkTest.test-seed#[99013C7C0ABDF2BA]) [n:127.0.0.1:58083_dt_%2Fp ] o.a.s.c.LeaderElector Joined leadership election with path: /overseer_elect/election/94908130813935622-127.0.0.1:58083_dt_%2Fp-n_0000000000
[junit4] 2> 724078 INFO (TEST-CollectionsAPIDistributedZkTest.test-seed#[99013C7C0ABDF2BA]) [n:127.0.0.1:58083_dt_%2Fp ] o.a.s.c.OverseerElectionContext I am going to be the leader 127.0.0.1:58083_dt_%2Fp
[junit4] 2> 724079 INFO (TEST-CollectionsAPIDistributedZkTest.test-seed#[99013C7C0ABDF2BA]) [n:127.0.0.1:58083_dt_%2Fp ] o.a.s.c.c.SolrZkClient makePath: /overseer_elect/leader
[junit4] 2> 724079 INFO (TEST-CollectionsAPIDistributedZkTest.test-seed#[99013C7C0ABDF2BA]) [n:127.0.0.1:58083_dt_%2Fp ] o.a.s.c.Overseer Overseer (id=94908130813935622-127.0.0.1:58083_dt_%2Fp-n_0000000000) starting
[junit4] 2> 724080 INFO (TEST-CollectionsAPIDistributedZkTest.test-seed#[99013C7C0ABDF2BA]) [n:127.0.0.1:58083_dt_%2Fp ] o.a.s.c.c.SolrZkClient makePath: /overseer/queue-work
[junit4] 2> 724082 INFO (TEST-CollectionsAPIDistributedZkTest.test-seed#[99013C7C0ABDF2BA]) [n:127.0.0.1:58083_dt_%2Fp ] o.a.s.c.OverseerAutoReplicaFailoverThread Starting OverseerAutoReplicaFailoverThread autoReplicaFailoverWorkLoopDelay=10000 autoReplicaFailoverWaitAfterExpiration=10000 autoReplicaFailoverBadNodeExpiration=60000
[junit4] 2> 724082 INFO (TEST-CollectionsAPIDistributedZkTest.test-seed#[99013C7C0ABDF2BA]) [n:127.0.0.1:58083_dt_%2Fp ] o.a.s.c.c.ZkStateReader Updating cluster state from ZooKeeper...
[junit4] 2> 724082 INFO (OverseerCollectionConfigSetProcessor-94908130813935622-127.0.0.1:58083_dt_%2Fp-n_0000000000) [n:127.0.0.1:58083_dt_%2Fp ] o.a.s.c.OverseerTaskProcessor Process current queue of overseer operations
[junit4] 2> 724082 INFO (OverseerStateUpdate-94908130813935622-127.0.0.1:58083_dt_%2Fp-n_0000000000) [n:127.0.0.1:58083_dt_%2Fp ] o.a.s.c.Overseer Starting to work on the main queue
[junit4] 2> 724095 INFO (TEST-CollectionsAPIDistributedZkTest.test-seed#[99013C7C0ABDF2BA]) [n:127.0.0.1:58083_dt_%2Fp ] o.a.s.c.CoreContainer Security conf doesn't exist. Skipping setup for authorization module.
[junit4] 2> 724095 INFO (TEST-CollectionsAPIDistributedZkTest.test-seed#[99013C7C0ABDF2BA]) [n:127.0.0.1:58083_dt_%2Fp ] o.a.s.c.CoreContainer No authentication plugin used.
[junit4] 2> 724095 INFO (TEST-CollectionsAPIDistributedZkTest.test-seed#[99013C7C0ABDF2BA]) [n:127.0.0.1:58083_dt_%2Fp ] o.a.s.c.CoresLocator Looking for core definitions underneath /home/jenkins/workspace/Lucene-Solr-5.x-Linux/solr/build/solr-core/test/J1/temp/solr.cloud.CollectionsAPIDistributedZkTest_99013C7C0ABDF2BA-001/control-001/cores
[junit4] 2> 724095 INFO (TEST-CollectionsAPIDistributedZkTest.test-seed#[99013C7C0ABDF2BA]) [n:127.0.0.1:58083_dt_%2Fp ] o.a.s.c.SolrCore Created CoreDescriptor: {configSetProperties=configsetprops.json, config=solrconfig.xml, name=collection1, absoluteInstDir=/home/jenkins/workspace/Lucene-Solr-5.x-Linux/solr/build/solr-core/test/J1/temp/solr.cloud.CollectionsAPIDistributedZkTest_99013C7C0ABDF2BA-001/control-001/cores/collection1/, dataDir=data/, schema=schema.xml, shard=, coreNodeName=, loadOnStartup=true, transient=false, collection=control_collection, instanceDir=/home/jenkins/workspace/Lucene-Solr-5.x-Linux/solr/build/solr-core/test/J1/temp/solr.cloud.CollectionsAPIDistributedZkTest_99013C7C0ABDF2BA-001/control-001/cores/collection1}
[junit4] 2> 724096 INFO (TEST-CollectionsAPIDistributedZkTest.test-seed#[99013C7C0ABDF2BA]) [n:127.0.0.1:58083_dt_%2Fp ] o.a.s.c.CoresLocator Found core collection1 in /home/jenkins/workspace/Lucene-Solr-5.x-Linux/solr/build/solr-core/test/J1/temp/solr.cloud.CollectionsAPIDistributedZkTest_99013C7C0ABDF2BA-001/control-001/cores/collection1/
[junit4] 2> 724096 INFO (TEST-CollectionsAPIDistributedZkTest.test-seed#[99013C7C0ABDF2BA]) [n:127.0.0.1:58083_dt_%2Fp ] o.a.s.c.CoresLocator Found 1 core definitions
[junit4] 2> 724096 INFO (TEST-CollectionsAPIDistributedZkTest.test-seed#[99013C7C0ABDF2BA]) [n:127.0.0.1:58083_dt_%2Fp ] o.a.s.s.SolrDispatchFilter user.dir=/home/jenkins/workspace/Lucene-Solr-5.x-Linux/solr/build/solr-core/test/J1
[junit4] 2> 724096 INFO (TEST-CollectionsAPIDistributedZkTest.test-seed#[99013C7C0ABDF2BA]) [n:127.0.0.1:58083_dt_%2Fp ] o.a.s.s.SolrDispatchFilter SolrDispatchFilter.init() done
[junit4] 2> 724096 INFO (coreLoadExecutor-3208-thread-1-processing-n:127.0.0.1:58083_dt_%2Fp) [n:127.0.0.1:58083_dt_%2Fp c:control_collection x:collection1] o.a.s.c.ZkController publishing state=down
[junit4] 2> 724096 INFO (coreLoadExecutor-3208-thread-1-processing-n:127.0.0.1:58083_dt_%2Fp) [n:127.0.0.1:58083_dt_%2Fp c:control_collection x:collection1] o.a.s.c.ZkController numShards not found on descriptor - reading it from system property
[junit4] 2> 724097 INFO (OverseerStateUpdate-94908130813935622-127.0.0.1:58083_dt_%2Fp-n_0000000000) [n:127.0.0.1:58083_dt_%2Fp ] o.a.s.c.Overseer processMessage: queueSize: 1, message = {
[junit4] 2> "roles":null,
[junit4] 2> "numShards":"1",
[junit4] 2> "collection":"control_collection",
[junit4] 2> "shard":null,
[junit4] 2> "core":"collection1",
[junit4] 2> "operation":"state",
[junit4] 2> "state":"down",
[junit4] 2> "base_url":"http://127.0.0.1:58083/dt_/p",
[junit4] 2> "node_name":"127.0.0.1:58083_dt_%2Fp"} current state version: 0
[junit4] 2> 724097 INFO (coreLoadExecutor-3208-thread-1-processing-n:127.0.0.1:58083_dt_%2Fp) [n:127.0.0.1:58083_dt_%2Fp c:control_collection x:collection1] o.a.s.c.ZkController look for our core node name
[junit4] 2> 724097 INFO (OverseerStateUpdate-94908130813935622-127.0.0.1:58083_dt_%2Fp-n_0000000000) [n:127.0.0.1:58083_dt_%2Fp ] o.a.s.c.o.ReplicaMutator Update state numShards=1 message={
[junit4] 2> "roles":null,
[junit4] 2> "numShards":"1",
[junit4] 2> "collection":"control_collection",
[junit4] 2> "shard":null,
[junit4] 2> "core":"collection1",
[junit4] 2> "operation":"state",
[junit4] 2> "state":"down",
[junit4] 2> "base_url":"http://127.0.0.1:58083/dt_/p",
[junit4] 2> "node_name":"127.0.0.1:58083_dt_%2Fp"}
[junit4] 2> 724097 INFO (OverseerStateUpdate-94908130813935622-127.0.0.1:58083_dt_%2Fp-n_0000000000) [n:127.0.0.1:58083_dt_%2Fp ] o.a.s.c.o.ClusterStateMutator building a new cName: control_collection
[junit4] 2> 724097 INFO (OverseerStateUpdate-94908130813935622-127.0.0.1:58083_dt_%2Fp-n_0000000000) [n:127.0.0.1:58083_dt_%2Fp ] o.a.s.c.o.ReplicaMutator Assigning new node to shard shard=shard1
[junit4] 2> 724098 INFO (zkCallback-1310-thread-1-processing-n:127.0.0.1:58083_dt_%2Fp) [n:127.0.0.1:58083_dt_%2Fp ] o.a.s.c.c.ZkStateReader A cluster state change: WatchedEvent state:SyncConnected type:NodeDataChanged path:/clusterstate.json, has occurred - updating... (live nodes size: 1)
[junit4] 2> 725097 INFO (coreLoadExecutor-3208-thread-1-processing-n:127.0.0.1:58083_dt_%2Fp) [n:127.0.0.1:58083_dt_%2Fp c:control_collection x:collection1] o.a.s.c.ZkController waiting to find shard id in clusterstate for collection1
[junit4] 2> 725097 INFO (coreLoadExecutor-3208-thread-1-processing-n:127.0.0.1:58083_dt_%2Fp) [n:127.0.0.1:58083_dt_%2Fp c:control_collection x:collection1] o.a.s.c.ZkController Check for collection zkNode:control_collection
[junit4] 2> 725098 INFO (coreLoadExecutor-3208-thread-1-processing-n:127.0.0.1:58083_dt_%2Fp) [n:127.0.0.1:58083_dt_%2Fp c:control_collection x:collection1] o.a.s.c.ZkController Collection zkNode exists
[junit4] 2> 725098 INFO (coreLoadExecutor-3208-thread-1-processing-n:127.0.0.1:58083_dt_%2Fp) [n:127.0.0.1:58083_dt_%2Fp c:control_collection x:collection1] o.a.s.c.c.ZkStateReader Load collection config from:/collections/control_collection
[junit4] 2> 725098 INFO (coreLoadExecutor-3208-thread-1-processing-n:127.0.0.1:58083_dt_%2Fp) [n:127.0.0.1:58083_dt_%2Fp c:control_collection x:collection1] o.a.s.c.c.ZkStateReader path=/collections/control_collection configName=conf1 specified config exists in ZooKeeper
[junit4] 2> 725098 INFO (coreLoadExecutor-3208-thread-1-processing-n:127.0.0.1:58083_dt_%2Fp) [n:127.0.0.1:58083_dt_%2Fp c:control_collection x:collection1] o.a.s.c.SolrResourceLoader new SolrResourceLoader for directory: '/home/jenkins/workspace/Lucene-Solr-5.x-Linux/solr/build/solr-core/test/J1/temp/solr.cloud.CollectionsAPIDistributedZkTest_99013C7C0ABDF2BA-001/control-001/cores/collection1'
[junit4] 2> 725098 INFO (coreLoadExecutor-3208-thread-1-processing-n:127.0.0.1:58083_dt_%2Fp) [n:127.0.0.1:58083_dt_%2Fp c:control_collection x:collection1] o.a.s.c.SolrResourceLoader JNDI not configured for solr (NoInitialContextEx)
[junit4] 2> 725098 INFO (coreLoadExecutor-3208-thread-1-processing-n:127.0.0.1:58083_dt_%2Fp) [n:127.0.0.1:58083_dt_%2Fp c:control_collection x:collection1] o.a.s.c.SolrResourceLoader solr home defaulted to 'solr/' (could not find system property or JNDI)
[junit4] 2> 725099 INFO (coreLoadExecutor-3208-thread-1-processing-n:127.0.0.1:58083_dt_%2Fp) [n:127.0.0.1:58083_dt_%2Fp c:control_collection x:collection1] o.a.s.c.Config loaded config solrconfig.xml with version 0
[junit4] 2> 725103 INFO (coreLoadExecutor-3208-thread-1-processing-n:127.0.0.1:58083_dt_%2Fp) [n:127.0.0.1:58083_dt_%2Fp c:control_collection x:collection1] o.a.s.c.SolrConfig current version of requestparams : -1
[junit4] 2> 725118 INFO (coreLoadExecutor-3208-thread-1-processing-n:127.0.0.1:58083_dt_%2Fp) [n:127.0.0.1:58083_dt_%2Fp c:control_collection x:collection1] o.a.s.c.SolrConfig Using Lucene MatchVersion: 5.4.0
[junit4] 2> 725137 INFO (coreLoadExecutor-3208-thread-1-processing-n:127.0.0.1:58083_dt_%2Fp) [n:127.0.0.1:58083_dt_%2Fp c:control_collection x:collection1] o.a.s.c.Config Loaded SolrConfig: solrconfig.xml
[junit4] 2> 725142 INFO (coreLoadExecutor-3208-thread-1-processing-n:127.0.0.1:58083_dt_%2Fp) [n:127.0.0.1:58083_dt_%2Fp c:control_collection x:collection1] o.a.s.s.IndexSchema [collection1] Schema name=test
[junit4] 2> 725289 INFO (coreLoadExecutor-3208-thread-1-processing-n:127.0.0.1:58083_dt_%2Fp) [n:127.0.0.1:58083_dt_%2Fp c:control_collection x:collection1] o.a.s.s.OpenExchangeRatesOrgProvider Initialized with rates=open-exchange-rates.json, refreshInterval=1440.
[junit4] 2> 725294 INFO (coreLoadExecutor-3208-thread-1-processing-n:127.0.0.1:58083_dt_%2Fp) [n:127.0.0.1:58083_dt_%2Fp c:control_collection x:collection1] o.a.s.s.IndexSchema default search field in schema is text
[junit4] 2> 725295 INFO (coreLoadExecutor-3208-thread-1-processing-n:127.0.0.1:58083_dt_%2Fp) [n:127.0.0.1:58083_dt_%2Fp c:control_collection x:collection1] o.a.s.s.IndexSchema unique key field: id
[junit4] 2> 725299 INFO (coreLoadExecutor-3208-thread-1-processing-n:127.0.0.1:58083_dt_%2Fp) [n:127.0.0.1:58083_dt_%2Fp c:control_collection x:collection1] o.a.s.s.FileExchangeRateProvider Reloading exchange rates from file currency.xml
[junit4] 2> 725301 INFO (coreLoadExecutor-3208-thread-1-processing-n:127.0.0.1:58083_dt_%2Fp) [n:127.0.0.1:58083_dt_%2Fp c:control_collection x:collection1] o.a.s.s.FileExchangeRateProvider Reloading exchange rates from file currency.xml
[junit4] 2> 725303 INFO (coreLoadExecutor-3208-thread-1-processing-n:127.0.0.1:58083_dt_%2Fp) [n:127.0.0.1:58083_dt_%2Fp c:control_collection x:collection1] o.a.s.s.OpenExchangeRatesOrgProvider Reloading exchange rates from open-exchange-rates.json
[junit4] 2> 725303 WARN (coreLoadExecutor-3208-thread-1-processing-n:127.0.0.1:58083_dt_%2Fp) [n:127.0.0.1:58083_dt_%2Fp c:control_collection x:collection1] o.a.s.s.OpenExchangeRatesOrgProvider Unknown key IMPORTANT NOTE
[junit4] 2> 725303 WARN (coreLoadExecutor-3208-thread-1-processing-n:127.0.0.1:58083_dt_%2Fp) [n:127.0.0.1:58083_dt_%2Fp c:control_collection x:collection1] o.a.s.s.OpenExchangeRatesOrgProvider Expected key, got STRING
[junit4] 2> 725303 INFO (coreLoadExecutor-3208-thread-1-processing-n:127.0.0.1:58083_dt_%2Fp) [n:127.0.0.1:58083_dt_%2Fp c:control_collection x:collection1] o.a.s.s.OpenExchangeRatesOrgProvider Reloading exchange rates from open-exchange-rates.json
[junit4] 2> 725303 WARN (coreLoadExecutor-3208-thread-1-processing-n:127.0.0.1:58083_dt_%2Fp) [n:127.0.0.1:58083_dt_%2Fp c:control_collection x:collection1] o.a.s.s.OpenExchangeRatesOrgProvider Unknown key IMPORTANT NOTE
[junit4] 2> 725303 WARN (coreLoadExecutor-3208-thread-1-processing-n:127.0.0.1:58083_dt_%2Fp) [n:127.0.0.1:58083_dt_%2Fp c:control_collection x:collection1] o.a.s.s.OpenExchangeRatesOrgProvider Expected key, got STRING
[junit4] 2> 725304 INFO (coreLoadExecutor-3208-thread-1-processing-n:127.0.0.1:58083_dt_%2Fp) [n:127.0.0.1:58083_dt_%2Fp c:control_collection x:collection1] o.a.s.c.ConfigSetProperties Did not find ConfigSet properties, assuming default properties: Can't find resource 'configsetprops.json' in classpath or '/configs/conf1', cwd=/home/jenkins/workspace/Lucene-Solr-5.x-Linux/solr/build/solr-core/test/J1
[junit4] 2> 725304 INFO (coreLoadExecutor-3208-thread-1-processing-n:127.0.0.1:58083_dt_%2Fp) [n:127.0.0.1:58083_dt_%2Fp c:control_collection x:collection1] o.a.s.c.CoreContainer Creating SolrCore 'collection1' using configuration from collection control_collection
[junit4] 2> 725304 INFO (coreLoadExecutor-3208-thread-1-processing-n:127.0.0.1:58083_dt_%2Fp) [n:127.0.0.1:58083_dt_%2Fp c:control_collection s:shard1 r:core_node1 x:collection1] o.a.s.c.SolrCore org.apache.solr.core.MockDirectoryFactory
[junit4] 2> 725304 INFO (coreLoadExecutor-3208-thread-1-processing-n:127.0.0.1:58083_dt_%2Fp) [n:127.0.0.1:58083_dt_%2Fp c:control_collection s:shard1 r:core_node1 x:collection1] o.a.s.c.SolrCore [[collection1] ] Opening new SolrCore at [/home/jenkins/workspace/Lucene-Solr-5.x-Linux/solr/build/solr-core/test/J1/temp/solr.cloud.CollectionsAPIDistributedZkTest_99013C7C0ABDF2BA-001/control-001/cores/collection1], dataDir=[null]
[junit4] 2> 725304 INFO (coreLoadExecutor-3208-thread-1-processing-n:127.0.0.1:58083_dt_%2Fp) [n:127.0.0.1:58083_dt_%2Fp c:control_collection s:shard1 r:core_node1 x:collection1] o.a.s.c.JmxMonitoredMap JMX monitoring is enabled. Adding Solr mbeans to JMX Server: com.sun.jmx.mbeanserver.JmxMBeanServer@41faf4a2
[junit4] 2> 725305 INFO (coreLoadExecutor-3208-thread-1-processing-n:127.0.0.1:58083_dt_%2Fp) [n:127.0.0.1:58083_dt_%2Fp c:control_collection s:shard1 r:core_node1 x:collection1] o.a.s.c.CachingDirectoryFactory return new directory for /home/jenkins/workspace/Lucene-Solr-5.x-Linux/solr/build/solr-core/test/J1/temp/solr.cloud.CollectionsAPIDistributedZkTest_99013C7C0ABDF2BA-001/control-001/cores/collection1/data
[junit4] 2> 725305 INFO (coreLoadExecutor-3208-thread-1-processing-n:127.0.0.1:58083_dt_%2Fp) [n:127.0.0.1:58083_dt_%2Fp c:control_collection s:shard1 r:core_node1 x:collection1] o.a.s.c.SolrCore New index directory detected: old=null new=/home/jenkins/workspace/Lucene-Solr-5.x-Linux/solr/build/solr-core/test/J1/temp/solr.cloud.CollectionsAPIDistributedZkTest_99013C7C0ABDF2BA-001/control-001/cores/collection1/data/index/
[junit4] 2> 725305 WARN (coreLoadExecutor-3208-thread-1-processing-n:127.0.0.1:58083_dt_%2Fp) [n:127.0.0.1:58083_dt_%2Fp c:control_collection s:shard1 r:core_node1 x:collection1] o.a.s.c.SolrCore [collection1] Solr index directory '/home/jenkins/workspace/Lucene-Solr-5.x-Linux/solr/build/solr-core/test/J1/temp/solr.cloud.CollectionsAPIDistributedZkTest_99013C7C0ABDF2BA-001/control-001/cores/collection1/data/index' doesn't exist. Creating new index...
[junit4] 2> 725305 INFO (coreLoadExecutor-3208-thread-1-processing-n:127.0.0.1:58083_dt_%2Fp) [n:127.0.0.1:58083_dt_%2Fp c:control_collection s:shard1 r:core_node1 x:collection1] o.a.s.c.CachingDirectoryFactory return new directory for /home/jenkins/workspace/Lucene-Solr-5.x-Linux/solr/build/solr-core/test/J1/temp/solr.cloud.CollectionsAPIDistributedZkTest_99013C7C0ABDF2BA-001/control-001/cores/collection1/data/index
[junit4] 2> 725305 INFO (coreLoadExecutor-3208-thread-1-processing-n:127.0.0.1:58083_dt_%2Fp) [n:127.0.0.1:58083_dt_%2Fp c:control_collection s:shard1 r:core_node1 x:collection1] o.a.s.u.RandomMergePolicy RandomMergePolicy wrapping class org.apache.lucene.index.TieredMergePolicy: [TieredMergePolicy: maxMergeAtOnce=35, maxMergeAtOnceExplicit=11, maxMergedSegmentMB=67.482421875, floorSegmentMB=0.388671875, forceMergeDeletesPctAllowed=28.27706508549388, segmentsPerTier=34.0, maxCFSSegmentSizeMB=8.796093022207999E12, noCFSRatio=0.6974240146089224
[junit4] 2> 725306 INFO (coreLoadExecutor-3208-thread-1-processing-n:127.0.0.1:58083_dt_%2Fp) [n:127.0.0.1:58083_dt_%2Fp c:control_collection s:shard1 r:core_node1 x:collection1] o.a.s.c.SolrCore SolrDeletionPolicy.onCommit: commits: num=1
[junit4] 2> commit{dir=MockDirectoryWrapper(RAMDirectory@640f91fa lockFactory=org.apache.lucene.store.SingleInstanceLockFactory@3a38e768),segFN=segments_1,generation=1}
[junit4] 2> 725306 INFO (coreLoadExecutor-3208-thread-1-processing-n:127.0.0.1:58083_dt_%2Fp) [n:127.0.0.1:58083_dt_%2Fp c:control_collection s:shard1 r:core_node1 x:collection1] o.a.s.c.SolrCore newest commit generation = 1
[junit4] 2> 725306 INFO (OldIndexDirectoryCleanupThreadForCore-collection1) [n:127.0.0.1:58083_dt_%2Fp c:control_collection s:shard1 r:core_node1 x:collection1] o.a.s.c.SolrCore Looking for old index directories to cleanup for core collection1 in /home/jenkins/workspace/Lucene-Solr-5.x-Linux/solr/build/solr-core/test/J1/temp/solr.cloud.CollectionsAPIDistributedZkTest_99013C7C0ABDF2BA-001/control-001/cores/collection1/data/
[junit4] 2> 725306 WARN (OldIndexDirectoryCleanupThreadForCore-collection1) [n:127.0.0.1:58083_dt_%2Fp c:control_collection s:shard1 r:core_node1 x:collection1] o.a.s.c.DirectoryFactory /home/jenkins/workspace/Lucene-Solr-5.x-Linux/solr/build/solr-core/test/J1/temp/solr.cloud.CollectionsAPIDistributedZkTest_99013C7C0ABDF2BA-001/control-001/cores/collection1/data/ does not point to a valid data directory; skipping clean-up of old index directories.
[junit4] 2> 725309 INFO (coreLoadExecutor-3208-thread-1-processing-n:127.0.0.1:58083_dt_%2Fp) [n:127.0.0.1:58083_dt_%2Fp c:control_collection s:shard1 r:core_node1 x:collection1] o.a.s.u.p.UpdateRequestProcessorChain creating updateRequestProcessorChain "nodistrib"
[junit4] 2> 725309 INFO (coreLoadExecutor-3208-thread-1-processing-n:127.0.0.1:58083_dt_%2Fp) [n:127.0.0.1:58083_dt_%2Fp c:control_collection s:shard1 r:core_node1 x:collection1] o.a.s.u.p.UpdateRequestProcessorChain creating updateRequestProcessorChain "dedupe"
[junit4] 2> 725309 INFO (coreLoadExecutor-3208-thread-1-processing-n:127.0.0.1:58083_dt_%2Fp) [n:127.0.0.1:58083_dt_%2Fp c:control_collection s:shard1 r:core_node1 x:collection1] o.a.s.u.p.UpdateRequestProcessorChain inserting DistributedUpdateProcessorFactory into updateRequestProcessorChain "dedupe"
[junit4] 2> 725309 INFO (coreLoadExecutor-3208-thread-1-processing-n:127.0.0.1:58083_dt_%2Fp) [n:127.0.0.1:58083_dt_%2Fp c:control_collection s:shard1 r:core_node1 x:collection1] o.a.s.u.p.UpdateRequestProcessorChain creating updateRequestProcessorChain "stored_sig"
[junit4] 2> 725309 INFO (coreLoadExecutor-3208-thread-1-processing-n:127.0.0.1:58083_dt_%2Fp) [n:127.0.0.1:58083_dt_%2Fp c:control_collection s:shard1 r:core_node1 x:collection1] o.a.s.u.p.UpdateRequestProcessorChain inserting DistributedUpdateProcessorFactory into updateRequestProcessorChain "stored_sig"
[junit4] 2> 725309 INFO (coreLoadExecutor-3208-thread-1-processing-n:127.0.0.1:58083_dt_%2Fp) [n:127.0.0.1:58083_dt_%2Fp c:control_collection s:shard1 r:core_node1 x:collection1] o.a.s.u.p.UpdateRequestProcessorChain creating updateRequestProcessorChain "distrib-dup-test-chain-explicit"
[junit4] 2> 725309 INFO (coreLoadExecutor-3208-thread-1-processing-n:127.0.0.1:58083_dt_%2Fp) [n:127.0.0.1:58083_dt_%2Fp c:control_collection s:shard1 r:core_node1 x:collection1] o.a.s.u.p.UpdateRequestProcessorChain creating updateRequestProcessorChain "distrib-dup-test-chain-implicit"
[junit4] 2> 725310 INFO (coreLoadExecutor-3208-thread-1-processing-n:127.0.0.1:58083_dt_%2Fp) [n:127.0.0.1:58083_dt_%2Fp c:control_collection s:shard1 r:core_node1 x:collection1] o.a.s.u.p.UpdateRequestProcessorChain inserting DistributedUpdateProcessorFactory into updateRequestProcessorChain "distrib-dup-test-chain-implicit"
[junit4] 2> 725310 INFO (coreLoadExecutor-3208-thread-1-processing-n:127.0.0.1:58083_dt_%2Fp) [n:127.0.0.1:58083_dt_%2Fp c:control_collection s:shard1 r:core_node1 x:collection1] o.a.s.c.SolrCore no updateRequestProcessorChain defined as default, creating implicit default
[junit4] 2> 725310 WARN (coreLoadExecutor-3208-thread-1-processing-n:127.0.0.1:58083_dt_%2Fp) [n:127.0.0.1:58083_dt_%2Fp c:control_collection s:shard1 r:core_node1 x:collection1] o.a.s.c.RequestHandlers INVALID paramSet a in requestHandler {type = requestHandler,name = /dump,class = DumpRequestHandler,args = {defaults={a=A,b=B}}}
[junit4] 2> 725312 INFO (coreLoadExecutor-3208-thread-1-processing-n:127.0.0.1:58083_dt_%2Fp) [n:127.0.0.1:58083_dt_%2Fp c:control_collection s:shard1 r:core_node1 x:collection1] o.a.s.h.l.XMLLoader xsltCacheLifetimeSeconds=60
[junit4] 2> 725313 INFO (coreLoadExecutor-3208-thread-1-processing-n:127.0.0.1:58083_dt_%2Fp) [n:127.0.0.1:58083_dt_%2Fp c:control_collection s:shard1 r:core_node1 x:collection1] o.a.s.h.l.XMLLoader xsltCacheLifetimeSeconds=60
[junit4] 2> 725314 INFO (coreLoadExecutor-3208-thread-1-processing-n:127.0.0.1:58083_dt_%2Fp) [n:127.0.0.1:58083_dt_%2Fp c:control_collection s:shard1 r:core_node1 x:collection1] o.a.s.h.l.XMLLoader xsltCacheLifetimeSeconds=60
[junit4] 2> 725314 INFO (coreLoadExecutor-3208-thread-1-processing-n:127.0.0.1:58083_dt_%2Fp) [n:127.0.0.1:58083_dt_%2Fp c:control_collection s:shard1 r:core_node1 x:collection1] o.a.s.h.l.XMLLoader xsltCacheLifetimeSeconds=60
[junit4] 2> 725317 INFO (coreLoadExecutor-3208-thread-1-processing-n:127.0.0.1:58083_dt_%2Fp) [n:127.0.0.1:58083_dt_%2Fp c:control_collection s:shard1 r:core_node1 x:collection1] o.a.s.c.RequestHandlers Registered paths: /replication,/schema,/admin/threads,/admin/file,/get,/admin/properties,/config,/admin/plugins,/dump,/admin/segments,/admin/luke,/update/json/docs,/update/json,/admin/ping,/admin/mbeans,/admin/system,/admin/logging,/update,/update/csv,standard
[junit4] 2> 725317 INFO (coreLoadExecutor-3208-thread-1-processing-n:127.0.0.1:58083_dt_%2Fp) [n:127.0.0.1:58083_dt_%2Fp c:control_collection s:shard1 r:core_node1 x:collection1] o.a.s.c.SolrCore Using default statsCache cache: org.apache.solr.search.stats.LocalStatsCache
[junit4] 2> 725317 INFO (coreLoadExecutor-3208-thread-1-processing-n:127.0.0.1:58083_dt_%2Fp) [n:127.0.0.1:58083_dt_%2Fp c:control_collection s:shard1 r:core_node1 x:collection1] o.a.s.u.UpdateHandler Using UpdateLog implementation: org.apache.solr.update.UpdateLog
[junit4] 2> 725317 INFO (coreLoadExecutor-3208-thread-1-processing-n:127.0.0.1:58083_dt_%2Fp) [n:127.0.0.1:58083_dt_%2Fp c:control_collection s:shard1 r:core_node1 x:collection1] o.a.s.u.UpdateLog Initializing UpdateLog: dataDir= defaultSyncLevel=FLUSH numRecordsToKeep=100 maxNumLogsToKeep=10 numVersionBuckets=65536
[junit4] 2> 725318 INFO (coreLoadExecutor-3208-thread-1-processing-n:127.0.0.1:58083_dt_%2Fp) [n:127.0.0.1:58083_dt_%2Fp c:control_collection s:shard1 r:core_node1 x:collection1] o.a.s.c.SolrCore Hard AutoCommit: disabled
[junit4] 2> 725318 INFO (coreLoadExecutor-3208-thread-1-processing-n:127.0.0.1:58083_dt_%2Fp) [n:127.0.0.1:58083_dt_%2Fp c:control_collection s:shard1 r:core_node1 x:collection1] o.a.s.c.SolrCore Soft AutoCommit: disabled
[junit4] 2> 725318 INFO (coreLoadExecutor-3208-thread-1-processing-n:127.0.0.1:58083_dt_%2Fp) [n:127.0.0.1:58083_dt_%2Fp c:control_collection s:shard1 r:core_node1 x:collection1] o.a.s.u.RandomMergePolicy RandomMergePolicy wrapping class org.apache.lucene.index.LogByteSizeMergePolicy: [LogByteSizeMergePolicy: minMergeSize=1677721, mergeFactor=40, maxMergeSize=2147483648, maxMergeSizeForForcedMerge=9223372036854775807, calibrateSizeByDeletes=true, maxMergeDocs=2147483647, maxCFSSegmentSizeMB=8.796093022207999E12, noCFSRatio=1.0]
[junit4] 2> 725319 INFO (coreLoadExecutor-3208-thread-1-processing-n:127.0.0.1:58083_dt_%2Fp) [n:127.0.0.1:58083_dt_%2Fp c:control_collection s:shard1 r:core_node1 x:collection1] o.a.s.c.SolrCore SolrDeletionPolicy.onInit: commits: num=1
[junit4] 2> commit{dir=MockDirectoryWrapper(RAMDirectory@640f91fa lockFactory=org.apache.lucene.store.SingleInstanceLockFactory@3a38e768),segFN=segments_1,generation=1}
[junit4] 2> 725319 INFO (coreLoadExecutor-3208-thread-1-processing-n:127.0.0.1:58083_dt_%2Fp) [n:127.0.0.1:58083_dt_%2Fp c:control_collection s:shard1 r:core_node1 x:collection1] o.a.s.c.SolrCore newest commit generation = 1
[junit4] 2> 725319 INFO (coreLoadExecutor-3208-thread-1-processing-n:127.0.0.1:58083_dt_%2Fp) [n:127.0.0.1:58083_dt_%2Fp c:control_collection s:shard1 r:core_node1 x:collection1] o.a.s.s.SolrIndexSearcher Opening Searcher@22e21deb[collection1] main
[junit4] 2> 725319 INFO (coreLoadExecutor-3208-thread-1-processing-n:127.0.0.1:58083_dt_%2Fp) [n:127.0.0.1:58083_dt_%2Fp c:control_collection s:shard1 r:core_node1 x:collection1] o.a.s.c.c.ZkStateReader Load collection config from:/collections/control_collection
[junit4] 2> 725319 INFO (coreLoadExecutor-3208-thread-1-processing-n:127.0.0.1:58083_dt_%2Fp) [n:127.0.0.1:58083_dt_%2Fp c:control_collection s:shard1 r:core_node1 x:collection1] o.a.s.c.c.ZkStateReader path=/collections/control_collection configName=conf1 specified config exists in ZooKeeper
[junit4] 2> 725319 INFO (coreLoadExecutor-3208-thread-1-processing-n:127.0.0.1:58083_dt_%2Fp) [n:127.0.0.1:58083_dt_%2Fp c:control_collection s:shard1 r:core_node1 x:collection1] o.a.s.r.ManagedResourceStorage Setting up ZooKeeper-based storage for the RestManager with znodeBase: /configs/conf1
[junit4] 2> 725319 INFO (coreLoadExecutor-3208-thread-1-processing-n:127.0.0.1:58083_dt_%2Fp) [n:127.0.0.1:58083_dt_%2Fp c:control_collection s:shard1 r:core_node1 x:collection1] o.a.s.r.ManagedResourceStorage Configured ZooKeeperStorageIO with znodeBase: /configs/conf1
[junit4] 2> 725319 INFO (coreLoadExecutor-3208-thread-1-processing-n:127.0.0.1:58083_dt_%2Fp) [n:127.0.0.1:58083_dt_%2Fp c:control_collection s:shard1 r:core_node1 x:collection1] o.a.s.r.RestManager Initializing RestManager with initArgs: {}
[junit4] 2> 725319 INFO (coreLoadExecutor-3208-thread-1-processing-n:127.0.0.1:58083_dt_%2Fp) [n:127.0.0.1:58083_dt_%2Fp c:control_collection s:shard1 r:core_node1 x:collection1] o.a.s.r.ManagedResourceStorage Reading _rest_managed.json using ZooKeeperStorageIO:path=/configs/conf1
[junit4] 2> 725320 INFO (coreLoadExecutor-3208-thread-1-processing-n:127.0.0.1:58083_dt_%2Fp) [n:127.0.0.1:58083_dt_%2Fp c:control_collection s:shard1 r:core_node1 x:collection1] o.a.s.r.ManagedResourceStorage No data found for znode /configs/conf1/_rest_managed.json
[junit4] 2> 725320 INFO (coreLoadExecutor-3208-thread-1-processing-n:127.0.0.1:58083_dt_%2Fp) [n:127.0.0.1:58083_dt_%2Fp c:control_collection s:shard1 r:core_node1 x:collection1] o.a.s.r.ManagedResourceStorage Loaded null at path _rest_managed.json using ZooKeeperStorageIO:path=/configs/conf1
[junit4] 2> 725320 INFO (coreLoadExecutor-3208-thread-1-processing-n:127.0.0.1:58083_dt_%2Fp) [n:127.0.0.1:58083_dt_%2Fp c:control_collection s:shard1 r:core_node1 x:collection1] o.a.s.r.RestManager Initializing 0 registered ManagedResources
[junit4] 2> 725320 INFO (coreLoadExecutor-3208-thread-1-processing-n:127.0.0.1:58083_dt_%2Fp) [n:127.0.0.1:58083_dt_%2Fp c:control_collection s:shard1 r:core_node1 x:collection1] o.a.s.h.ReplicationHandler Commits will be reserved for 10000
[junit4] 2> 725320 INFO (searcherExecutor-3209-thread-1-processing-r:core_node1 x:collection1 c:control_collection s:shard1 n:127.0.0.1:58083_dt_%2Fp) [n:127.0.0.1:58083_dt_%2Fp c:control_collection s:shard1 r:core_node1 x:collection1] o.a.s.c.SolrCore [collection1] Registered new searcher Searcher@22e21deb[collection1] main{ExitableDirectoryReader(UninvertingDirectoryReader())}
[junit4] 2> 725320 INFO (coreLoadExecutor-3208-thread-1-processing-n:127.0.0.1:58083_dt_%2Fp) [n:127.0.0.1:58083_dt_%2Fp c:control_collection s:shard1 r:core_node1 x:collection1] o.a.s.u.UpdateLog Looking up max value of version field to seed version buckets
[junit4] 2> 725320 INFO (coreLoadExecutor-3208-thread-1-processing-n:127.0.0.1:58083_dt_%2Fp) [n:127.0.0.1:58083_dt_%2Fp c:control_collection s:shard1 r:core_node1 x:collection1] o.a.s.u.VersionInfo Refreshing highest value of _version_ for 65536 version buckets from index
[junit4] 2> 725320 INFO (coreLoadExecutor-3208-thread-1-processing-n:127.0.0.1:58083_dt_%2Fp) [n:127.0.0.1:58083_dt_%2Fp c:control_collection s:shard1 r:core_node1 x:collection1] o.a.s.u.VersionInfo No terms found for _version_, cannot seed version bucket highest value from index
[junit4] 2> 725321 INFO (coreLoadExecutor-3208-thread-1-processing-n:127.0.0.1:58083_dt_%2Fp) [n:127.0.0.1:58083_dt_%2Fp c:control_collection s:shard1 r:core_node1 x:collection1] o.a.s.u.UpdateLog Could not find max version in index or recent updates, using new clock 1518530094529773568
[junit4] 2> 725322 INFO (coreLoadExecutor-3208-thread-1-processing-n:127.0.0.1:58083_dt_%2Fp) [n:127.0.0.1:58083_dt_%2Fp c:control_collection s:shard1 r:core_node1 x:collection1] o.a.s.u.UpdateLog Took 1.0ms to seed version buckets with highest version 1518530094529773568
[junit4] 2> 725322 INFO (coreLoadExecutor-3208-thread-1-processing-n:127.0.0.1:58083_dt_%2Fp) [n:127.0.0.1:58083_dt_%2Fp c:control_collection s:shard1 r:core_node1 x:collection1] o.a.s.c.ZkController watch zkdir /configs/conf1
[junit4] 2> 725322 INFO (coreLoadExecutor-3208-thread-1-processing-n:127.0.0.1:58083_dt_%2Fp) [n:127.0.0.1:58083_dt_%2Fp c:control_collection s:shard1 r:core_node1 x:collection1] o.a.s.c.CoreContainer registering core: collection1
[junit4] 2> 725322 INFO (coreZkRegister-3202-thread-1-processing-r:core_node1 x:collection1 c:control_collection s:shard1 n:127.0.0.1:58083_dt_%2Fp) [n:127.0.0.1:58083_dt_%2Fp c:control_collection s:shard1 r:core_node1 x:collection1] o.a.s.c.ZkController Register replica - core:collection1 address:http://127.0.0.1:58083/dt_/p collection:control_collection shard:shard1
[junit4] 2> 725323 INFO (coreZkRegister-3202-thread-1-processing-r:core_node1 x:collection1 c:control_collection s:shard1 n:127.0.0.1:58083_dt_%2Fp) [n:127.0.0.1:58083_dt_%2Fp c:control_collection s:shard1 r:core_node1 x:collection1] o.a.s.c.c.SolrZkClient makePath: /collections/control_collection/leader_elect/shard1/election
[junit4] 2> 725325 INFO (coreZkRegister-3202-thread-1-processing-r:core_node1 x:collection1 c:control_collection s:shard1 n:127.0.0.1:58083_dt_%2Fp) [n:127.0.0.1:58083_dt_%2Fp c:control_collection s:shard1 r:core_node1 x:collection1] o.a.s.c.LeaderElector Joined leadership election with path: /collections/control_collection/leader_elect/shard1/election/94908130813935622-core_node1-n_0000000000
[junit4] 2> 725325 INFO (coreZkRegister-3202-thread-1-processing-r:core_node1 x:collection1 c:control_collection s:shard1 n:127.0.0.1:58083_dt_%2Fp) [n:127.0.0.1:58083_dt_%2Fp c:control_collection s:shard1 r:core_node1 x:collection1] o.a.s.c.ShardLeaderElectionContext Running the leader process for shard shard1
[junit4] 2> 725326 INFO (coreZkRegister-3202-thread-1-processing-r:core_node1 x:collection1 c:control_collection s:shard1 n:127.0.0.1:58083_dt_%2Fp) [n:127.0.0.1:58083_dt_%2Fp c:control_collection s:shard1 r:core_node1 x:collection1] o.a.s.c.ShardLeaderElectionContext Enough replicas found to continue.
[junit4] 2> 725326 INFO (coreZkRegister-3202-thread-1-processing-r:core_node1 x:collection1 c:control_collection s:shard1 n:127.0.0.1:58083_dt_%2Fp) [n:127.0.0.1:58083_dt_%2Fp c:control_collection s:shard1 r:core_node1 x:collection1] o.a.s.c.ShardLeaderElectionContext I may be the new leader - try and sync
[junit4] 2> 725326 INFO (coreZkRegister-3202-thread-1-processing-r:core_node1 x:collection1 c:control_collection s:shard1 n:127.0.0.1:58083_dt_%2Fp) [n:127.0.0.1:58083_dt_%2Fp c:control_collection s:shard1 r:core_node1 x:collection1] o.a.s.c.SyncStrategy Sync replicas to http://127.0.0.1:58083/dt_/p/collection1/
[junit4] 2> 725326 INFO (OverseerStateUpdate-94908130813935622-127.0.0.1:58083_dt_%2Fp-n_0000000000) [n:127.0.0.1:58083_dt_%2Fp ] o.a.s.c.Overseer processMessage: queueSize: 1, message = {
[junit4] 2> "operation":"leader",
[junit4] 2> "shard":"shard1",
[junit4] 2> "collection":"control_collection"} current state version: 1
[junit4] 2> 725326 INFO (coreZkRegister-3202-thread-1-processing-r:core_node1 x:collection1 c:control_collection s:shard1 n:127.0.0.1:58083_dt_%2Fp) [n:127.0.0.1:58083_dt_%2Fp c:control_collection s:shard1 r:core_node1 x:collection1] o.a.s.c.SyncStrategy Sync Success - now sync replicas to me
[junit4] 2> 725326 INFO (coreZkRegister-3202-thread-1-processing-r:core_node1 x:collection1 c:control_collection s:shard1 n:127.0.0.1:58083_dt_%2Fp) [n:127.0.0.1:58083_dt_%2Fp c:control_collection s:shard1 r:core_node1 x:collection1] o.a.s.c.SyncStrategy http://127.0.0.1:58083/dt_/p/collection1/ has no replicas
[junit4] 2> 725326 INFO (coreZkRegister-3202-thread-1-processing-r:core_node1 x:collection1 c:control_collection s:shard1 n:127.0.0.1:58083_dt_%2Fp) [n:127.0.0.1:58083_dt_%2Fp c:control_collection s:shard1 r:core_node1 x:collection1] o.a.s.c.c.SolrZkClient makePath: /collections/control_collection/leaders/shard1
[junit4] 2> 725327 INFO (coreZkRegister-3202-thread-1-processing-r:core_node1 x:collection1 c:control_collection s:shard1 n:127.0.0.1:58083_dt_%2Fp) [n:127.0.0.1:58083_dt_%2Fp c:control_collection s:shard1 r:core_node1 x:collection1] o.a.s.c.ShardLeaderElectionContextBase Creating leader registration node
[junit4] 2> 725328 INFO (coreZkRegister-3202-thread-1-processing-r:core_node1 x:collection1 c:control_collection s:shard1 n:127.0.0.1:58083_dt_%2Fp) [n:127.0.0.1:58083_dt_%2Fp c:control_collection s:shard1 r:core_node1 x:collection1] o.a.s.c.ShardLeaderElectionContext I am the new leader: http://127.0.0.1:58083/dt_/p/collection1/ shard1
[junit4] 2> 725329 INFO (OverseerStateUpdate-94908130813935622-127.0.0.1:58083_dt_%2Fp-n_0000000000) [n:127.0.0.1:58083_dt_%2Fp ] o.a.s.c.Overseer processMessage: queueSize: 1, message = {
[junit4] 2> "operation":"leader",
[junit4] 2> "shard":"shard1",
[junit4] 2> "collection":"control_collection",
[junit4] 2> "base_url":"http://127.0.0.1:58083/dt_/p",
[junit4] 2> "core":"collection1",
[junit4] 2> "state":"active"} current state version: 1
[junit4] 2> 725430 INFO (zkCallback-1310-thread-1-processing-n:127.0.0.1:58083_dt_%2Fp) [n:127.0.0.1:58083_dt_%2Fp ] o.a.s.c.c.ZkStateReader A cluster state change: WatchedEvent state:SyncConnected type:NodeDataChanged path:/clusterstate.json, has occurred - updating... (live nodes size: 1)
[junit4] 2> 725479 INFO (coreZkRegister-3202-thread-1-processing-r:core_node1 x:collection1 c:control_collection s:shard1 n:127.0.0.1:58083_dt_%2Fp) [n:127.0.0.1:58083_dt_%2Fp c:control_collection s:shard1 r:core_node1 x:collection1] o.a.s.c.ZkController We are http://127.0.0.1:58083/dt_/p/collection1/ and leader is http://127.0.0.1:58083/dt_/p/collection1/
[junit4] 2> 725479 INFO (coreZkRegister-3202-thread-1-processing-r:core_node1 x:collection1 c:control_collection s:shard1 n:127.0.0.1:58083_dt_%2Fp) [n:127.0.0.1:58083_dt_%2Fp c:control_collection s:shard1 r:core_node1 x:collection1] o.a.s.c.ZkController No LogReplay needed for core=collection1 baseURL=http://127.0.0.1:58083/dt_/p
[junit4] 2> 725479 INFO (coreZkRegister-3202-thread-1-processing-r:core_node1 x:collection1 c:control_collection s:shard1 n:127.0.0.1:58083_dt_%2Fp) [n:127.0.0.1:58083_dt_%2Fp c:control_collection s:shard1 r:core_node1 x:collection1] o.a.s.c.ZkController I am the leader, no recovery necessary
[junit4] 2> 725479 INFO (coreZkRegister-3202-thread-1-processing-r:core_node1 x:collection1 c:control_collection s:shard1 n:127.0.0.1:58083_dt_%2Fp) [n:127.0.0.1:58083_dt_%2Fp c:control_collection s:shard1 r:core_node1 x:collection1] o.a.s.c.ZkController publishing state=active
[junit4] 2> 725479 INFO (coreZkRegister-3202-thread-1-processing-r:core_node1 x:collection1 c:control_collection s:shard1 n:127.0.0.1:58083_dt_%2Fp) [n:127.0.0.1:58083_dt_%2Fp c:control_collection s:shard1 r:core_node1 x:collection1] o.a.s.c.ZkController numShards not found on descriptor - reading it from system property
[junit4] 2> 725480 INFO (OverseerStateUpdate-94908130813935622-127.0.0.1:58083_dt_%2Fp-n_0000000000) [n:127.0.0.1:58083_dt_%2Fp ] o.a.s.c.Overseer processMessage: queueSize: 1, message = {
[junit4] 2> "roles":null,
[junit4] 2> "core_node_name":"core_node1",
[junit4] 2> "numShards":"1",
[junit4] 2> "collection":"control_collection",
[junit4] 2> "shard":"shard1",
[junit4] 2> "core":"collection1",
[junit4] 2> "operation":"state",
[junit4] 2> "state":"active",
[junit4] 2> "base_url":"http://127.0.0.1:58083/dt_/p",
[junit4] 2> "node_name":"127.0.0.1:58083_dt_%2Fp"} current state version: 2
[junit4] 2> 725480 INFO (OverseerStateUpdate-94908130813935622-127.0.0.1:58083_dt_%2Fp-n_0000000000) [n:127.0.0.1:58083_dt_%2Fp ] o.a.s.c.o.ReplicaMutator Update state numShards=1 message={
[junit4] 2> "roles":null,
[junit4] 2> "core_node_name":"core_node1",
[junit4] 2> "numShards":"1",
[junit4] 2> "collection":"control_collection",
[junit4] 2> "shard":"shard1",
[junit4] 2> "core":"collection1",
[junit4] 2> "operation":"state",
[junit4] 2> "state":"active",
[junit4] 2> "base_url":"http://127.0.0.1:58083/dt_/p",
[junit4] 2> "node_name":"127.0.0.1:58083_dt_%2Fp"}
[junit4] 2> 725581 INFO (zkCallback-1310-thread-1-processing-n:127.0.0.1:58083_dt_%2Fp) [n:127.0.0.1:58083_dt_%2Fp ] o.a.s.c.c.ZkStateReader A cluster state change: WatchedEvent state:SyncConnected type:NodeDataChanged path:/clusterstate.json, has occurred - updating... (live nodes size: 1)
[junit4] 2> 725597 INFO (TEST-CollectionsAPIDistributedZkTest.test-seed#[99013C7C0ABDF2BA]) [ ] o.a.s.c.c.SolrZkClient Using default ZkCredentialsProvider
[junit4] 2> 725598 INFO (TEST-CollectionsAPIDistributedZkTest.test-seed#[99013C7C0ABDF2BA]) [ ] o.a.s.c.c.ConnectionManager Waiting for client to connect to ZooKeeper
[junit4] 2> 725599 INFO (zkCallback-1312-thread-1) [ ] o.a.s.c.c.ConnectionManager Watcher org.apache.solr.common.cloud.ConnectionManager@5c3da732 name:ZooKeeperConnection Watcher:127.0.0.1:60677/solr got event WatchedEvent state:SyncConnected type:None path:null path:null type:None
[junit4] 2> 725599 INFO (TEST-CollectionsAPIDistributedZkTest.test-seed#[99013C7C0ABDF2BA]) [ ] o.a.s.c.c.ConnectionManager Client is connected to ZooKeeper
[junit4] 2> 725599 INFO (TEST-CollectionsAPIDistributedZkTest.test-seed#[99013C7C0ABDF2BA]) [ ] o.a.s.c.c.SolrZkClient Using default ZkACLProvider
[junit4] 2> 725599 INFO (TEST-CollectionsAPIDistributedZkTest.test-seed#[99013C7C0ABDF2BA]) [ ] o.a.s.c.c.ZkStateReader Updating cluster state from ZooKeeper...
[junit4] 2> 725600 INFO (TEST-CollectionsAPIDistributedZkTest.test-seed#[99013C7C0ABDF2BA]) [ ] o.a.s.c.ChaosMonkey monkey: init - expire sessions:false cause connection loss:false
[junit4] 2> 725651 INFO (TEST-CollectionsAPIDistributedZkTest.test-seed#[99013C7C0ABDF2BA]) [ ] o.a.s.SolrTestCaseJ4 Writing core.properties file to /home/jenkins/workspace/Lucene-Solr-5.x-Linux/solr/build/solr-core/test/J1/temp/solr.cloud.CollectionsAPIDistributedZkTest_99013C7C0ABDF2BA-001/shard-1-001/cores/collection1
[junit4] 2> 725651 INFO (TEST-CollectionsAPIDistributedZkTest.test-seed#[99013C7C0ABDF2BA]) [ ] o.a.s.c.AbstractFullDistribZkTestBase create jetty 1 in directory /home/jenkins/workspace/Lucene-Solr-5.x-Linux/solr/build/solr-core/test/J1/temp/solr.cloud.CollectionsAPIDistributedZkTest_99013C7C0ABDF2BA-001/shard-1-001
[junit4] 2> 725652 INFO (TEST-CollectionsAPIDistributedZkTest.test-seed#[99013C7C0ABDF2BA]) [ ] o.e.j.s.Server jetty-9.2.13.v20150730
[junit4] 2> 725653 INFO (TEST-CollectionsAPIDistributedZkTest.test-seed#[99013C7C0ABDF2BA]) [ ] o.e.j.s.h.ContextHandler Started o.e.j.s.ServletContextHandler@5d66e842{/dt_/p,null,AVAILABLE}
[junit4] 2> 725653 INFO (TEST-CollectionsAPIDistributedZkTest.test-seed#[99013C7C0ABDF2BA]) [ ] o.e.j.s.ServerConnector Started ServerConnector@11f4ca39{HTTP/1.1}{127.0.0.1:35911}
[junit4] 2> 725653 INFO (TEST-CollectionsAPIDistributedZkTest.test-seed#[99013C7C0ABDF2BA]) [ ] o.e.j.s.Server Started @727162ms
[junit4] 2> 725653 INFO (TEST-CollectionsAPIDistributedZkTest.test-seed#[99013C7C0ABDF2BA]) [ ] o.a.s.c.s.e.JettySolrRunner Jetty properties: {solr.data.dir=/home/jenkins/workspace/Lucene-Solr-5.x-Linux/solr/build/solr-core/test/J1/temp/solr.cloud.CollectionsAPIDistributedZkTest_99013C7C0ABDF2BA-001/tempDir-001/jetty1, solrconfig=solrconfig.xml, hostContext=/dt_/p, coreRootDirectory=/home/jenkins/workspace/Lucene-Solr-5.x-Linux/solr/build/solr-core/test/J1/../../../../../../../../../home/jenkins/workspace/Lucene-Solr-5.x-Linux/solr/build/solr-core/test/J1/temp/solr.cloud.CollectionsAPIDistributedZkTest_99013C7C0ABDF2BA-001/shard-1-001/cores, hostPort=35911}
[junit4] 2> 725654 INFO (TEST-CollectionsAPIDistributedZkTest.test-seed#[99013C7C0ABDF2BA]) [ ] o.a.s.s.SolrDispatchFilter SolrDispatchFilter.init(): sun.misc.Launcher$AppClassLoader@8f8acd0
[junit4] 2> 725654 INFO (TEST-CollectionsAPIDistributedZkTest.test-seed#[99013C7C0ABDF2BA]) [ ] o.a.s.c.SolrResourceLoader new SolrResourceLoader for directory: '/home/jenkins/workspace/Lucene-Solr-5.x-Linux/solr/build/solr-core/test/J1/temp/solr.cloud.CollectionsAPIDistributedZkTest_99013C7C0ABDF2BA-001/shard-1-001'
[junit4] 2> 725654 INFO (TEST-CollectionsAPIDistributedZkTest.test-seed#[99013C7C0ABDF2BA]) [ ] o.a.s.c.SolrResourceLoader JNDI not configured for solr (NoInitialContextEx)
[junit4] 2> 725654 INFO (TEST-CollectionsAPIDistributedZkTest.test-seed#[99013C7C0ABDF2BA]) [ ] o.a.s.c.SolrResourceLoader solr home defaulted to 'solr/' (could not find system property or JNDI)
[junit4] 2> 725654 INFO (TEST-CollectionsAPIDistributedZkTest.test-seed#[99013C7C0ABDF2BA]) [ ] o.a.s.c.c.SolrZkClient Using default ZkCredentialsProvider
[junit4] 2> 725654 INFO (TEST-CollectionsAPIDistributedZkTest.test-seed#[99013C7C0ABDF2BA]) [ ] o.a.s.c.c.ConnectionManager Waiting for client to connect to ZooKeeper
[junit4] 2> 725655 INFO (zkCallback-1313-thread-1) [ ] o.a.s.c.c.ConnectionManager Watcher org.apache.solr.common.cloud.ConnectionManager@77c43506 name:ZooKeeperConnection Watcher:127.0.0.1:60677/solr got event WatchedEvent state:SyncConnected type:None path:null path:null type:None
[junit4] 2> 725655 INFO (TEST-CollectionsAPIDistributedZkTest.test-seed#[99013C7C0ABDF2BA]) [ ] o.a.s.c.c.ConnectionManager Client is connected to ZooKeeper
[junit4] 2> 725655 INFO (TEST-CollectionsAPIDistributedZkTest.test-seed#[99013C7C0ABDF2BA]) [ ] o.a.s.c.c.SolrZkClient Using default ZkACLProvider
[junit4] 2> 725656 INFO (TEST-CollectionsAPIDistributedZkTest.test-seed#[99013C7C0ABDF2BA]) [ ] o.a.s.s.SolrDispatchFilter Loading solr.xml from SolrHome (not found in ZooKeeper)
[junit4] 2> 725656 INFO (TEST-CollectionsAPIDistributedZkTest.test-seed#[99013C7C0ABDF2BA]) [ ] o.a.s.c.SolrXmlConfig Loading container configuration from /home/jenkins/workspace/Lucene-Solr-5.x-Linux/solr/build/solr-core/test/J1/temp/solr.cloud.CollectionsAPIDistributedZkTest_99013C7C0ABDF2BA-001/shard-1-001/solr.xml
[junit4] 2> 725664 INFO (TEST-CollectionsAPIDistributedZkTest.test-seed#[99013C7C0ABDF2BA]) [ ] o.a.s.c.CoresLocator Config-defined core root directory: /home/jenkins/workspace/Lucene-Solr-5.x-Linux/solr/build/solr-core/test/J1/../../../../../../../../../home/jenkins/workspace/Lucene-Solr-5.x-Linux/solr/build/solr-core/test/J1/temp/solr.cloud.CollectionsAPIDistributedZkTest_99013C7C0ABDF2BA-001/shard-1-001/cores
[junit4] 2> 725664 INFO (TEST-CollectionsAPIDistributedZkTest.test-seed#[99013C7C0ABDF2BA]) [ ] o.a.s.c.CoreContainer New CoreContainer 967863516
[junit4] 2> 725664 INFO (TEST-CollectionsAPIDistributedZkTest.test-seed#[99013C7C0ABDF2BA]) [ ] o.a.s.c.CoreContainer Loading cores into CoreContainer [instanceDir=/home/jenkins/workspace/Lucene-Solr-5.x-Linux/solr/build/solr-core/test/J1/temp/solr.cloud.CollectionsAPIDistributedZkTest_99013C7C0ABDF2BA-001/shard-1-001]
[junit4] 2> 725664 WARN (TEST-CollectionsAPIDistributedZkTest.test-seed#[99013C7C0ABDF2BA]) [ ] o.a.s.c.CoreContainer Couldn't add files from /home/jenkins/workspace/Lucene-Solr-5.x-Linux/solr/build/solr-core/test/J1/temp/solr.cloud.CollectionsAPIDistributedZkTest_99013C7C0ABDF2BA-001/shard-1-001/lib to classpath: /home/jenkins/workspace/Lucene-Solr-5.x-Linux/solr/build/solr-core/test/J1/temp/solr.cloud.CollectionsAPIDistributedZkTest_99013C7C0ABDF2BA-001/shard-1-001/lib
[junit4] 2> 725664 INFO (TEST-CollectionsAPIDistributedZkTest.test-seed#[99013C7C0ABDF2BA]) [ ] o.a.s.h.c.HttpShardHandlerFactory created with socketTimeout : 90000,urlScheme : ,connTimeout : 15000,maxConnectionsPerHost : 20,maxConnections : 10000,corePoolSize : 0,maximumPoolSize : 2147483647,maxThreadIdleTime : 5,sizeOfQueue : -1,fairnessPolicy : false,useRetries : false,
[junit4] 2> 725665 INFO (TEST-CollectionsAPIDistributedZkTest.test-seed#[99013C7C0ABDF2BA]) [ ] o.a.s.u.UpdateShardHandler Creating UpdateShardHandler HTTP client with params: socketTimeout=340000&connTimeout=45000&retry=true
[junit4] 2> 725666 INFO (TEST-CollectionsAPIDistributedZkTest.test-seed#[99013C7C0ABDF2BA]) [ ] o.a.s.l.LogWatcher SLF4J impl is org.slf4j.impl.Log4jLoggerFactory
[junit4] 2> 725666 INFO (TEST-CollectionsAPIDistributedZkTest.test-seed#[99013C7C0ABDF2BA]) [ ] o.a.s.l.LogWatcher Registering Log Listener [Log4j (org.slf4j.impl.Log4jLoggerFactory)]
[junit4] 2> 725666 INFO (TEST-CollectionsAPIDistributedZkTest.test-seed#[99013C7C0ABDF2BA]) [ ] o.a.s.c.ZkContainer Zookeeper client=127.0.0.1:60677/solr
[junit4] 2> 725666 INFO (TEST-CollectionsAPIDistributedZkTest.test-seed#[99013C7C0ABDF2BA]) [ ] o.a.s.c.ZkController zkHost includes chroot
[junit4] 2> 725666 INFO (TEST-CollectionsAPIDistributedZkTest.test-seed#[99013C7C0ABDF2BA]) [ ] o.a.s.c.c.SolrZkClient Using default ZkCredentialsProvider
[junit4] 2> 725666 INFO (TEST-CollectionsAPIDistributedZkTest.test-seed#[99013C7C0ABDF2BA]) [ ] o.a.s.c.c.ConnectionManager Waiting for client to connect to ZooKeeper
[junit4] 2> 725667 INFO (zkCallback-1315-thread-1) [ ] o.a.s.c.c.ConnectionManager Watcher org.apache.solr.common.cloud.ConnectionManager@460c4b77 name:ZooKeeperConnection Watcher:127.0.0.1:60677 got event WatchedEvent state:SyncConnected type:None path:null path:null type:None
[junit4] 2> 725667 INFO (TEST-CollectionsAPIDistributedZkTest.test-seed#[99013C7C0ABDF2BA]) [ ] o.a.s.c.c.ConnectionManager Client is connected to ZooKeeper
[junit4] 2> 725668 INFO (TEST-CollectionsAPIDistributedZkTest.test-seed#[99013C7C0ABDF2BA]) [ ] o.a.s.c.c.SolrZkClient Using default ZkACLProvider
[junit4] 2> 725669 INFO (TEST-CollectionsAPIDistributedZkTest.test-seed#[99013C7C0ABDF2BA]) [n:127.0.0.1:35911_dt_%2Fp ] o.a.s.c.c.ConnectionManager Waiting for client to connect to ZooKeeper
[junit4] 2> 725669 INFO (zkCallback-1316-thread-1-processing-n:127.0.0.1:35911_dt_%2Fp) [n:127.0.0.1:35911_dt_%2Fp ] o.a.s.c.c.ConnectionManager Watcher org.apache.solr.common.cloud.ConnectionManager@1009611e name:ZooKeeperConnection Watcher:127.0.0.1:60677/solr got event WatchedEvent state:SyncConnected type:None path:null path:null type:None
[junit4] 2> 725669 INFO (TEST-CollectionsAPIDistributedZkTest.test-seed#[99013C7C0ABDF2BA]) [n:127.0.0.1:35911_dt_%2Fp ] o.a.s.c.c.ConnectionManager Client is connected to ZooKeeper
[junit4] 2> 725672 INFO (TEST-CollectionsAPIDistributedZkTest.test-seed#[99013C7C0ABDF2BA]) [n:127.0.0.1:35911_dt_%2Fp ] o.a.s.c.c.ZkStateReader Updating cluster state from ZooKeeper...
[junit4] 2> 726674 INFO (TEST-CollectionsAPIDistributedZkTest.test-seed#[99013C7C0ABDF2BA]) [n:127.0.0.1:35911_dt_%2Fp ] o.a.s.c.ZkController Register node as live in ZooKeeper:/live_nodes/127.0.0.1:35911_dt_%2Fp
[junit4] 2> 726674 INFO (TEST-CollectionsAPIDistributedZkTest.test-seed#[99013C7C0ABDF2BA]) [n:127.0.0.1:35911_dt_%2Fp ] o.a.s.c.c.SolrZkClient makePath: /live_nodes/127.0.0.1:35911_dt_%2Fp
[junit4] 2> 726675 INFO (zkCallback-1312-thread-1) [ ] o.a.s.c.c.ZkStateReader A live node change: WatchedEvent state:SyncConnected type:NodeChildrenChanged path:/live_nodes, has occurred - updating... (live nodes size: 1)
[junit4] 2> 726675 INFO (zkCallback-1316-thread-1-processing-n:127.0.0.1:35911_dt_%2Fp) [n:127.0.0.1:35911_dt_%2Fp ] o.a.s.c.c.ZkStateReader A live node change: WatchedEvent state:SyncConnected type:NodeChildrenChanged path:/live_nodes, has occurred - updating... (live nodes size: 1)
[junit4] 2> 726675 INFO (zkCallback-1310-thread-1-processing-n:127.0.0.1:58083_dt_%2Fp) [n:127.0.0.1:58083_dt_%2Fp ] o.a.s.c.c.ZkStateReader A live node change: WatchedEvent state:SyncConnected type:NodeChildrenChanged path:/live_nodes, has occurred - updating... (live nodes size: 1)
[junit4] 2> 726677 INFO (TEST-CollectionsAPIDistributedZkTest.test-seed#[99013C7C0ABDF2BA]) [n:127.0.0.1:35911_dt_%2Fp ] o.a.s.c.Overseer Overseer (id=null) closing
[junit4] 2> 726677 INFO (TEST-CollectionsAPIDistributedZkTest.test-seed#[99013C7C0ABDF2BA]) [n:127.0.0.1:35911_dt_%2Fp ] o.a.s.c.LeaderElector Joined leadership election with path: /overseer_elect/election/94908130813935626-127.0.0.1:35911_dt_%2Fp-n_0000000001
[junit4] 2> 726677 INFO (TEST-CollectionsAPIDistributedZkTest.test-seed#[99013C7C0ABDF2BA]) [n:127.0.0.1:35911_dt_%2Fp ] o.a.s.c.LeaderElector Watching path /overseer_elect/election/94908130813935622-127.0.0.1:58083_dt_%2Fp-n_0000000000 to know if I could be the leader
[junit4] 2> 726691 INFO (TEST-CollectionsAPIDistributedZkTest.test-seed#[99013C7C0ABDF2BA]) [n:127.0.0.1:35911_dt_%2Fp ] o.a.s.c.CoreContainer Security conf doesn't exist. Skipping setup for authorization module.
[junit4] 2> 726692 INFO (TEST-CollectionsAPIDistributedZkTest.test-seed#[99013C7C0ABDF2BA]) [n:127.0.0.1:35911_dt_%2Fp ] o.a.s.c.CoreContainer No authentication plugin used.
[junit4] 2> 726692 INFO (TEST-CollectionsAPIDistributedZkTest.test-seed#[99013C7C0ABDF2BA]) [n:127.0.0.1:35911_dt_%2Fp ] o.a.s.c.CoresLocator Looking for core definitions underneath /home/jenkins/workspace/Lucene-Solr-5.x-Linux/solr/build/solr-core/test/J1/../../../../../../../../../home/jenkins/workspace/Lucene-Solr-5.x-Linux/solr/build/solr-core/test/J1/temp/solr.cloud.CollectionsAPIDistributedZkTest_99013C7C0ABDF2BA-001/shard-1-001/cores
[junit4] 2> 726693 INFO (TEST-CollectionsAPIDistributedZkTest.test-seed#[99013C7C0ABDF2BA]) [n:127.0.0.1:35911_dt_%2Fp ] o.a.s.c.SolrCore Created CoreDescriptor: {coreNodeName=, name=collection1, collection=collection1, shard=, schema=schema.xml, dataDir=data/, configSetProperties=configsetprops.json, transient=false, absoluteInstDir=/home/jenkins/workspace/Lucene-Solr-5.x-Linux/solr/build/solr-core/test/J1/../../../../../../../../../home/jenkins/workspace/Lucene-Solr-5.x-Linux/solr/build/solr-core/test/J1/temp/solr.cloud.CollectionsAPIDistributedZkTest_99013C7C0ABDF2BA-001/shard-1-001/cores/collection1/, instanceDir=/home/jenkins/workspace/Lucene-Solr-5.x-Linux/solr/build/solr-core/test/J1/../../../../../../../../../home/jenkins/workspace/Lucene-Solr-5.x-Linux/solr/build/solr-core/test/J1/temp/solr.cloud.CollectionsAPIDistributedZkTest_99013C7C0ABDF2BA-001/shard-1-001/cores/collection1, loadOnStartup=true, config=solrconfig.xml}
[junit4] 2> 726693 INFO (TEST-CollectionsAPIDistributedZkTest.test-seed#[99013C7C0ABDF2BA]) [n:127.0.0.1:35911_dt_%2Fp ] o.a.s.c.CoresLocator Found core collection1 in /home/jenkins/workspace/Lucene-Solr-5.x-Linux/solr/build/solr-core/test/J1/../../../../../../../../../home/jenkins/workspace/Lucene-Solr-5.x-Linux/solr/build/solr-core/test/J1/temp/solr.cloud.CollectionsAPIDistributedZkTest_99013C7C0ABDF2BA-001/shard-1-001/cores/collection1/
[junit4] 2> 726693 INFO (TEST-CollectionsAPIDistributedZkTest.test-seed#[99013C7C0ABDF2BA]) [n:127.0.0.1:35911_dt_%2Fp ] o.a.s.c.CoresLocator Found 1 core definitions
[junit4] 2> 726694 INFO (TEST-CollectionsAPIDistributedZkTest.test-seed#[99013C7C0ABDF2BA]) [n:127.0.0.1:35911_dt_%2Fp ] o.a.s.s.SolrDispatchFilter user.dir=/home/jenkins/workspace/Lucene-Solr-5.x-Linux/solr/build/solr-core/test/J1
[junit4] 2> 726694 INFO (TEST-CollectionsAPIDistributedZkTest.test-seed#[99013C7C0ABDF2BA]) [n:127.0.0.1:35911_dt_%2Fp ] o.a.s.s.SolrDispatchFilter SolrDispatchFilter.init() done
[junit4] 2> 726694 INFO (coreLoadExecutor-3219-thread-1-processing-n:127.0.0.1:35911_dt_%2Fp) [n:127.0.0.1:35911_dt_%2Fp c:collection1 x:collection1] o.a.s.c.ZkController publishing state=down
[junit4] 2> 726694 INFO (coreLoadExecutor-3219-thread-1-processing-n:127.0.0.1:35911_dt_%2Fp) [n:127.0.0.1:35911_dt_%2Fp c:collection1 x:collection1] o.a.s.c.ZkController numShards not found on descriptor - reading it from system property
[junit4] 2> 726694 INFO (coreLoadExecutor-3219-thread-1-processing-n:127.0.0.1:35911_dt_%2Fp) [n:127.0.0.1:35911_dt_%2Fp c:collection1 x:collection1] o.a.s.c.ZkController look for our core node name
[junit4] 2> 726694 INFO (OverseerStateUpdate-94908130813935622-127.0.0.1:58083_dt_%2Fp-n_0000000000) [n:127.0.0.1:58083_dt_%2Fp ] o.a.s.c.Overseer processMessage: queueSize: 1, message = {
[junit4] 2> "roles":null,
[junit4] 2> "numShards":"2",
[junit4] 2> "collection":"collection1",
[junit4] 2> "shard":null,
[junit4] 2> "core":"collection1",
[junit4] 2> "operation":"state",
[junit4] 2> "state":"down",
[junit4] 2> "base_url":"http://127.0.0.1:35911/dt_/p",
[junit4] 2> "node_name":"127.0.0.1:35911_dt_%2Fp"} current state version: 3
[junit4] 2> 726695 INFO (OverseerStateUpdate-94908130813935622-127.0.0.1:58083_dt_%2Fp-n_0000000000) [n:127.0.0.1:58083_dt_%2Fp ] o.a.s.c.o.ReplicaMutator Update state numShards=2 message={
[junit4] 2> "roles":null,
[junit4] 2> "numShards":"2",
[junit4] 2> "collection":"collection1",
[junit4] 2> "shard":null,
[junit4] 2> "core":"collection1",
[junit4] 2> "operation":"state",
[junit4] 2> "state":"down",
[junit4] 2> "base_url":"http://127.0.0.1:35911/dt_/p",
[junit4] 2> "node_name":"127.0.0.1:35911_dt_%2Fp"}
[junit4] 2> 726695 INFO (OverseerStateUpdate-94908130813935622-127.0.0.1:58083_dt_%2Fp-n_0000000000) [n:127.0.0.1:58083_dt_%2Fp ] o.a.s.c.o.ClusterStateMutator building a new cName: collection1
[junit4] 2> 726695 INFO (OverseerStateUpdate-94908130813935622-127.0.0.1:58083_dt_%2Fp-n_0000000000) [n:127.0.0.1:58083_dt_%2Fp ] o.a.s.c.o.ReplicaMutator Assigning new node to shard shard=shard2
[junit4] 2> 726796 INFO (zkCallback-1312-thread-1) [ ] o.a.s.c.c.ZkStateReader A cluster state change: WatchedEvent state:SyncConnected type:NodeDataChanged path:/clusterstate.json, has occurred - updating... (live nodes size: 2)
[junit4] 2> 726796 INFO (zkCallback-1316-thread-1-processing-n:127.0.0.1:35911_dt_%2Fp) [n:127.0.0.1:35911_dt_%2Fp ] o.a.s.c.c.ZkStateReader A cluster state change: WatchedEvent state:SyncConnected type:NodeDataChanged path:/clusterstate.json, has occurred - updating... (live nodes size: 2)
[junit4] 2> 726796 INFO (zkCallback-1310-thread-1-processing-n:127.0.0.1:58083_dt_%2Fp) [n:127.0.0.1:58083_dt_%2Fp ] o.a.s.c.c.ZkStateReader A cluster state change: WatchedEvent state:SyncConnected type:NodeDataChanged path:/clusterstate.json, has occurred
[...truncated too long message...]
y looking to close /home/jenkins/workspace/Lucene-Solr-5.x-Linux/solr/build/solr-core/test/J1/temp/solr.cloud.CollectionsAPIDistributedZkTest_99013C7C0ABDF2BA-001/shard-4-001/cores/awholynewcollection_0_shard1_replica1/data/index [CachedDir<<refCount=0;path=/home/jenkins/workspace/Lucene-Solr-5.x-Linux/solr/build/solr-core/test/J1/temp/solr.cloud.CollectionsAPIDistributedZkTest_99013C7C0ABDF2BA-001/shard-4-001/cores/awholynewcollection_0_shard1_replica1/data/index;done=false>>]
[junit4] 2> 794378 INFO (TEST-CollectionsAPIDistributedZkTest.test-seed#[99013C7C0ABDF2BA]) [n:127.0.0.1:40671_dt_%2Fp c:awholynewcollection_0 s:shard1 r:core_node1 x:awholynewcollection_0_shard1_replica1] o.a.s.c.CachingDirectoryFactory Closing directory: /home/jenkins/workspace/Lucene-Solr-5.x-Linux/solr/build/solr-core/test/J1/temp/solr.cloud.CollectionsAPIDistributedZkTest_99013C7C0ABDF2BA-001/shard-4-001/cores/awholynewcollection_0_shard1_replica1/data/index
[junit4] 2> 794379 INFO (TEST-CollectionsAPIDistributedZkTest.test-seed#[99013C7C0ABDF2BA]) [n:127.0.0.1:40671_dt_%2Fp c:awholynewcollection_0 s:shard1 r:core_node1 x:awholynewcollection_0_shard1_replica1] o.a.s.c.Overseer Overseer (id=94908130813935635-127.0.0.1:40671_dt_%2Fp-n_0000000004) closing
[junit4] 2> 794379 INFO (OverseerStateUpdate-94908130813935635-127.0.0.1:40671_dt_%2Fp-n_0000000004) [n:127.0.0.1:40671_dt_%2Fp ] o.a.s.c.Overseer Overseer Loop exiting : 127.0.0.1:40671_dt_%2Fp
[junit4] 2> 794380 INFO (zkCallback-1329-thread-1-processing-n:127.0.0.1:40671_dt_%2Fp) [n:127.0.0.1:40671_dt_%2Fp ] o.a.s.c.c.ZkStateReader A live node change: WatchedEvent state:SyncConnected type:NodeChildrenChanged path:/live_nodes, has occurred - updating... (live nodes size: 1)
[junit4] 2> 794381 WARN (zkCallback-1329-thread-1-processing-n:127.0.0.1:40671_dt_%2Fp) [n:127.0.0.1:40671_dt_%2Fp ] o.a.s.c.c.ZkStateReader ZooKeeper watch triggered, but Solr cannot talk to ZK
[junit4] 2> 794381 INFO (TEST-CollectionsAPIDistributedZkTest.test-seed#[99013C7C0ABDF2BA]) [ ] o.e.j.s.ServerConnector Stopped ServerConnector@1c09ad59{HTTP/1.1}{127.0.0.1:0}
[junit4] 2> 794381 INFO (TEST-CollectionsAPIDistributedZkTest.test-seed#[99013C7C0ABDF2BA]) [ ] o.e.j.s.h.ContextHandler Stopped o.e.j.s.ServletContextHandler@30f68cde{/dt_/p,null,UNAVAILABLE}
[junit4] 2> 794386 INFO (TEST-CollectionsAPIDistributedZkTest.test-seed#[99013C7C0ABDF2BA]) [n:127.0.0.1:40671_dt_%2Fp c:awholynewcollection_0 s:shard1 r:core_node1 x:awholynewcollection_0_shard1_replica1] o.a.s.c.ZkTestServer connecting to 127.0.0.1:60677 60677
[junit4] 2> 794483 INFO (Thread-2579) [ ] o.a.s.c.ZkTestServer connecting to 127.0.0.1:60677 60677
[junit4] 2> 794483 WARN (Thread-2579) [ ] o.a.s.c.ZkTestServer Watch limit violations:
[junit4] 2> Maximum concurrent create/delete watches above limit:
[junit4] 2>
[junit4] 2> 9 /solr/aliases.json
[junit4] 2> 6 /solr/security.json
[junit4] 2> 6 /solr/configs/conf1
[junit4] 2> 4 /solr/configs/conf2
[junit4] 2>
[junit4] 2> Maximum concurrent data watches above limit:
[junit4] 2>
[junit4] 2> 9 /solr/clusterstate.json
[junit4] 2> 5 /solr/collections/nodes_used_collection/state.json
[junit4] 2> 2 /solr/overseer_elect/election/94908130813935622-127.0.0.1:58083_dt_%2Fp-n_0000000000
[junit4] 2>
[junit4] 2> Maximum concurrent children watches above limit:
[junit4] 2>
[junit4] 2> 9 /solr/collections
[junit4] 2> 8 /solr/live_nodes
[junit4] 2> 4 /solr/overseer/collection-queue-work
[junit4] 2> 4 /solr/overseer/queue
[junit4] 2>
[junit4] 2> NOTE: reproduce with: ant test -Dtestcase=CollectionsAPIDistributedZkTest -Dtests.method=test -Dtests.seed=99013C7C0ABDF2BA -Dtests.multiplier=3 -Dtests.slow=true -Dtests.locale=es_PR -Dtests.timezone=America/Argentina/ComodRivadavia -Dtests.asserts=true -Dtests.file.encoding=UTF-8
[junit4] ERROR 70.6s J1 | CollectionsAPIDistributedZkTest.test <<<
[junit4] > Throwable #1: org.apache.solr.client.solrj.impl.HttpSolrClient$RemoteSolrException: Error from server at http://127.0.0.1:40671/dt_/p/awholynewcollection_0: non ok status: 500, message:Server Error
[junit4] > at __randomizedtesting.SeedInfo.seed([99013C7C0ABDF2BA:115503A6A4419F42]:0)
[junit4] > at org.apache.solr.client.solrj.impl.HttpSolrClient.executeMethod(HttpSolrClient.java:508)
[junit4] > at org.apache.solr.client.solrj.impl.HttpSolrClient.request(HttpSolrClient.java:241)
[junit4] > at org.apache.solr.client.solrj.impl.HttpSolrClient.request(HttpSolrClient.java:230)
[junit4] > at org.apache.solr.client.solrj.SolrRequest.process(SolrRequest.java:150)
[junit4] > at org.apache.solr.client.solrj.SolrClient.query(SolrClient.java:943)
[junit4] > at org.apache.solr.client.solrj.SolrClient.query(SolrClient.java:958)
[junit4] > at org.apache.solr.cloud.AbstractFullDistribZkTestBase.waitForNon403or404or503(AbstractFullDistribZkTestBase.java:1753)
[junit4] > at org.apache.solr.cloud.CollectionsAPIDistributedZkTest.testCollectionsAPI(CollectionsAPIDistributedZkTest.java:653)
[junit4] > at org.apache.solr.cloud.CollectionsAPIDistributedZkTest.test(CollectionsAPIDistributedZkTest.java:155)
[junit4] > at org.apache.solr.BaseDistributedSearchTestCase$ShardsRepeatRule$ShardsFixedStatement.callStatement(BaseDistributedSearchTestCase.java:963)
[junit4] > at org.apache.solr.BaseDistributedSearchTestCase$ShardsRepeatRule$ShardsStatement.evaluate(BaseDistributedSearchTestCase.java:938)
[junit4] > at java.lang.Thread.run(Thread.java:745)
[junit4] 2> 794487 INFO (SUITE-CollectionsAPIDistributedZkTest-seed#[99013C7C0ABDF2BA]-worker) [n:127.0.0.1:40671_dt_%2Fp c:awholynewcollection_0 s:shard1 r:core_node1 x:awholynewcollection_0_shard1_replica1] o.a.s.SolrTestCaseJ4 ###deleteCore
[junit4] 2> NOTE: leaving temporary files on disk at: /home/jenkins/workspace/Lucene-Solr-5.x-Linux/solr/build/solr-core/test/J1/temp/solr.cloud.CollectionsAPIDistributedZkTest_99013C7C0ABDF2BA-001
[junit4] 2> NOTE: test params are: codec=Asserting(Lucene54): {}, docValues:{}, sim=RandomSimilarityProvider(queryNorm=true,coord=no): {}, locale=es_PR, timezone=America/Argentina/ComodRivadavia
[junit4] 2> NOTE: Linux 3.19.0-31-generic amd64/Oracle Corporation 1.7.0_80 (64-bit)/cpus=12,threads=1,free=238481704,total=518979584
[junit4] 2> NOTE: All tests run in this JVM: [TestHighlightDedupGrouping, SpellPossibilityIteratorTest, TestCoreContainer, TestFreeTextSuggestions, ShardRoutingTest, TestSearcherReuse, OverriddenZkACLAndCredentialsProvidersTest, TestMiniSolrCloudClusterSSL, MinimalSchemaTest, DOMUtilTest, FullHLLTest, BadCopyFieldTest, HighlighterTest, OpenExchangeRatesOrgProviderTest, RestartWhileUpdatingTest, DocumentBuilderTest, AnalysisErrorHandlingTest, OpenCloseCoreStressTest, HdfsRecoveryZkTest, SpellCheckCollatorTest, TestHdfsUpdateLog, TestSolrCoreProperties, TestCursorMarkWithoutUniqueKey, TestExactStatsCache, UniqFieldsUpdateProcessorFactoryTest, CustomCollectionTest, ShardRoutingCustomTest, TestSchemaResource, CloudMLTQParserTest, TestManagedStopFilterFactory, DistributedFacetPivotSmallAdvancedTest, StressHdfsTest, CleanupOldIndexTest, TestLFUCache, HdfsChaosMonkeyNothingIsSafeTest, SchemaVersionSpecificBehaviorTest, TestHashPartitioner, DirectSolrSpellCheckerTest, SolrPluginUtilsTest, TermVectorComponentTest, DistributedVersionInfoTest, AnalyticsQueryTest, CloudExitableDirectoryReaderTest, SolrCmdDistributorTest, MBeansHandlerTest, TestRestoreCore, FileUtilsTest, LeaderInitiatedRecoveryOnCommitTest, TestInfoStreamLogging, AsyncMigrateRouteKeyTest, VersionInfoTest, TestSolrDeletionPolicy2, NumericFieldsTest, TestRecoveryHdfs, CursorPagingTest, TestIntervalFaceting, ZkControllerTest, MultiTermTest, TestSchemaSimilarityResource, DistributedTermsComponentTest, DeleteShardTest, ZkStateReaderTest, DistanceFunctionTest, TestSolrConfigHandlerCloud, DistributedQueueTest, TestBinaryResponseWriter, TestImplicitCoreProperties, TestBM25SimilarityFactory, FastVectorHighlighterTest, UpdateRequestProcessorFactoryTest, CoreMergeIndexesAdminHandlerTest, TestQueryUtils, TestFastLRUCache, UUIDUpdateProcessorFallbackTest, TestDocBasedVersionConstraints, TestCloudSchemaless, TestRTimerTree, TestPKIAuthenticationPlugin, SuggestComponentTest, TestInitParams, SuggesterFSTTest, TestBulkSchemaConcurrent, TermsComponentTest, OverseerStatusTest, DataDrivenBlockJoinTest, TestSolr4Spatial2, BlockCacheTest, ChaosMonkeySafeLeaderTest, CollectionsAPIDistributedZkTest]
[junit4] Completed [252/548] on J1 in 70.63s, 1 test, 1 error <<< FAILURES!
[...truncated 935 lines...]
BUILD FAILED
/home/jenkins/workspace/Lucene-Solr-5.x-Linux/build.xml:785: The following error occurred while executing this line:
/home/jenkins/workspace/Lucene-Solr-5.x-Linux/build.xml:729: The following error occurred while executing this line:
/home/jenkins/workspace/Lucene-Solr-5.x-Linux/build.xml:59: The following error occurred while executing this line:
/home/jenkins/workspace/Lucene-Solr-5.x-Linux/solr/build.xml:233: The following error occurred while executing this line:
/home/jenkins/workspace/Lucene-Solr-5.x-Linux/solr/common-build.xml:526: The following error occurred while executing this line:
/home/jenkins/workspace/Lucene-Solr-5.x-Linux/lucene/common-build.xml:1452: The following error occurred while executing this line:
/home/jenkins/workspace/Lucene-Solr-5.x-Linux/lucene/common-build.xml:1006: There were test failures: 548 suites (7 ignored), 2165 tests, 1 error, 76 ignored (38 assumptions) [seed: 99013C7C0ABDF2BA]
Total time: 46 minutes 44 seconds
Build step 'Invoke Ant' marked build as failure
Archiving artifacts
[WARNINGS] Skipping publisher since build result is FAILURE
Recording test results
Email was triggered for: Failure - Any
Sending email for trigger: Failure - Any