You are viewing a plain text version of this content. The canonical link for it is here.
Posted to dev@sling.apache.org by Apache Jenkins Server <je...@builds.apache.org> on 2014/09/16 21:41:28 UTC

Build failed in Jenkins: sling-contrib-1.6 #1251

See <https://builds.apache.org/job/sling-contrib-1.6/1251/changes>

Changes:

[olli] SLING-3821 update Pax Exam to 4.2.0

[olli] SLING-3821 update Pax Exam to 4.2.0

[olli] SLING-3821 enable more tests

------------------------------------------
[...truncated 11558 lines...]
[INFO] ------------------------------------------------------------------------
[INFO] Building Apache Sling JCR Prefs 1.0.1-SNAPSHOT
[INFO] ------------------------------------------------------------------------
Downloading: http://repo.maven.apache.org/maven2/org/apache/felix/org.apache.felix.prefs/1.0.2/org.apache.felix.prefs-1.0.2.pom
Downloaded: http://repo.maven.apache.org/maven2/org/apache/felix/org.apache.felix.prefs/1.0.2/org.apache.felix.prefs-1.0.2.pom (4 KB at 151.7 KB/sec)
Downloading: http://repo.maven.apache.org/maven2/org/apache/felix/org.osgi.core/1.0.0/org.osgi.core-1.0.0.pom
Downloaded: http://repo.maven.apache.org/maven2/org/apache/felix/org.osgi.core/1.0.0/org.osgi.core-1.0.0.pom (3 KB at 126.8 KB/sec)
Downloading: http://repo.maven.apache.org/maven2/org/apache/felix/felix/1.0.0/felix-1.0.0.pom
Downloaded: http://repo.maven.apache.org/maven2/org/apache/felix/felix/1.0.0/felix-1.0.0.pom (12 KB at 689.5 KB/sec)
Downloading: http://repo.maven.apache.org/maven2/org/apache/felix/org.osgi.compendium/1.0.0/org.osgi.compendium-1.0.0.pom
Downloaded: http://repo.maven.apache.org/maven2/org/apache/felix/org.osgi.compendium/1.0.0/org.osgi.compendium-1.0.0.pom (4 KB at 198.7 KB/sec)
Downloading: http://repo.maven.apache.org/maven2/org/apache/felix/javax.servlet/1.0.0/javax.servlet-1.0.0.pom
Downloaded: http://repo.maven.apache.org/maven2/org/apache/felix/javax.servlet/1.0.0/javax.servlet-1.0.0.pom (5 KB at 250.3 KB/sec)
Downloading: http://repo.maven.apache.org/maven2/org/apache/felix/org.osgi.foundation/1.0.0/org.osgi.foundation-1.0.0.pom
Downloaded: http://repo.maven.apache.org/maven2/org/apache/felix/org.osgi.foundation/1.0.0/org.osgi.foundation-1.0.0.pom (2 KB at 91.1 KB/sec)
Downloading: http://repo.maven.apache.org/maven2/org/apache/felix/felix/1.0.1/felix-1.0.1.pom
Downloaded: http://repo.maven.apache.org/maven2/org/apache/felix/felix/1.0.1/felix-1.0.1.pom (14 KB at 733.7 KB/sec)
Downloading: http://repo.maven.apache.org/maven2/org/apache/felix/org.apache.felix.prefs/1.0.2/org.apache.felix.prefs-1.0.2.jar
Downloading: http://repo.maven.apache.org/maven2/org/apache/felix/org.osgi.core/1.0.0/org.osgi.core-1.0.0.jar
Downloading: http://repo.maven.apache.org/maven2/org/apache/felix/org.osgi.compendium/1.0.0/org.osgi.compendium-1.0.0.jar
Downloading: http://repo.maven.apache.org/maven2/org/apache/felix/org.osgi.foundation/1.0.0/org.osgi.foundation-1.0.0.jar
Downloading: http://repo.maven.apache.org/maven2/org/apache/felix/javax.servlet/1.0.0/javax.servlet-1.0.0.jar
Downloaded: http://repo.maven.apache.org/maven2/org/apache/felix/javax.servlet/1.0.0/javax.servlet-1.0.0.jar (30 KB at 1062.0 KB/sec)
Downloaded: http://repo.maven.apache.org/maven2/org/apache/felix/org.osgi.core/1.0.0/org.osgi.core-1.0.0.jar (60 KB at 1416.7 KB/sec)
Downloaded: http://repo.maven.apache.org/maven2/org/apache/felix/org.apache.felix.prefs/1.0.2/org.apache.felix.prefs-1.0.2.jar (42 KB at 963.0 KB/sec)
Downloaded: http://repo.maven.apache.org/maven2/org/apache/felix/org.osgi.foundation/1.0.0/org.osgi.foundation-1.0.0.jar (254 KB at 4223.7 KB/sec)
Downloaded: http://repo.maven.apache.org/maven2/org/apache/felix/org.osgi.compendium/1.0.0/org.osgi.compendium-1.0.0.jar (88 KB at 1412.3 KB/sec)
[INFO] 
[INFO] --- maven-clean-plugin:2.5:clean (default-clean) @ org.apache.sling.jcr.prefs ---
[INFO] 
[INFO] --- maven-enforcer-plugin:1.3.1:enforce (enforce-java) @ org.apache.sling.jcr.prefs ---
[INFO] 
[INFO] --- maven-antrun-plugin:1.7:run (set-bundle-required-execution-environment) @ org.apache.sling.jcr.prefs ---
[INFO] Executing tasks

main:
[INFO] Executed tasks
[INFO] 
[INFO] --- maven-remote-resources-plugin:1.5:process (default) @ org.apache.sling.jcr.prefs ---
[INFO] 
[INFO] --- maven-resources-plugin:2.6:resources (default-resources) @ org.apache.sling.jcr.prefs ---
[INFO] Using 'UTF-8' encoding to copy filtered resources.
[INFO] Copying 0 resource
[INFO] Copying 3 resources
[INFO] 
[INFO] --- maven-antrun-plugin:1.7:run (check-memory-task) @ org.apache.sling.jcr.prefs ---
[INFO] Executing tasks

main:
     [echo] **************** WARNING (SLING-443/SLING-1782) ******************************
     [echo] On most platforms, you'll get OutOfMemoryErrors when building unless you set
     [echo] on 32bit platforms: MAVEN_OPTS="-Xmx256M -XX:MaxPermSize=256M", see SLING-443
     [echo] on 64bit platforms: MAVEN_OPTS="-Xmx512M -XX:MaxPermSize=512M", see SLING-1782
     [echo] ******************************************************************************
[INFO] Executed tasks
[INFO] 
[INFO] --- maven-compiler-plugin:3.1:compile (default-compile) @ org.apache.sling.jcr.prefs ---
[INFO] Changes detected - recompiling the module!
[INFO] Compiling 1 source file to <https://builds.apache.org/job/sling-contrib-1.6/ws/contrib-1.6/jcr/prefs/target/classes>
[INFO] 
[INFO] --- maven-scr-plugin:1.17.0:scr (generate-scr-scrdescriptor) @ org.apache.sling.jcr.prefs ---
[INFO] Writing 1 Service Component Descriptors to <https://builds.apache.org/job/sling-contrib-1.6/ws/contrib-1.6/jcr/prefs/target/classes/OSGI-INF/org.apache.sling.jcr.prefs.impl.JcrBackingStore.xml>
[INFO] 
[INFO] --- maven-resources-plugin:2.6:testResources (default-testResources) @ org.apache.sling.jcr.prefs ---
[INFO] Using 'UTF-8' encoding to copy filtered resources.
[INFO] skip non existing resourceDirectory <https://builds.apache.org/job/sling-contrib-1.6/ws/contrib-1.6/jcr/prefs/src/test/resources>
[INFO] Copying 3 resources
[INFO] 
[INFO] --- maven-compiler-plugin:3.1:testCompile (default-testCompile) @ org.apache.sling.jcr.prefs ---
[INFO] No sources to compile
[INFO] 
[INFO] --- maven-surefire-plugin:2.16:test (default-test) @ org.apache.sling.jcr.prefs ---
[JENKINS] Recording test results[INFO] 

[INFO] --- animal-sniffer-maven-plugin:1.11:check (default) @ org.apache.sling.jcr.prefs ---
[INFO] Checking unresolved references to org.codehaus.mojo.signature:java15:1.0
[INFO] 
[INFO] --- maven-bundle-plugin:2.4.0:bundle (default-bundle) @ org.apache.sling.jcr.prefs ---
[INFO] 
[INFO] --- maven-enforcer-plugin:1.3.1:enforce (enforce-java) @ org.apache.sling.jcr.prefs ---
[INFO] 
[INFO] --- maven-antrun-plugin:1.7:run (set-bundle-required-execution-environment) @ org.apache.sling.jcr.prefs ---
[INFO] Executing tasks

main:
[INFO] Executed tasks
[WARNING] Failed to getClass for org.apache.maven.plugin.source.SourceJarMojo
[INFO] 
[INFO] --- maven-source-plugin:2.2.1:jar (attach-sources) @ org.apache.sling.jcr.prefs ---
[INFO] Building jar: <https://builds.apache.org/job/sling-contrib-1.6/ws/contrib-1.6/jcr/prefs/target/org.apache.sling.jcr.prefs-1.0.1-SNAPSHOT-sources.jar>
[INFO] 
[INFO] --- maven-site-plugin:3.3:attach-descriptor (attach-descriptor) @ org.apache.sling.jcr.prefs ---
[INFO] 
[INFO] --- ianal-maven-plugin:1.0-alpha-1:verify-legal-files (default) @ org.apache.sling.jcr.prefs ---
[INFO] Checking legal files in: org.apache.sling.jcr.prefs-1.0.1-SNAPSHOT.jar
[INFO] Checking legal files in: org.apache.sling.jcr.prefs-1.0.1-SNAPSHOT-sources.jar
[INFO] 
[INFO] --- maven-install-plugin:2.5.1:install (default-install) @ org.apache.sling.jcr.prefs ---
[INFO] Installing <https://builds.apache.org/job/sling-contrib-1.6/ws/contrib-1.6/jcr/prefs/target/org.apache.sling.jcr.prefs-1.0.1-SNAPSHOT.jar> to /jenkins/maven-repositories/0/org/apache/sling/org.apache.sling.jcr.prefs/1.0.1-SNAPSHOT/org.apache.sling.jcr.prefs-1.0.1-SNAPSHOT.jar
[INFO] Installing <https://builds.apache.org/job/sling-contrib-1.6/ws/contrib-1.6/jcr/prefs/pom.xml> to /jenkins/maven-repositories/0/org/apache/sling/org.apache.sling.jcr.prefs/1.0.1-SNAPSHOT/org.apache.sling.jcr.prefs-1.0.1-SNAPSHOT.pom
[INFO] Installing <https://builds.apache.org/job/sling-contrib-1.6/ws/contrib-1.6/jcr/prefs/target/org.apache.sling.jcr.prefs-1.0.1-SNAPSHOT-sources.jar> to /jenkins/maven-repositories/0/org/apache/sling/org.apache.sling.jcr.prefs/1.0.1-SNAPSHOT/org.apache.sling.jcr.prefs-1.0.1-SNAPSHOT-sources.jar
[INFO] 
[INFO] --- maven-bundle-plugin:2.4.0:install (default-install) @ org.apache.sling.jcr.prefs ---
[INFO] Local OBR update disabled (enable with -DobrRepository)
[JENKINS] Archiving disabled
[INFO]                                                                         
[INFO] ------------------------------------------------------------------------
[INFO] Building Apache Sling JCR Resource Security 0.0.1-SNAPSHOT
[INFO] ------------------------------------------------------------------------
Downloading: http://repository.apache.org/snapshots/org/apache/sling/org.apache.sling.resourceaccesssecurity/0.0.1-SNAPSHOT/maven-metadata.xml
Downloading: http://repository.apache.org/snapshots/org/apache/sling/org.apache.sling.resourceaccesssecurity/0.0.1-SNAPSHOT/org.apache.sling.resourceaccesssecurity-0.0.1-SNAPSHOT.pom
[WARNING] The POM for org.apache.sling:org.apache.sling.resourceaccesssecurity:jar:0.0.1-SNAPSHOT is missing, no dependency information available
Downloading: http://repository.apache.org/snapshots/org/apache/sling/org.apache.sling.resourceaccesssecurity/0.0.1-SNAPSHOT/org.apache.sling.resourceaccesssecurity-0.0.1-SNAPSHOT.jar
[JENKINS] Archiving disabled
[INFO] ------------------------------------------------------------------------
[INFO] Reactor Summary:
[INFO] 
[INFO] Apache Sling Authentication XING API .............. SUCCESS [1:45.887s]
[INFO] Apache Sling Authentication XING Login ............ SUCCESS [18.144s]
[INFO] Apache Sling Authentication XING OAuth ............ SUCCESS [11.416s]
[INFO] Apache Sling Commons FileSystem ClassLoader ....... SUCCESS [8.725s]
[INFO] Apache Sling Commons HTML Utilities ............... SUCCESS [6.495s]
[INFO] Apache Sling APT parser ........................... SUCCESS [22.111s]
[INFO] Apache Sling APT servlet .......................... SUCCESS [11.198s]
[INFO] Apache Sling Resource Collection API .............. SUCCESS [12.450s]
[INFO] Apache Sling ClassLoader Leak Detector ............ SUCCESS [9.154s]
[INFO] Apache Sling SLF4J MDC Filter ..................... SUCCESS [29.755s]
[INFO] Apache Sling DataSource Provider .................. SUCCESS [23.257s]
[INFO] Apache Sling Dojo JavaScript Library .............. SUCCESS [17.606s]
[INFO] Apache Sling Dojo Data Extension .................. SUCCESS [9.386s]
[INFO] Apache Sling FTP Server ........................... SUCCESS [11.484s]
[INFO] Apache Sling Google Web Toolkit Servlet Library ... SUCCESS [12.731s]
[INFO] Apache Sling Google Web Toolkit Sample ............ SUCCESS [47.555s]
[INFO] Apache Sling Internationalization Support ......... SUCCESS [47.174s]
[INFO] Apache Sling JMX Resource Provider ................ SUCCESS [8.932s]
[INFO] Apache Sling MongoDB Resource Provider ............ SUCCESS [11.681s]
[INFO] Apache Sling OSGi Bundle Repository ............... SUCCESS [15.254s]
[INFO] Apache Sling Request Processing Analyzer .......... SUCCESS [11.907s]
[INFO] Apache Sling Resource Merger ...................... SUCCESS [14.458s]
[INFO] Apache Sling Rewriter ............................. SUCCESS [14.612s]
[INFO] Apache Sling Tenant ............................... SUCCESS [11.568s]
[INFO] Apache Sling Replication .......................... SUCCESS [24.898s]
[INFO] Apache Sling Replication Integration Tests ........ SUCCESS [1:20.390s]
[INFO] sling-query ....................................... SUCCESS [23.272s]
[INFO] Apache Sling JCR Java Compiler .................... SUCCESS [15.168s]
[INFO] Apache Sling Repository Accessor .................. SUCCESS [12.142s]
[INFO] Apache Sling Object Content Mapping ............... SUCCESS [17.406s]
[INFO] Apache Sling JCR Prefs ............................ SUCCESS [6.891s]
[INFO] Apache Sling JCR Resource Security ................ FAILURE [0.731s]
[INFO] Apache Sling Script Console ....................... SKIPPED
[INFO] Apache Sling Atom Tag Library ..................... SKIPPED
[INFO] Apache Sling Scripting Freemarker Support ......... SKIPPED
[INFO] Apache Sling Scripting Groovy Support ............. SKIPPED
[INFO] Apache Sling Scripting Java Support ............... SKIPPED
[INFO] Apache Sling Scripting JST Support ................ SKIPPED
[INFO] Apache Sling Scripting Python Support ............. SKIPPED
[INFO] Apache Sling Scripting Ruby Support ............... SKIPPED
[INFO] Apache Sling Scripting Thymeleaf .................. SKIPPED
[INFO] Apache Sling Scripting Velocity Support ........... SKIPPED
[INFO] Apache Sling Scripting W3C XML Processing Support . SKIPPED
[INFO] Apache Sling Launchpad Karaf ...................... SKIPPED
[INFO] Apache Sling Launchpad Karaf - Features ........... SKIPPED
[INFO] Apache Sling Launchpad Karaf - Integration Tests .. SKIPPED
[INFO] Apache Sling Launchpad Karaf - Launchpad Integration Tests  SKIPPED
[INFO] Apache Sling Launchpad Karaf Builder .............. SKIPPED
[INFO] Apache Sling Launchpad Contrib Testing ............ SKIPPED
[INFO] Scala Script Engine ............................... SKIPPED
[INFO] Apache Sling Scala Scripting Configuration ........ SKIPPED
[INFO] Scala for Sling Demo Application - Hello World .... SKIPPED
[INFO] Scala for Sling Demo Application - Forum .......... SKIPPED
[INFO] Apache Sling Contrib (Builder) .................... SKIPPED
[INFO] ------------------------------------------------------------------------
[INFO] BUILD FAILURE
[INFO] ------------------------------------------------------------------------
[INFO] Total time: 12:52.855s
[INFO] Finished at: Tue Sep 16 19:39:19 UTC 2014
[INFO] Final Memory: 69M/168M
[INFO] ------------------------------------------------------------------------
[JENKINS] Archiving disabled
[JENKINS] Archiving disabled
[JENKINS] Archiving disabled
[JENKINS] Archiving disabled
[JENKINS] Archiving disabled
[JENKINS] Archiving disabled
[JENKINS] Archiving disabled
[JENKINS] Archiving disabled
[JENKINS] Archiving disabled
[JENKINS] Archiving disabled
[JENKINS] Archiving disabled
[JENKINS] Archiving disabled
[JENKINS] Archiving disabled
[JENKINS] Archiving disabled
[JENKINS] Archiving disabled
[JENKINS] Archiving disabled
[JENKINS] Archiving disabled
[JENKINS] Archiving disabled
[JENKINS] Archiving disabled
[JENKINS] Archiving disabled
[JENKINS] Archiving disabled
[JENKINS] Archiving disabled
[JENKINS] Archiving disabled
[JENKINS] Archiving disabled
[JENKINS] Archiving disabled
[JENKINS] Archiving disabled
[JENKINS] Archiving disabled
[JENKINS] Archiving disabled
[JENKINS] Archiving disabled
[JENKINS] Archiving disabled
[JENKINS] Archiving disabled
[JENKINS] Archiving disabled
[JENKINS] Archiving disabled
[JENKINS] Archiving disabled
[JENKINS] Archiving disabled
[JENKINS] Archiving disabled
[JENKINS] Archiving disabled
[JENKINS] Archiving disabled
[JENKINS] Archiving disabled
[JENKINS] Archiving disabled
[JENKINS] Archiving disabled
[JENKINS] Archiving disabled
[JENKINS] Archiving disabled
[JENKINS] Archiving disabled
[JENKINS] Archiving disabled
[JENKINS] Archiving disabled
[JENKINS] Archiving disabled
[JENKINS] Archiving disabled
[JENKINS] Archiving disabled
[JENKINS] Archiving disabled
[JENKINS] Archiving disabled
[JENKINS] Archiving disabled
[JENKINS] Archiving disabled
[JENKINS] Archiving disabled[WARNING] The requested profile "jcrinstall-tests" could not be activated because it does not exist.

Waiting for Jenkins to finish collecting data
[ERROR] Failed to execute goal on project org.apache.sling.jcr.resourcesecurity: Could not resolve dependencies for project org.apache.sling:org.apache.sling.jcr.resourcesecurity:bundle:0.0.1-SNAPSHOT: Could not find artifact org.apache.sling:org.apache.sling.resourceaccesssecurity:jar:0.0.1-SNAPSHOT in Nexus (http://repository.apache.org/snapshots) -> [Help 1]
[ERROR] 
[ERROR] To see the full stack trace of the errors, re-run Maven with the -e switch.
[ERROR] Re-run Maven using the -X switch to enable full debug logging.
[ERROR] 
[ERROR] For more information about the errors and possible solutions, please read the following articles:
[ERROR] [Help 1] http://cwiki.apache.org/confluence/display/MAVEN/DependencyResolutionException
[ERROR] 
[ERROR] After correcting the problems, you can resume the build with the command
[ERROR]   mvn <goals> -rf :org.apache.sling.jcr.resourcesecurity
Sending e-mails to: dev@sling.apache.org
Sending e-mails to: dev@sling.apache.org
channel stopped
[locks-and-latches] Releasing all the locks
[locks-and-latches] All the locks released

Build failed in Jenkins: sling-contrib-1.6 #1252

Posted by Apache Jenkins Server <je...@builds.apache.org>.
See <https://builds.apache.org/job/sling-contrib-1.6/1252/changes>

Changes:

[olli] [maven-release-plugin] prepare for next development iteration

[olli] [maven-release-plugin] prepare release org.apache.sling.scripting.java-2.0.12

[olli] SLING-3027 SLING-3017 add new Sling Scripting Java feature

[olli] SLING-3944 do not embed/export javax.inject in/from bundle, cleanup pom

------------------------------------------
[...truncated 6544 lines...]
main:
[INFO] Executed tasks
[INFO] 
[INFO] --- maven-remote-resources-plugin:1.5:process (default) @ org.apache.sling.launchpad.contrib-testing ---
[INFO] 
[INFO] --- maven-resources-plugin:2.6:resources (default-resources) @ org.apache.sling.launchpad.contrib-testing ---
[INFO] Using 'UTF-8' encoding to copy filtered resources.
[INFO] Copying 6 resources
[INFO] Copying 3 resources
[INFO] 
[INFO] --- build-helper-maven-plugin:1.8:reserve-network-port (reserve-network-port) @ org.apache.sling.launchpad.contrib-testing ---
[INFO] Reserved port 59482 for http.port
[INFO] 
[INFO] --- maven-antrun-plugin:1.7:run (check-memory-task) @ org.apache.sling.launchpad.contrib-testing ---
[INFO] Executing tasks

main:
     [echo] **************** WARNING (SLING-443/SLING-1782) ******************************
     [echo] On most platforms, you'll get OutOfMemoryErrors when building unless you set
     [echo] on 32bit platforms: MAVEN_OPTS="-Xmx256M -XX:MaxPermSize=256M", see SLING-443
     [echo] on 64bit platforms: MAVEN_OPTS="-Xmx512M -XX:MaxPermSize=512M", see SLING-1782
     [echo] ******************************************************************************
[INFO] Executed tasks
[INFO] 
[INFO] --- maven-compiler-plugin:3.1:compile (default-compile) @ org.apache.sling.launchpad.contrib-testing ---
[INFO] No sources to compile
[INFO] 
[INFO] --- maven-resources-plugin:2.6:testResources (default-testResources) @ org.apache.sling.launchpad.contrib-testing ---
[INFO] Using 'UTF-8' encoding to copy filtered resources.
[INFO] Copying 50 resources
[INFO] Copying 3 resources
[INFO] 
[INFO] --- maven-compiler-plugin:3.1:testCompile (default-testCompile) @ org.apache.sling.launchpad.contrib-testing ---
[INFO] Changes detected - recompiling the module!
[INFO] Compiling 10 source files to <https://builds.apache.org/job/sling-contrib-1.6/ws/contrib-1.6/launchpad/testing/target/test-classes>
[INFO] 
[INFO] --- maven-surefire-plugin:2.16:test (default-test) @ org.apache.sling.launchpad.contrib-testing ---
[JENKINS] Recording test results
[INFO] 
[INFO] --- animal-sniffer-maven-plugin:1.11:check (default) @ org.apache.sling.launchpad.contrib-testing ---
[INFO] Checking unresolved references to org.codehaus.mojo.signature:java15:1.0
[INFO] 
[INFO] --- maven-launchpad-plugin:2.3.0:prepare-package (prepare-package) @ org.apache.sling.launchpad.contrib-testing ---
[INFO] Using bundle list file from /home/jenkins/jenkins-slave/maven-repositories/2/org/apache/sling/org.apache.sling.launchpad/7-SNAPSHOT/org.apache.sling.launchpad-7-SNAPSHOT-bundlelist.xml
[INFO] Copying base artifact from /home/jenkins/jenkins-slave/maven-repositories/2/org/apache/sling/org.apache.sling.launchpad.base/2.5.1-SNAPSHOT/org.apache.sling.launchpad.base-2.5.1-SNAPSHOT.jar to <https://builds.apache.org/job/sling-contrib-1.6/ws/contrib-1.6/launchpad/testing/target/launchpad-bundles/resources/org.apache.sling.launchpad.base.jar.>
[INFO] Copying bundle from /home/jenkins/jenkins-slave/maven-repositories/2/org/slf4j/slf4j-api/1.7.6/slf4j-api-1.7.6.jar to <https://builds.apache.org/job/sling-contrib-1.6/ws/contrib-1.6/launchpad/testing/target/launchpad-bundles/resources/bundles/1/slf4j-api-1.7.6.jar>
[INFO] Copying bundle from /home/jenkins/jenkins-slave/maven-repositories/2/org/apache/sling/org.apache.sling.commons.log/4.0.0/org.apache.sling.commons.log-4.0.0.jar to <https://builds.apache.org/job/sling-contrib-1.6/ws/contrib-1.6/launchpad/testing/target/launchpad-bundles/resources/bundles/1/org.apache.sling.commons.log-4.0.0.jar>
[INFO] Copying bundle from /home/jenkins/jenkins-slave/maven-repositories/2/org/apache/sling/org.apache.sling.commons.logservice/1.0.2/org.apache.sling.commons.logservice-1.0.2.jar to <https://builds.apache.org/job/sling-contrib-1.6/ws/contrib-1.6/launchpad/testing/target/launchpad-bundles/resources/bundles/1/org.apache.sling.commons.logservice-1.0.2.jar>
[INFO] Copying bundle from /home/jenkins/jenkins-slave/maven-repositories/2/org/slf4j/jcl-over-slf4j/1.7.6/jcl-over-slf4j-1.7.6.jar to <https://builds.apache.org/job/sling-contrib-1.6/ws/contrib-1.6/launchpad/testing/target/launchpad-bundles/resources/bundles/1/jcl-over-slf4j-1.7.6.jar>
[INFO] Copying bundle from /home/jenkins/jenkins-slave/maven-repositories/2/org/slf4j/log4j-over-slf4j/1.7.6/log4j-over-slf4j-1.7.6.jar to <https://builds.apache.org/job/sling-contrib-1.6/ws/contrib-1.6/launchpad/testing/target/launchpad-bundles/resources/bundles/1/log4j-over-slf4j-1.7.6.jar>
[INFO] Copying bundle from /home/jenkins/jenkins-slave/maven-repositories/2/org/apache/sling/org.apache.sling.settings/1.3.2/org.apache.sling.settings-1.3.2.jar to <https://builds.apache.org/job/sling-contrib-1.6/ws/contrib-1.6/launchpad/testing/target/launchpad-bundles/resources/bundles/1/org.apache.sling.settings-1.3.2.jar>
[INFO] Copying bundle from /home/jenkins/jenkins-slave/maven-repositories/2/org/apache/sling/org.apache.sling.fragment.xml/1.0.2/org.apache.sling.fragment.xml-1.0.2.jar to <https://builds.apache.org/job/sling-contrib-1.6/ws/contrib-1.6/launchpad/testing/target/launchpad-bundles/resources/bundles/1/org.apache.sling.fragment.xml-1.0.2.jar>
[INFO] Copying bundle from /home/jenkins/jenkins-slave/maven-repositories/2/org/apache/sling/org.apache.sling.fragment.transaction/1.0.0/org.apache.sling.fragment.transaction-1.0.0.jar to <https://builds.apache.org/job/sling-contrib-1.6/ws/contrib-1.6/launchpad/testing/target/launchpad-bundles/resources/bundles/1/org.apache.sling.fragment.transaction-1.0.0.jar>
[INFO] Copying bundle from /home/jenkins/jenkins-slave/maven-repositories/2/org/apache/sling/org.apache.sling.javax.activation/0.1.0/org.apache.sling.javax.activation-0.1.0.jar to <https://builds.apache.org/job/sling-contrib-1.6/ws/contrib-1.6/launchpad/testing/target/launchpad-bundles/resources/bundles/1/org.apache.sling.javax.activation-0.1.0.jar>
[INFO] Copying bundle from /home/jenkins/jenkins-slave/maven-repositories/2/org/apache/sling/org.apache.sling.fragment.ws/1.0.2/org.apache.sling.fragment.ws-1.0.2.jar to <https://builds.apache.org/job/sling-contrib-1.6/ws/contrib-1.6/launchpad/testing/target/launchpad-bundles/resources/bundles/1/org.apache.sling.fragment.ws-1.0.2.jar>
[INFO] Copying bundle from /home/jenkins/jenkins-slave/maven-repositories/2/org/apache/sling/org.apache.sling.launchpad.installer/1.2.0/org.apache.sling.launchpad.installer-1.2.0.jar to <https://builds.apache.org/job/sling-contrib-1.6/ws/contrib-1.6/launchpad/testing/target/launchpad-bundles/resources/bundles/1/org.apache.sling.launchpad.installer-1.2.0.jar>
[INFO] Copying bundle from /home/jenkins/jenkins-slave/maven-repositories/2/org/apache/sling/org.apache.sling.installer.core/3.5.2/org.apache.sling.installer.core-3.5.2.jar to <https://builds.apache.org/job/sling-contrib-1.6/ws/contrib-1.6/launchpad/testing/target/launchpad-bundles/resources/bundles/1/org.apache.sling.installer.core-3.5.2.jar>
[INFO] Copying bundle from /home/jenkins/jenkins-slave/maven-repositories/2/org/apache/sling/org.apache.sling.installer.provider.file/1.0.2/org.apache.sling.installer.provider.file-1.0.2.jar to <https://builds.apache.org/job/sling-contrib-1.6/ws/contrib-1.6/launchpad/testing/target/launchpad-bundles/resources/bundles/1/org.apache.sling.installer.provider.file-1.0.2.jar>
[INFO] Copying bundle from /home/jenkins/jenkins-slave/maven-repositories/2/org/apache/felix/org.apache.felix.configadmin/1.6.0/org.apache.felix.configadmin-1.6.0.jar to <https://builds.apache.org/job/sling-contrib-1.6/ws/contrib-1.6/launchpad/testing/target/launchpad-bundles/resources/bundles/1/org.apache.felix.configadmin-1.6.0.jar>
[INFO] Copying bundle from /home/jenkins/jenkins-slave/maven-repositories/2/org/apache/felix/org.apache.felix.eventadmin/1.3.2/org.apache.felix.eventadmin-1.3.2.jar to <https://builds.apache.org/job/sling-contrib-1.6/ws/contrib-1.6/launchpad/testing/target/launchpad-bundles/resources/bundles/1/org.apache.felix.eventadmin-1.3.2.jar>
[INFO] Copying bundle from /home/jenkins/jenkins-slave/maven-repositories/2/commons-io/commons-io/1.4/commons-io-1.4.jar to <https://builds.apache.org/job/sling-contrib-1.6/ws/contrib-1.6/launchpad/testing/target/launchpad-bundles/resources/bundles/0/commons-io-1.4.jar>
[INFO] Copying bundle from /home/jenkins/jenkins-slave/maven-repositories/2/commons-fileupload/commons-fileupload/1.3.1/commons-fileupload-1.3.1.jar to <https://builds.apache.org/job/sling-contrib-1.6/ws/contrib-1.6/launchpad/testing/target/launchpad-bundles/resources/bundles/0/commons-fileupload-1.3.1.jar>
[INFO] Copying bundle from /home/jenkins/jenkins-slave/maven-repositories/2/commons-collections/commons-collections/3.2.1/commons-collections-3.2.1.jar to <https://builds.apache.org/job/sling-contrib-1.6/ws/contrib-1.6/launchpad/testing/target/launchpad-bundles/resources/bundles/0/commons-collections-3.2.1.jar>
[INFO] Copying bundle from /home/jenkins/jenkins-slave/maven-repositories/2/commons-codec/commons-codec/1.9/commons-codec-1.9.jar to <https://builds.apache.org/job/sling-contrib-1.6/ws/contrib-1.6/launchpad/testing/target/launchpad-bundles/resources/bundles/0/commons-codec-1.9.jar>
[INFO] Copying bundle from /home/jenkins/jenkins-slave/maven-repositories/2/commons-lang/commons-lang/2.6/commons-lang-2.6.jar to <https://builds.apache.org/job/sling-contrib-1.6/ws/contrib-1.6/launchpad/testing/target/launchpad-bundles/resources/bundles/0/commons-lang-2.6.jar>
[INFO] Copying bundle from /home/jenkins/jenkins-slave/maven-repositories/2/org/apache/commons/commons-math/2.2/commons-math-2.2.jar to <https://builds.apache.org/job/sling-contrib-1.6/ws/contrib-1.6/launchpad/testing/target/launchpad-bundles/resources/bundles/0/commons-math-2.2.jar>
[INFO] Copying bundle from /home/jenkins/jenkins-slave/maven-repositories/2/commons-pool/commons-pool/1.6/commons-pool-1.6.jar to <https://builds.apache.org/job/sling-contrib-1.6/ws/contrib-1.6/launchpad/testing/target/launchpad-bundles/resources/bundles/0/commons-pool-1.6.jar>
[INFO] Copying bundle from /home/jenkins/jenkins-slave/maven-repositories/2/org/apache/servicemix/bundles/org.apache.servicemix.bundles.concurrent/1.3.4_1/org.apache.servicemix.bundles.concurrent-1.3.4_1.jar to <https://builds.apache.org/job/sling-contrib-1.6/ws/contrib-1.6/launchpad/testing/target/launchpad-bundles/resources/bundles/0/org.apache.servicemix.bundles.concurrent-1.3.4_1.jar>
[INFO] Copying bundle from /home/jenkins/jenkins-slave/maven-repositories/2/org/apache/geronimo/bundles/commons-httpclient/3.1_1/commons-httpclient-3.1_1.jar to <https://builds.apache.org/job/sling-contrib-1.6/ws/contrib-1.6/launchpad/testing/target/launchpad-bundles/resources/bundles/0/commons-httpclient-3.1_1.jar>
[INFO] Copying bundle from /home/jenkins/jenkins-slave/maven-repositories/2/org/apache/sling/org.apache.sling.commons.osgi/2.2.0/org.apache.sling.commons.osgi-2.2.0.jar to <https://builds.apache.org/job/sling-contrib-1.6/ws/contrib-1.6/launchpad/testing/target/launchpad-bundles/resources/bundles/0/org.apache.sling.commons.osgi-2.2.0.jar>
Downloading: http://repository.apache.org/snapshots/org/apache/sling/org.apache.sling.commons.mime/2.1.5-SNAPSHOT/maven-metadata.xml
Downloaded: http://repository.apache.org/snapshots/org/apache/sling/org.apache.sling.commons.mime/2.1.5-SNAPSHOT/maven-metadata.xml (1021 B at 1.1 KB/sec)
[INFO] Copying bundle from /home/jenkins/jenkins-slave/maven-repositories/2/org/apache/sling/org.apache.sling.commons.mime/2.1.5-SNAPSHOT/org.apache.sling.commons.mime-2.1.5-SNAPSHOT.jar to <https://builds.apache.org/job/sling-contrib-1.6/ws/contrib-1.6/launchpad/testing/target/launchpad-bundles/resources/bundles/0/org.apache.sling.commons.mime-2.1.5-SNAPSHOT.jar>
[INFO] Copying bundle from /home/jenkins/jenkins-slave/maven-repositories/2/org/apache/sling/org.apache.sling.commons.classloader/1.3.2/org.apache.sling.commons.classloader-1.3.2.jar to <https://builds.apache.org/job/sling-contrib-1.6/ws/contrib-1.6/launchpad/testing/target/launchpad-bundles/resources/bundles/0/org.apache.sling.commons.classloader-1.3.2.jar>
[INFO] Copying bundle from /home/jenkins/jenkins-slave/maven-repositories/2/org/apache/sling/org.apache.sling.commons.compiler/2.2.0/org.apache.sling.commons.compiler-2.2.0.jar to <https://builds.apache.org/job/sling-contrib-1.6/ws/contrib-1.6/launchpad/testing/target/launchpad-bundles/resources/bundles/0/org.apache.sling.commons.compiler-2.2.0.jar>
[INFO] Copying bundle from /home/jenkins/jenkins-slave/maven-repositories/2/org/apache/sling/org.apache.sling.commons.scheduler/2.4.2/org.apache.sling.commons.scheduler-2.4.2.jar to <https://builds.apache.org/job/sling-contrib-1.6/ws/contrib-1.6/launchpad/testing/target/launchpad-bundles/resources/bundles/0/org.apache.sling.commons.scheduler-2.4.2.jar>
[INFO] Copying bundle from /home/jenkins/jenkins-slave/maven-repositories/2/org/apache/sling/org.apache.sling.commons.threads/3.2.0/org.apache.sling.commons.threads-3.2.0.jar to <https://builds.apache.org/job/sling-contrib-1.6/ws/contrib-1.6/launchpad/testing/target/launchpad-bundles/resources/bundles/0/org.apache.sling.commons.threads-3.2.0.jar>
[INFO] Copying bundle from /home/jenkins/jenkins-slave/maven-repositories/2/org/apache/sling/org.apache.sling.discovery.api/1.0.0/org.apache.sling.discovery.api-1.0.0.jar to <https://builds.apache.org/job/sling-contrib-1.6/ws/contrib-1.6/launchpad/testing/target/launchpad-bundles/resources/bundles/0/org.apache.sling.discovery.api-1.0.0.jar>
[INFO] Copying bundle from /home/jenkins/jenkins-slave/maven-repositories/2/org/apache/sling/org.apache.sling.discovery.support/1.0.0/org.apache.sling.discovery.support-1.0.0.jar to <https://builds.apache.org/job/sling-contrib-1.6/ws/contrib-1.6/launchpad/testing/target/launchpad-bundles/resources/bundles/0/org.apache.sling.discovery.support-1.0.0.jar>
[INFO] Copying bundle from /home/jenkins/jenkins-slave/maven-repositories/2/org/apache/sling/org.apache.sling.discovery.impl/1.0.8/org.apache.sling.discovery.impl-1.0.8.jar to <https://builds.apache.org/job/sling-contrib-1.6/ws/contrib-1.6/launchpad/testing/target/launchpad-bundles/resources/bundles/0/org.apache.sling.discovery.impl-1.0.8.jar>
[INFO] Copying bundle from /home/jenkins/jenkins-slave/maven-repositories/2/org/apache/sling/org.apache.sling.event/3.3.10/org.apache.sling.event-3.3.10.jar to <https://builds.apache.org/job/sling-contrib-1.6/ws/contrib-1.6/launchpad/testing/target/launchpad-bundles/resources/bundles/0/org.apache.sling.event-3.3.10.jar>
[INFO] Copying bundle from /home/jenkins/jenkins-slave/maven-repositories/2/org/apache/sling/org.apache.sling.api/2.7.0/org.apache.sling.api-2.7.0.jar to <https://builds.apache.org/job/sling-contrib-1.6/ws/contrib-1.6/launchpad/testing/target/launchpad-bundles/resources/bundles/0/org.apache.sling.api-2.7.0.jar>
[INFO] Copying bundle from /home/jenkins/jenkins-slave/maven-repositories/2/org/apache/sling/org.apache.sling.serviceusermapper/1.0.2/org.apache.sling.serviceusermapper-1.0.2.jar to <https://builds.apache.org/job/sling-contrib-1.6/ws/contrib-1.6/launchpad/testing/target/launchpad-bundles/resources/bundles/0/org.apache.sling.serviceusermapper-1.0.2.jar>
Downloading: http://repository.apache.org/snapshots/org/apache/sling/org.apache.sling.resourceresolver/1.1.1-SNAPSHOT/maven-metadata.xml
Downloaded: http://repository.apache.org/snapshots/org/apache/sling/org.apache.sling.resourceresolver/1.1.1-SNAPSHOT/maven-metadata.xml (1013 B at 3.1 KB/sec)
[INFO] Copying bundle from /home/jenkins/jenkins-slave/maven-repositories/2/org/apache/sling/org.apache.sling.resourceresolver/1.1.1-SNAPSHOT/org.apache.sling.resourceresolver-1.1.1-SNAPSHOT.jar to <https://builds.apache.org/job/sling-contrib-1.6/ws/contrib-1.6/launchpad/testing/target/launchpad-bundles/resources/bundles/0/org.apache.sling.resourceresolver-1.1.1-SNAPSHOT.jar>
Downloading: http://repository.apache.org/snapshots/org/apache/sling/org.apache.sling.auth.core/1.1.7-SNAPSHOT/maven-metadata.xml
Downloaded: http://repository.apache.org/snapshots/org/apache/sling/org.apache.sling.auth.core/1.1.7-SNAPSHOT/maven-metadata.xml (1006 B at 1.1 KB/sec)
[INFO] Copying bundle from /home/jenkins/jenkins-slave/maven-repositories/2/org/apache/sling/org.apache.sling.auth.core/1.1.7-SNAPSHOT/org.apache.sling.auth.core-1.1.7-SNAPSHOT.jar to <https://builds.apache.org/job/sling-contrib-1.6/ws/contrib-1.6/launchpad/testing/target/launchpad-bundles/resources/bundles/0/org.apache.sling.auth.core-1.1.7-SNAPSHOT.jar>
Downloading: http://repository.apache.org/snapshots/org/apache/sling/org.apache.sling.engine/2.3.5-SNAPSHOT/maven-metadata.xml
[INFO] Copying bundle from /home/jenkins/jenkins-slave/maven-repositories/2/org/apache/sling/org.apache.sling.engine/2.3.5-SNAPSHOT/org.apache.sling.engine-2.3.5-SNAPSHOT.jar to <https://builds.apache.org/job/sling-contrib-1.6/ws/contrib-1.6/launchpad/testing/target/launchpad-bundles/resources/bundles/0/org.apache.sling.engine-2.3.5-SNAPSHOT.jar>
Downloading: http://repository.apache.org/snapshots/org/apache/sling/org.apache.sling.auth.openid/1.0.3-SNAPSHOT/maven-metadata.xml
Downloaded: http://repository.apache.org/snapshots/org/apache/sling/org.apache.sling.auth.openid/1.0.3-SNAPSHOT/maven-metadata.xml (1016 B at 1.5 KB/sec)
[INFO] Copying bundle from /home/jenkins/jenkins-slave/maven-repositories/2/org/apache/sling/org.apache.sling.auth.openid/1.0.3-SNAPSHOT/org.apache.sling.auth.openid-1.0.3-SNAPSHOT.jar to <https://builds.apache.org/job/sling-contrib-1.6/ws/contrib-1.6/launchpad/testing/target/launchpad-bundles/resources/bundles/0/org.apache.sling.auth.openid-1.0.3-SNAPSHOT.jar>
Downloading: http://repository.apache.org/snapshots/org/apache/sling/org.apache.sling.auth.form/1.0.5-SNAPSHOT/maven-metadata.xml
Downloading: http://repository.apache.org/snapshots/org/apache/sling/org.apache.sling.auth.form/1.0.5-SNAPSHOT/org.apache.sling.auth.form-1.0.5-SNAPSHOT.jar
[JENKINS] Archiving disabled
[INFO] ------------------------------------------------------------------------
[INFO] Reactor Summary:
[INFO] 
[INFO] Apache Sling Authentication XING API .............. SUCCESS [39.170s]
[INFO] Apache Sling Authentication XING Login ............ SUCCESS [11.076s]
[INFO] Apache Sling Authentication XING OAuth ............ SUCCESS [6.531s]
[INFO] Apache Sling Commons FileSystem ClassLoader ....... SUCCESS [4.068s]
[INFO] Apache Sling Commons HTML Utilities ............... SUCCESS [5.395s]
[INFO] Apache Sling APT parser ........................... SUCCESS [12.220s]
[INFO] Apache Sling APT servlet .......................... SUCCESS [4.180s]
[INFO] Apache Sling Resource Collection API .............. SUCCESS [6.034s]
[INFO] Apache Sling ClassLoader Leak Detector ............ SUCCESS [3.399s]
[INFO] Apache Sling SLF4J MDC Filter ..................... SUCCESS [15.795s]
[INFO] Apache Sling DataSource Provider .................. SUCCESS [14.041s]
[INFO] Apache Sling Dojo JavaScript Library .............. SUCCESS [11.105s]
[INFO] Apache Sling Dojo Data Extension .................. SUCCESS [3.709s]
[INFO] Apache Sling FTP Server ........................... SUCCESS [8.845s]
[INFO] Apache Sling Google Web Toolkit Servlet Library ... SUCCESS [11.257s]
[INFO] Apache Sling Google Web Toolkit Sample ............ SUCCESS [41.633s]
[INFO] Apache Sling Internationalization Support ......... SUCCESS [32.367s]
[INFO] Apache Sling JMX Resource Provider ................ SUCCESS [5.695s]
[INFO] Apache Sling MongoDB Resource Provider ............ SUCCESS [5.795s]
[INFO] Apache Sling OSGi Bundle Repository ............... SUCCESS [8.298s]
[INFO] Apache Sling Request Processing Analyzer .......... SUCCESS [5.993s]
[INFO] Apache Sling Resource Merger ...................... SUCCESS [6.056s]
[INFO] Apache Sling Rewriter ............................. SUCCESS [8.353s]
[INFO] Apache Sling Tenant ............................... SUCCESS [5.880s]
[INFO] Apache Sling Replication .......................... SUCCESS [15.321s]
[INFO] Apache Sling Replication Integration Tests ........ SUCCESS [3:50.329s]
[INFO] sling-query ....................................... SUCCESS [9.487s]
[INFO] Apache Sling JCR Java Compiler .................... SUCCESS [8.862s]
[INFO] Apache Sling Repository Accessor .................. SUCCESS [5.833s]
[INFO] Apache Sling Object Content Mapping ............... SUCCESS [6.764s]
[INFO] Apache Sling JCR Prefs ............................ SUCCESS [5.194s]
[INFO] Apache Sling JCR Resource Security ................ SUCCESS [5.517s]
[INFO] Apache Sling Script Console ....................... SUCCESS [5.790s]
[INFO] Apache Sling Atom Tag Library ..................... SUCCESS [5.801s]
[INFO] Apache Sling Scripting Freemarker Support ......... SUCCESS [12.384s]
[INFO] Apache Sling Scripting Groovy Support ............. SUCCESS [5.775s]
[INFO] Apache Sling Scripting Java Support ............... SUCCESS [6.743s]
[INFO] Apache Sling Scripting JST Support ................ SUCCESS [9.816s]
[INFO] Apache Sling Scripting Python Support ............. SUCCESS [6.057s]
[INFO] Apache Sling Scripting Ruby Support ............... SUCCESS [9.473s]
[INFO] Apache Sling Scripting Thymeleaf .................. SUCCESS [9.190s]
[INFO] Apache Sling Scripting Velocity Support ........... SUCCESS [6.088s]
[INFO] Apache Sling Scripting W3C XML Processing Support . SUCCESS [8.139s]
[INFO] Apache Sling Launchpad Karaf ...................... SUCCESS [5.307s]
[INFO] Apache Sling Launchpad Karaf - Features ........... SUCCESS [8.496s]
[INFO] Apache Sling Launchpad Karaf - Integration Tests .. SUCCESS [9.013s]
[INFO] Apache Sling Launchpad Karaf - Launchpad Integration Tests  SUCCESS [6.315s]
[INFO] Apache Sling Launchpad Karaf Builder .............. SUCCESS [5.904s]
[INFO] Apache Sling Launchpad Contrib Testing ............ FAILURE [11.432s]
[INFO] Scala Script Engine ............................... SKIPPED
[INFO] Apache Sling Scala Scripting Configuration ........ SKIPPED
[INFO] Scala for Sling Demo Application - Hello World .... SKIPPED
[INFO] Scala for Sling Demo Application - Forum .......... SKIPPED
[INFO] Apache Sling Contrib (Builder) .................... SKIPPED
[INFO] ------------------------------------------------------------------------
[INFO] BUILD FAILURE
[INFO] ------------------------------------------------------------------------
[INFO] Total time: 12:40.074s
[INFO] Finished at: Wed Sep 17 12:09:17 UTC 2014
[INFO] Final Memory: 91M/219M
[INFO] ------------------------------------------------------------------------
[JENKINS] Archiving disabled
[JENKINS] Archiving disabled
[JENKINS] Archiving disabled
[JENKINS] Archiving disabled
[JENKINS] Archiving disabled
[JENKINS] Archiving disabled
[JENKINS] Archiving disabled
[JENKINS] Archiving disabled
[JENKINS] Archiving disabled
[JENKINS] Archiving disabled
[JENKINS] Archiving disabled
[JENKINS] Archiving disabled
[JENKINS] Archiving disabled
[JENKINS] Archiving disabled
[JENKINS] Archiving disabled
[JENKINS] Archiving disabled
[JENKINS] Archiving disabled
[JENKINS] Archiving disabled
[JENKINS] Archiving disabled
[JENKINS] Archiving disabled
[JENKINS] Archiving disabled
[JENKINS] Archiving disabled
[JENKINS] Archiving disabled
[JENKINS] Archiving disabled
[JENKINS] Archiving disabled
[JENKINS] Archiving disabled
[JENKINS] Archiving disabled
[JENKINS] Archiving disabled
[JENKINS] Archiving disabled
[JENKINS] Archiving disabled
[JENKINS] Archiving disabled
[JENKINS] Archiving disabled
[JENKINS] Archiving disabled
[JENKINS] Archiving disabled
[JENKINS] Archiving disabled
[JENKINS] Archiving disabled
[JENKINS] Archiving disabled
[JENKINS] Archiving disabled
[JENKINS] Archiving disabled
[JENKINS] Archiving disabled
[JENKINS] Archiving disabled
[JENKINS] Archiving disabled
[JENKINS] Archiving disabled
[JENKINS] Archiving disabled
[JENKINS] Archiving disabled
[JENKINS] Archiving disabled
[JENKINS] Archiving disabled
[JENKINS] Archiving disabled
[JENKINS] Archiving disabled
[JENKINS] Archiving disabled
[JENKINS] Archiving disabled
[JENKINS] Archiving disabled
[JENKINS] Archiving disabled
[JENKINS] Archiving disabled[WARNING] The requested profile "jcrinstall-tests" could not be activated because it does not exist.

Waiting for Jenkins to finish collecting data[ERROR] Failed to execute goal org.apache.sling:maven-launchpad-plugin:2.3.0:prepare-package (prepare-package) on project org.apache.sling.launchpad.contrib-testing: Unable to find artifact. Could not find artifact org.apache.sling:org.apache.sling.auth.form:jar:1.0.5-SNAPSHOT in Nexus (http://repository.apache.org/snapshots)
[ERROR] 
[ERROR] Try downloading the file manually from the project website.
[ERROR] 
[ERROR] Then, install it using the command:
[ERROR] mvn install:install-file -DgroupId=org.apache.sling -DartifactId=org.apache.sling.auth.form -Dversion=1.0.5-SNAPSHOT -Dpackaging=jar -Dfile=/path/to/file
[ERROR] 
[ERROR] Alternatively, if you host your own repository you can deploy the file there:
[ERROR] mvn deploy:deploy-file -DgroupId=org.apache.sling -DartifactId=org.apache.sling.auth.form -Dversion=1.0.5-SNAPSHOT -Dpackaging=jar -Dfile=/path/to/file -Durl=[url] -DrepositoryId=[id]
[ERROR] 
[ERROR] 
[ERROR] org.apache.sling:org.apache.sling.auth.form:jar:1.0.5-SNAPSHOT
[ERROR] 
[ERROR] from the specified remote repositories:
[ERROR] Nexus (http://repository.apache.org/snapshots, releases=false, snapshots=true),
[ERROR] central (http://repo.maven.apache.org/maven2, releases=true, snapshots=false)
[ERROR] -> [Help 1]
[ERROR] 
[ERROR] To see the full stack trace of the errors, re-run Maven with the -e switch.
[ERROR] Re-run Maven using the -X switch to enable full debug logging.
[ERROR] 
[ERROR] For more information about the errors and possible solutions, please read the following articles:
[ERROR] [Help 1] http://cwiki.apache.org/confluence/display/MAVEN/MojoExecutionException
[ERROR] 
[ERROR] After correcting the problems, you can resume the build with the command
[ERROR]   mvn <goals> -rf :org.apache.sling.launchpad.contrib-testing

Sending e-mails to: dev@sling.apache.org
Sending e-mails to: dev@sling.apache.org
Sending e-mails to: dev@sling.apache.org
channel stopped
[locks-and-latches] Releasing all the locks
[locks-and-latches] All the locks released