You are viewing a plain text version of this content. The canonical link for it is here.
Posted to dev@poi.apache.org by Apache Jenkins Server <je...@builds.apache.org> on 2015/08/01 00:16:42 UTC
Build failed in Jenkins: POI-JDK8 #482
See <https://builds.apache.org/job/POI-JDK8/482/changes>
Changes:
[nick] Start re-enabling some SXSSF formula evaluation tests, with required fixes #58200
[nick] Refactor the core part of the XSSF Formula Evaluator, to make SXSSF overrides easier #58200
[nick] More helpful exception on the wrong cell type
[nick] Get basic SXSSF formula evaluation working, for cells/references in the window #58200
[nick] Push most of the common logic from XSSFEvaluationWorkbook into BaseXSSFEvaluationWorkbook, and start to use it for SXSSF as well #58200
[nick] Remove a long-deprecated constructor
[nick] Fix inconsistent indents/whitespace
[nick] Prepare for SXSSF evaluation #58200
------------------------------------------
[...truncated 41 lines...]
A src/ooxml/java/org/apache/poi/xssf/usermodel/BaseXSSFFormulaEvaluator.java
U src/ooxml/java/org/apache/poi/xssf/usermodel/XSSFEvaluationWorkbook.java
U src/ooxml/java/org/apache/poi/xssf/usermodel/XSSFCreationHelper.java
U src/ooxml/java/org/apache/poi/xssf/usermodel/XSSFWorkbook.java
U src/ooxml/java/org/apache/poi/xssf/usermodel/XSSFFormulaEvaluator.java
U src/ooxml/testcases/org/apache/poi/xssf/usermodel/TestXSSFRichTextString.java
U src/ooxml/testcases/org/apache/poi/xssf/usermodel/TestSXSSFBugs.java
A src/ooxml/testcases/org/apache/poi/xssf/streaming/TestSXSSFFormulaEvaluation.java
U src/ooxml/testcases/org/apache/poi/xssf/streaming/TestSXSSFWorkbook.java
U src/ooxml/testcases/org/apache/poi/xssf/streaming/TestSXSSFCell.java
U src/ooxml/testcases/org/apache/poi/xslf/usermodel/TestPPTX2PNG.java
U src/ooxml/testcases/org/apache/poi/xslf/usermodel/TestXSLFSimpleShape.java
D src/ooxml/testcases/org/apache/poi/xslf/geom/TestPresetGeometries.java
A src/testcases/org/apache/poi/sl
A src/testcases/org/apache/poi/sl/draw
A src/testcases/org/apache/poi/sl/draw/geom
A src/testcases/org/apache/poi/sl/draw/geom/TestPresetGeometries.java
U src/testcases/org/apache/poi/ss/usermodel/BaseTestBugzillaIssues.java
Fetching 'https://svn.apache.org/repos/asf/poi/site/forrest.properties' at -1 into '<https://builds.apache.org/job/POI-JDK8/ws/forrest.properties'>
Fetching 'https://svn.apache.org/repos/asf/poi/site/src/documentation' at -1 into '<https://builds.apache.org/job/POI-JDK8/ws/src/documentation'>
U src/documentation/content/xdocs/slideshow/quick-guide.xml
U src/documentation/content/xdocs/slideshow/how-to-shapes.xml
U src/documentation/content/xdocs/slideshow/xslf-cookbook.xml
U src/documentation/content/xdocs/status.xml
At revision 1693662
At revision 1693662
no change for http://svn.apache.org/repos/asf/poi/trunk/forrest.properties since the previous build
no change for https://svn.apache.org/repos/asf/poi/site/src/documentation since the previous build
Deleting old artifacts from #480
[POI-JDK8] $ /home/jenkins/tools/ant/latest/bin/ant -Dcoverage.enabled=true clean jenkins
Buildfile: <https://builds.apache.org/job/POI-JDK8/ws/build.xml>
clean:
[delete] Deleting directory <https://builds.apache.org/job/POI-JDK8/ws/build>
check-jars:
fetch-jars:
check-ooxml-jars:
fetch-ooxml-jars:
init:
[mkdir] Created dir: <https://builds.apache.org/job/POI-JDK8/ws/build>
[mkdir] Created dir: <https://builds.apache.org/job/POI-JDK8/ws/build/classes>
[mkdir] Created dir: <https://builds.apache.org/job/POI-JDK8/ws/build/test-classes>
[mkdir] Created dir: <https://builds.apache.org/job/POI-JDK8/ws/build/test-results>
[mkdir] Created dir: <https://builds.apache.org/job/POI-JDK8/ws/build/scratchpad-classes>
[mkdir] Created dir: <https://builds.apache.org/job/POI-JDK8/ws/build/scratchpad-test-classes>
[mkdir] Created dir: <https://builds.apache.org/job/POI-JDK8/ws/build/scratchpad-test-results>
[mkdir] Created dir: <https://builds.apache.org/job/POI-JDK8/ws/build/geometry-java>
[mkdir] Created dir: <https://builds.apache.org/job/POI-JDK8/ws/build/ooxml-classes>
[mkdir] Created dir: <https://builds.apache.org/job/POI-JDK8/ws/build/ooxml-test-classes>
[mkdir] Created dir: <https://builds.apache.org/job/POI-JDK8/ws/build/ooxml-test-results>
[mkdir] Created dir: <https://builds.apache.org/job/POI-JDK8/ws/build/excelant-classes>
[mkdir] Created dir: <https://builds.apache.org/job/POI-JDK8/ws/build/excelant-test-classes>
[mkdir] Created dir: <https://builds.apache.org/job/POI-JDK8/ws/build/excelant-test-results>
[mkdir] Created dir: <https://builds.apache.org/job/POI-JDK8/ws/build/examples-classes>
[mkdir] Created dir: <https://builds.apache.org/job/POI-JDK8/ws/build/integration-test-classes>
[mkdir] Created dir: <https://builds.apache.org/job/POI-JDK8/482/artifact/build/integration-test-results>
[mkdir] Created dir: <https://builds.apache.org/job/POI-JDK8/ws/build/dist>
[mkdir] Created dir: <https://builds.apache.org/job/POI-JDK8/ws/build/tmp/site/build/site>
[echo] Using Java: 1.8.0_20/1.8.0_20-b26/25.20-b23/Java HotSpot(TM) 64-Bit Server VM from Oracle Corporation on Linux: 3.13.0-36-lowlatency
compile-main:
[javac] Compiling 1176 source files to <https://builds.apache.org/job/POI-JDK8/ws/build/classes>
[javac] warning: [options] bootstrap class path not set in conjunction with -source 1.6
[javac] Note: Some input files use or override a deprecated API.
[javac] Note: Recompile with -Xlint:deprecation for details.
[javac] Note: Some input files use unchecked or unsafe operations.
[javac] Note: Recompile with -Xlint:unchecked for details.
[javac] 1 warning
[javac] Compiling 513 source files to <https://builds.apache.org/job/POI-JDK8/ws/build/test-classes>
[javac] warning: [options] bootstrap class path not set in conjunction with -source 1.6
[javac] Note: Some input files use or override a deprecated API.
[javac] Note: Recompile with -Xlint:deprecation for details.
[javac] Note: Some input files use unchecked or unsafe operations.
[javac] Note: Recompile with -Xlint:unchecked for details.
[javac] 1 warning
[copy] Copying 4 files to <https://builds.apache.org/job/POI-JDK8/ws/build/classes>
check-ooxml-xsds:
fetch-ooxml-xsds:
generate-geometry:
compile-scratchpad:
[javac] Compiling 504 source files to <https://builds.apache.org/job/POI-JDK8/ws/build/scratchpad-classes>
[javac] warning: [options] bootstrap class path not set in conjunction with -source 1.6
[javac] Note: Some input files use or override a deprecated API.
[javac] Note: Recompile with -Xlint:deprecation for details.
[javac] Note: Some input files use unchecked or unsafe operations.
[javac] Note: Recompile with -Xlint:unchecked for details.
[javac] 1 warning
[javac] Compiling 182 source files to <https://builds.apache.org/job/POI-JDK8/ws/build/scratchpad-test-classes>
[javac] warning: [options] bootstrap class path not set in conjunction with -source 1.6
[javac] Note: Some input files use or override a deprecated API.
[javac] Note: Recompile with -Xlint:deprecation for details.
[javac] Note: <https://builds.apache.org/job/POI-JDK8/ws/src/scratchpad/testcases/org/apache/poi/hslf/TestReWriteSanity.java> uses unchecked or unsafe operations.
[javac] Note: Recompile with -Xlint:unchecked for details.
[javac] 1 warning
[copy] Copying 2 files to <https://builds.apache.org/job/POI-JDK8/ws/build/scratchpad-classes>
check-compiled-ooxml-xsds:
compile-ooxml-xsds:
compile-ooxml:
[javac] Compiling 349 source files to <https://builds.apache.org/job/POI-JDK8/ws/build/ooxml-classes>
[javac] warning: [options] bootstrap class path not set in conjunction with -source 1.6
[javac] Note: Some input files use or override a deprecated API.
[javac] Note: Recompile with -Xlint:deprecation for details.
[javac] Note: Some input files use unchecked or unsafe operations.
[javac] Note: Recompile with -Xlint:unchecked for details.
[javac] 1 warning
[javac] Compiling 185 source files to <https://builds.apache.org/job/POI-JDK8/ws/build/ooxml-test-classes>
[javac] warning: [options] bootstrap class path not set in conjunction with -source 1.6
[javac] Note: Some input files use or override a deprecated API.
[javac] Note: Recompile with -Xlint:deprecation for details.
[javac] 1 warning
[copy] Copying 2 files to <https://builds.apache.org/job/POI-JDK8/ws/build/ooxml-classes>
compile-examples:
[javac] Compiling 136 source files to <https://builds.apache.org/job/POI-JDK8/ws/build/examples-classes>
[javac] warning: [options] bootstrap class path not set in conjunction with -source 1.6
[javac] Note: Some input files use or override a deprecated API.
[javac] Note: Recompile with -Xlint:deprecation for details.
[javac] Note: Some input files use unchecked or unsafe operations.
[javac] Note: Recompile with -Xlint:unchecked for details.
[javac] 1 warning
[copy] Copying 1 file to <https://builds.apache.org/job/POI-JDK8/ws/build/examples-classes>
compile-excelant:
[javac] Compiling 14 source files to <https://builds.apache.org/job/POI-JDK8/ws/build/excelant-classes>
[javac] warning: [options] bootstrap class path not set in conjunction with -source 1.6
[javac] Note: <https://builds.apache.org/job/POI-JDK8/ws/src/excelant/java/org/apache/poi/ss/excelant/util/ExcelAntWorkbookUtil.java> uses or overrides a deprecated API.
[javac] Note: Recompile with -Xlint:deprecation for details.
[javac] 1 warning
[javac] Compiling 13 source files to <https://builds.apache.org/job/POI-JDK8/ws/build/excelant-test-classes>
[javac] warning: [options] bootstrap class path not set in conjunction with -source 1.6
[javac] 1 warning
[copy] Copying 1 file to <https://builds.apache.org/job/POI-JDK8/ws/build/excelant-classes>
compile:
compile-ooxml-lite:
[mkdir] Created dir: <https://builds.apache.org/job/POI-JDK8/ws/build/ooxml-lite-merged>
[jar] Building jar: <https://builds.apache.org/job/POI-JDK8/ws/build/ooxml-lite-merged/ooxml-lite-merged.jar>
[java] Collecting unit tests from <https://builds.apache.org/job/POI-JDK8/ws/build/ooxml-test-classes>
[java] Inner class org.apache.poi.poifs.crypt.TestCertificateEncryption$CertData.class not included
[java] Inner class org.apache.poi.xssf.streaming.TestSXSSFWorkbook$1.class not included
[java] Inner class org.apache.poi.xssf.streaming.TestSXSSFWorkbook$NullOutputStream.class not included
[java] Inner class org.apache.poi.xssf.extractor.TestXSSFExportToXML$DummyEntityResolver.class not included
[java] Inner class org.apache.poi.xssf.extractor.TestXSSFExportToXML$1.class not included
[java] Inner class org.apache.poi.xssf.usermodel.TestFormulaEvaluatorOnXSSF$Result.class not included
[java] Inner class org.apache.poi.xssf.usermodel.TestMultiSheetFormulaEvaluatorOnXSSF$SS.class not included
[java] Inner class org.apache.poi.xssf.usermodel.TestXSSFBugs$1.class not included
[java] Class org.apache.poi.xssf.usermodel.TestXSSFSheetAutosizeColumn does not derive from TestCase and does not have a @Test annotation
[java] Inner class org.apache.poi.xssf.usermodel.TestMultiSheetFormulaEvaluatorOnXSSF$Result.class not included
[java] Inner class org.apache.poi.xssf.usermodel.TestFormulaEvaluatorOnXSSF$SS.class not included
[java] Inner class org.apache.poi.TestPOIXMLDocument$OPCParser.class not included
[java] Inner class org.apache.poi.TestPOIXMLDocument$TestFactory.class not included
[java] Inner class org.apache.poi.xslf.usermodel.TestXSLFTextParagraph$DrawTextParagraphProxy.class not included
[java] Found 166 classes
[java] SLF4J: Failed to load class "org.slf4j.impl.StaticLoggerBinder".
[java] SLF4J: Defaulting to no-operation (NOP) logger implementation
[java] SLF4J: See http://www.slf4j.org/codes.html#StaticLoggerBinder for further details.
[java] ...................................I...................................................................................Setting col: 0 and row 0
[java] Setting col: 1 and row 1
[java] ..................................E....................................................................................................................................................................................................................................................................................................................................Done
[java] ...........<?xml version="1.0" encoding="UTF-8"?>
[java] <worksheet xmlns="http://schemas.openxmlformats.org/spreadsheetml/2006/main"><dimension ref="A1"/><sheetViews><sheetView workbookViewId="0" tabSelected="true"/></sheetViews><sheetFormatPr defaultRowHeight="15.0"/><sheetData/><pageMargins bottom="0.75" footer="0.3" header="0.3" left="0.7" right="0.7" top="0.75"/></worksheet>
[java] ................................................................................................org.apache.poi.ss.usermodel.CellValue [12.0]
[java] org.apache.poi.ss.usermodel.CellValue [12.0]
[java] .....org.apache.poi.ss.usermodel.CellValue [1.0]
[java] org.apache.poi.ss.usermodel.CellValue [1.0]
[java] .org.apache.poi.ss.usermodel.CellValue [2.0]
[java] org.apache.poi.ss.usermodel.CellValue [2.0]
[java] .org.apache.poi.ss.usermodel.CellValue [2.0]
[java] .org.apache.poi.ss.usermodel.CellValue [2.0]
[java] .org.apache.poi.ss.usermodel.CellValue [2.0]
[java] .org.apache.poi.ss.usermodel.CellValue [3.0]
[java] Warning - Row 13 has no cell 1, can't figure out test name
[java] [Fatal Error] :1:1: JAXP00010001: The parser has encountered more than "4096" entity expansions in this document; this is the limit imposed by the JDK.
[java] [Fatal Error] :1:1: JAXP00010001: The parser has encountered more than "4096" entity expansions in this document; this is the limit imposed by the JDK.
[java] ...........IIII.IIII......I..........................................................I..................................................................................................................................................................................................................................I.....I...................I.....................................................................Name: /word/document.xml - Content Type: application/vnd.openxmlformats-officedocument.wordprocessingml.document.main+xml
[java] JAXP: find factoryId =javax.xml.stream.XMLInputFactory
[java] JAXP: loaded from fallback value: com.sun.xml.internal.stream.XMLInputFactoryImpl
[java] JAXP: created new instance of class com.sun.xml.internal.stream.XMLInputFactoryImpl using ClassLoader: null
[java] ..........................................................................................................................................................II..............................................................................................................I............................................
[java] Time: 101.105
[java] There was 1 failure:
[java] 1) setSheetName(org.apache.poi.xssf.streaming.TestSXSSFWorkbook)
[java] org.junit.ComparisonFailure: expected:<SUM('[47100 - First]'!A1:C1)> but was:<SUM('[Testing 47100]'!A1:C1)>
[java] at org.junit.Assert.assertEquals(Assert.java:115)
[java] Exception in thread "main" java.lang.RuntimeException: Tests did not succeed, cannot build ooxml-lite jar at org.junit.Assert.assertEquals(Assert.java:144)
[java]
[java] at org.apache.poi.util.OOXMLLite.build(OOXMLLite.java:102)
[java] at org.apache.poi.util.OOXMLLite.main(OOXMLLite.java:86) at org.apache.poi.ss.usermodel.BaseTestWorkbook.setSheetName(BaseTestWorkbook.java:606)
[java]
[java] at org.apache.poi.xssf.streaming.TestSXSSFWorkbook.setSheetName(TestSXSSFWorkbook.java:81)
[java] at sun.reflect.NativeMethodAccessorImpl.invoke0(Native Method)
[java] at sun.reflect.NativeMethodAccessorImpl.invoke(NativeMethodAccessorImpl.java:62)
[java] at sun.reflect.DelegatingMethodAccessorImpl.invoke(DelegatingMethodAccessorImpl.java:43)
[java] at java.lang.reflect.Method.invoke(Method.java:483)
[java] at org.junit.runners.model.FrameworkMethod$1.runReflectiveCall(FrameworkMethod.java:50)
[java] at org.junit.internal.runners.model.ReflectiveCallable.run(ReflectiveCallable.java:12)
[java] at org.junit.runners.model.FrameworkMethod.invokeExplosively(FrameworkMethod.java:47)
[java] at org.junit.internal.runners.statements.InvokeMethod.evaluate(InvokeMethod.java:17)
[java] at org.junit.internal.runners.statements.RunAfters.evaluate(RunAfters.java:27)
[java] at org.junit.runners.ParentRunner.runLeaf(ParentRunner.java:325)
[java] at org.junit.runners.BlockJUnit4ClassRunner.runChild(BlockJUnit4ClassRunner.java:78)
[java] at org.junit.runners.BlockJUnit4ClassRunner.runChild(BlockJUnit4ClassRunner.java:57)
[java] at org.junit.runners.ParentRunner$3.run(ParentRunner.java:290)
[java] at org.junit.runners.ParentRunner$1.schedule(ParentRunner.java:71)
[java] at org.junit.runners.ParentRunner.runChildren(ParentRunner.java:288)
[java] at org.junit.runners.ParentRunner.access$000(ParentRunner.java:58)
[java] at org.junit.runners.ParentRunner$2.evaluate(ParentRunner.java:268)
[java] at org.junit.runners.ParentRunner.run(ParentRunner.java:363)
[java] at org.junit.runners.Suite.runChild(Suite.java:128)
[java] at org.junit.runners.Suite.runChild(Suite.java:27)
[java] at org.junit.runners.ParentRunner$3.run(ParentRunner.java:290)
[java] at org.junit.runners.ParentRunner$1.schedule(ParentRunner.java:71)
[java] at org.junit.runners.ParentRunner.runChildren(ParentRunner.java:288)
[java] at org.junit.runners.ParentRunner.access$000(ParentRunner.java:58)
[java] at org.junit.runners.ParentRunner$2.evaluate(ParentRunner.java:268)
[java] at org.junit.runners.ParentRunner.run(ParentRunner.java:363)
[java] at org.junit.runner.JUnitCore.run(JUnitCore.java:137)
[java] at org.junit.runner.JUnitCore.run(JUnitCore.java:115)
[java] at org.junit.runner.JUnitCore.run(JUnitCore.java:105)
[java] at org.junit.runner.JUnitCore.run(JUnitCore.java:94)
[java] at org.apache.poi.util.OOXMLLite.build(OOXMLLite.java:100)
[java] at org.apache.poi.util.OOXMLLite.main(OOXMLLite.java:86)
[java]
[java] FAILURES!!!
[java] Tests run: 1296, Failures: 1
[java]
BUILD FAILED
<https://builds.apache.org/job/POI-JDK8/ws/build.xml>:1190: Java returned: 1
Total time: 2 minutes 45 seconds
Build step 'Invoke Ant' marked build as failure
[FINDBUGS] Skipping publisher since build result is FAILURE
[WARNINGS] Skipping publisher since build result is FAILURE
Archiving artifacts
Recording test results
---------------------------------------------------------------------
To unsubscribe, e-mail: dev-unsubscribe@poi.apache.org
For additional commands, e-mail: dev-help@poi.apache.org
Jenkins build is back to normal : POI-JDK8 #483
Posted by Apache Jenkins Server <je...@builds.apache.org>.
See <https://builds.apache.org/job/POI-JDK8/483/changes>
---------------------------------------------------------------------
To unsubscribe, e-mail: dev-unsubscribe@poi.apache.org
For additional commands, e-mail: dev-help@poi.apache.org