You are viewing a plain text version of this content. The canonical link for it is here.
Posted to builds@solr.apache.org by Apache Jenkins Server <je...@builds.apache.org> on 2026/01/15 02:21:48 UTC
[JENKINS] Solr » Solr-Test-9.x - Build # 10135 - Still Failing!
Build: https://ci-builds.apache.org/job/Solr/job/Solr-Test-9.x/10135/
All tests passed
Build Log:
[...truncated 445 lines...]
BUILD FAILED in 42m 53s
165 actionable tasks: 165 executed
Publishing build scan...
https://develocity.apache.org/s/fhevoerzl22vs
Build step 'Invoke Gradle script' changed build result to FAILURE
Build step 'Invoke Gradle script' marked build as failure
Archiving artifacts
Recording test results
[Checks API] No suitable checks publisher found.
Email was triggered for: Failure - Any
Sending email for trigger: Failure - Any
[JENKINS] Solr » Solr-Test-9.x - Build # 10138 - Still Failing!
Posted by Apache Jenkins Server <je...@builds.apache.org>.
Build: https://ci-builds.apache.org/job/Solr/job/Solr-Test-9.x/10138/
All tests passed
Build Log:
[...truncated 445 lines...]
BUILD FAILED in 45m 50s
165 actionable tasks: 165 executed
Publishing build scan...
https://develocity.apache.org/s/4eo3rshf2ydg4
Build step 'Invoke Gradle script' changed build result to FAILURE
Build step 'Invoke Gradle script' marked build as failure
Archiving artifacts
Recording test results
[Checks API] No suitable checks publisher found.
Email was triggered for: Failure - Any
Sending email for trigger: Failure - Any
[JENKINS] Solr » Solr-Test-9.x - Build # 10137 - Still Failing!
Posted by Apache Jenkins Server <je...@builds.apache.org>.
Build: https://ci-builds.apache.org/job/Solr/job/Solr-Test-9.x/10137/
All tests passed
Build Log:
[...truncated 443 lines...]
BUILD FAILED in 45m
165 actionable tasks: 165 executed
Publishing build scan...
https://develocity.apache.org/s/qatfbfhi54e7a
Build step 'Invoke Gradle script' changed build result to FAILURE
Build step 'Invoke Gradle script' marked build as failure
Archiving artifacts
Recording test results
[Checks API] No suitable checks publisher found.
Email was triggered for: Failure - Any
Sending email for trigger: Failure - Any
[JENKINS] Solr » Solr-Test-9.x - Build # 10136 - Still Failing!
Posted by Apache Jenkins Server <je...@builds.apache.org>.
Build: https://ci-builds.apache.org/job/Solr/job/Solr-Test-9.x/10136/
All tests passed
Build Log:
[...truncated 444 lines...]
BUILD FAILED in 46m 47s
165 actionable tasks: 165 executed
Publishing build scan...
https://develocity.apache.org/s/d3ht5vnpzotd4
Build step 'Invoke Gradle script' changed build result to FAILURE
Build step 'Invoke Gradle script' marked build as failure
Archiving artifacts
Recording test results
[Checks API] No suitable checks publisher found.
Email was triggered for: Failure - Any
Sending email for trigger: Failure - Any