You are viewing a plain text version of this content. The canonical link for it is here.
Posted to dev@poi.apache.org by Apache Jenkins Server <je...@builds.apache.org> on 2022/11/26 00:28:45 UTC
Build failed in Jenkins: POI » POI-DSL-1.8 #796
See <https://ci-builds.apache.org/job/POI/job/POI-DSL-1.8/796/display/redirect?page=changes>
Changes:
[PJ Fanning] slf4j 2.0.5
------------------------------------------
[...truncated 1.85 KB...]
At revision 1905531
<-- Got one external: forrest.properties, svn url: https://svn.apache.org/repos/asf/poi/site/forrest.properties -->
Fetching 'https://svn.apache.org/repos/asf/poi/site/forrest.properties' at -1 into '<https://ci-builds.apache.org/job/POI/job/POI-DSL-1.8/ws/forrest.properties'>
At revision 1905531
At revision 1905531
No changes for https://svn.apache.org/repos/asf/poi/site/src/documentation since the previous build
No changes for https://svn.apache.org/repos/asf/poi/site/forrest.properties since the previous build
ERROR: Not all environment variables could be successfully injected. Check for similarly-named environment variables.
[POI-DSL-1.8] $ /bin/sh -xe /tmp/jenkins16584234416261706600.sh
+ rm -rf examples excelant integrationtest main ooxml ooxml-schema scratchpad build.javacheck.xml
+ svn status
X forrest.properties
X src/documentation
M src/resources/ooxml-lite-report.xsb
Performing status on external item at 'src/documentation':
+ svn revert poi-examples/src/main/java9/module-info.class poi-examples/src/main/java9/module-info.java poi-excelant/src/main/java9/module-info.class poi-excelant/src/main/java9/module-info.java poi-excelant/src/test/java9/module-info.class poi-excelant/src/test/java9/module-info.java poi-integration/src/test/java9/module-info.class poi-integration/src/test/java9/module-info.java poi-ooxml-full/src/main/java9/module-info.class poi-ooxml-full/src/main/java9/module-info.java poi-ooxml-lite-agent/src/main/java9/module-info.class poi-ooxml-lite-agent/src/main/java9/module-info.java poi-ooxml-lite/src/main/java9/module-info.class poi-ooxml-lite/src/main/java9/module-info.java poi-ooxml/src/main/java9/module-info.class poi-ooxml/src/main/java9/module-info.java poi-ooxml/src/test/java9/module-info.class poi-ooxml/src/test/java9/module-info.java poi-scratchpad/src/main/java9/module-info.class poi-scratchpad/src/main/java9/module-info.java poi-scratchpad/src/test/java9/module-info.class poi-scratchpad/src/test/java9/module-info.java poi/src/main/java9/module-info.class poi/src/main/java9/module-info.java poi/src/test/java9/module-info.class poi/src/test/java9/module-info.java
+ svn revert src/resources/ooxml-lite-report.clazz src/resources/ooxml-lite-report.xsb
Reverted 'src/resources/ooxml-lite-report.xsb'
+ echo Java-Home: /home/jenkins/tools/java/latest1.8
Java-Home: /home/jenkins/tools/java/latest1.8
+ ls -al /home/jenkins/tools/java/latest1.8/
total 25824
drwxr-xr-x 8 root root 4096 Jul 28 09:16 .
drwxr-xr-x 32 root root 4096 Sep 20 03:42 ..
drwxr-xr-x 2 root root 4096 Jul 28 09:16 bin
-r--r--r-- 1 root root 3244 Apr 7 2021 COPYRIGHT
drwxr-xr-x 3 root root 4096 Jul 28 09:16 include
-rw-r--r-- 1 root root 5228315 Mar 19 2021 javafx-src.zip
-rw-r--r-- 1 root root 195 Apr 7 2021 jmc.txt
drwxr-xr-x 6 root root 4096 Jul 28 09:16 jre
drwxr-xr-x 4 root root 4096 Jun 24 2021 legal
drwxr-xr-x 4 root root 4096 Jul 28 09:16 lib
-r--r--r-- 1 root root 44 Apr 7 2021 LICENSE
drwxr-xr-x 4 root root 4096 Jun 24 2021 man
-r--r--r-- 1 root root 159 Apr 7 2021 README.html
-rw-r--r-- 1 root root 486 Apr 7 2021 release
-rw-r--r-- 1 root root 21151243 Apr 7 2021 src.zip
-rw-r--r-- 1 root root 190 Mar 19 2021 THIRDPARTYLICENSEREADME-JAVAFX.txt
-r--r--r-- 1 root root 190 Apr 7 2021 THIRDPARTYLICENSEREADME.txt
+ ls -al /home/jenkins/tools/java/latest1.8/bin
total 844
drwxr-xr-x 2 root root 4096 Jul 28 09:16 .
drwxr-xr-x 8 root root 4096 Jul 28 09:16 ..
-rwxr-xr-x 1 root root 8840 Apr 7 2021 appletviewer
-rwxr-xr-x 2 root root 6264 Apr 7 2021 ControlPanel
-rwxr-xr-x 1 root root 8832 Apr 7 2021 extcheck
-rwxr-xr-x 1 root root 8832 Apr 7 2021 idlj
-rwxr-xr-x 1 root root 8832 Apr 7 2021 jar
-rwxr-xr-x 1 root root 8832 Apr 7 2021 jarsigner
-rwxr-xr-x 1 root root 8712 Apr 7 2021 java
-rwxr-xr-x 1 root root 8832 Apr 7 2021 javac
-rwxr-xr-x 1 root root 8832 Apr 7 2021 javadoc
-rwxr-xr-x 1 root root 2293 Mar 19 2021 javafxpackager
-rwxr-xr-x 1 root root 8832 Apr 7 2021 javah
-rwxr-xr-x 1 root root 8832 Apr 7 2021 javap
-rwxr-xr-x 1 root root 2293 Mar 19 2021 javapackager
-rwxr-xr-x 1 root root 1809 Apr 7 2021 java-rmi.cgi
-rwxr-xr-x 1 root root 148896 Apr 7 2021 javaws
-rwxr-xr-x 1 root root 8832 Apr 7 2021 jcmd
-rwxr-xr-x 1 root root 8856 Apr 7 2021 jconsole
-rwxr-xr-x 2 root root 6264 Apr 7 2021 jcontrol
-rwxr-xr-x 1 root root 8848 Apr 7 2021 jdb
-rwxr-xr-x 1 root root 8832 Apr 7 2021 jdeps
-rwxr-xr-x 1 root root 8832 Apr 7 2021 jhat
-rwxr-xr-x 1 root root 8896 Apr 7 2021 jinfo
-rwxr-xr-x 1 root root 8832 Apr 7 2021 jjs
-rwxr-xr-x 1 root root 8896 Apr 7 2021 jmap
-rwxr-xr-x 1 root root 8832 Apr 7 2021 jps
-rwxr-xr-x 1 root root 8840 Apr 7 2021 jrunscript
-rwxr-xr-x 1 root root 8848 Apr 7 2021 jsadebugd
-rwxr-xr-x 1 root root 8896 Apr 7 2021 jstack
-rwxr-xr-x 1 root root 8832 Apr 7 2021 jstat
-rwxr-xr-x 1 root root 8832 Apr 7 2021 jstatd
-rwxr-xr-x 1 root root 5110 Jan 14 2017 jvisualvm
-rwxr-xr-x 1 root root 8832 Apr 7 2021 keytool
-rwxr-xr-x 1 root root 8840 Apr 7 2021 native2ascii
-rwxr-xr-x 1 root root 8904 Apr 7 2021 orbd
-rwxr-xr-x 1 root root 8832 Apr 7 2021 pack200
-rwxr-xr-x 1 root root 8840 Apr 7 2021 policytool
-rwxr-xr-x 1 root root 8832 Apr 7 2021 rmic
-rwxr-xr-x 1 root root 8832 Apr 7 2021 rmid
-rwxr-xr-x 1 root root 8840 Apr 7 2021 rmiregistry
-rwxr-xr-x 1 root root 8832 Apr 7 2021 schemagen
-rwxr-xr-x 1 root root 8832 Apr 7 2021 serialver
-rwxr-xr-x 1 root root 8840 Apr 7 2021 servertool
-rwxr-xr-x 1 root root 8904 Apr 7 2021 tnameserv
-rwxr-xr-x 1 root root 186960 Apr 7 2021 unpack200
-rwxr-xr-x 1 root root 8832 Apr 7 2021 wsgen
-rwxr-xr-x 1 root root 8832 Apr 7 2021 wsimport
-rwxr-xr-x 1 root root 8832 Apr 7 2021 xjc
+ /home/jenkins/tools/java/latest1.8/bin/java -version
java version "1.8.0_291"
Java(TM) SE Runtime Environment (build 1.8.0_291-b10)
Java HotSpot(TM) 64-Bit Server VM (build 25.291-b10, mixed mode)
+ echo which java
which java
+ which java
/home/jenkins/tools/java/latest1.8/bin/java
+ java -version
java version "1.8.0_291"
Java(TM) SE Runtime Environment (build 1.8.0_291-b10)
Java HotSpot(TM) 64-Bit Server VM (build 25.291-b10, mixed mode)
+ echo which javac
which javac
+ which javac
/home/jenkins/tools/java/latest1.8/bin/javac
+ javac -version
javac 1.8.0_291
+ echo Ant-Home:
Ant-Home:
+ ls -al
total 528
drwxr-xr-x 22 jenkins jenkins 4096 Nov 26 00:26 .
drwxr-xr-x 3 jenkins jenkins 4096 Oct 14 17:37 ..
-rw-r--r-- 1 jenkins jenkins 520 Dec 20 2021 .asf.yaml
drwxr-xr-x 7 jenkins jenkins 4096 Nov 18 12:36 build
-rw-r--r-- 1 jenkins jenkins 33128 Nov 26 00:26 build.gradle
-rw-r--r-- 1 jenkins jenkins 169280 Nov 26 00:26 build.xml
-rw-r--r-- 1 jenkins jenkins 7190 Sep 17 00:26 doap_POI.rdf
-rw-r--r-- 1 jenkins jenkins 3216 Nov 13 19:22 file-leak-detector.exclude
-rw-r--r-- 1 jenkins jenkins 6229 Dec 20 2021 forrest.properties
-rw-r--r-- 1 jenkins jenkins 53 Dec 20 2021 .gitattributes
drwxr-xr-x 3 jenkins jenkins 4096 May 23 2022 .github
-rw-r--r-- 1 jenkins jenkins 334 Dec 20 2021 .gitignore
drwxr-xr-x 3 jenkins jenkins 4096 Dec 20 2021 gradle
drwxr-xr-x 5 jenkins jenkins 4096 Nov 2 12:43 .gradle
-rw-r--r-- 1 jenkins jenkins 599 Dec 20 2021 gradle.properties
-rwxr-xr-x 1 jenkins jenkins 8188 Jul 22 00:26 gradlew
-rw-r--r-- 1 jenkins jenkins 2838 Jul 22 00:26 gradlew.bat
drwxr-xr-x 2 jenkins jenkins 4096 Oct 29 12:26 jenkins
-rw-r--r-- 1 jenkins jenkins 167516 Jun 5 13:57 KEYS
drwxr-xr-x 2 jenkins jenkins 4096 Dec 20 2021 legal
drwxr-xr-x 2 jenkins jenkins 4096 Dec 20 2021 lib.stored
drwxr-xr-x 3 jenkins jenkins 4096 Sep 14 00:26 osgi
-rw-r--r-- 1 jenkins jenkins 4813 Dec 20 2021 patch.xml
drwxr-xr-x 5 jenkins jenkins 4096 Nov 18 12:30 poi
drwxr-xr-x 4 jenkins jenkins 4096 Nov 18 12:28 poi-examples
drwxr-xr-x 4 jenkins jenkins 4096 Nov 26 00:26 poi-excelant
drwxr-xr-x 4 jenkins jenkins 4096 Nov 26 00:26 poi-integration
drwxr-xr-x 4 jenkins jenkins 4096 Nov 26 00:26 poi-ooxml
drwxr-xr-x 4 jenkins jenkins 4096 Nov 18 12:28 poi-ooxml-full
drwxr-xr-x 4 jenkins jenkins 4096 Nov 18 12:29 poi-ooxml-lite
drwxr-xr-x 4 jenkins jenkins 4096 Nov 26 00:26 poi-ooxml-lite-agent
drwxr-xr-x 5 jenkins jenkins 4096 Nov 18 12:28 poi-scratchpad
-rw-r--r-- 1 jenkins jenkins 4351 Dec 21 2021 README.rst
-rw-r--r-- 1 jenkins jenkins 232 Dec 20 2021 SECURITY.md
-rw-r--r-- 1 jenkins jenkins 190 Dec 20 2021 settings.gradle
drwxr-xr-x 4 jenkins jenkins 4096 Dec 20 2021 src
drwxr-xr-x 4 jenkins jenkins 4096 Nov 26 00:26 .svn
drwxr-xr-x 15 jenkins jenkins 4096 Dec 20 2021 test-data
+ echo which ant
which ant
+ which ant
/usr/bin/ant
+ ant -version
Apache Ant(TM) version 1.10.5 compiled on March 28 2019
+ echo <project default="test"><target name="test"><echo>Java ${ant.java.version}/${java.version}</echo><exec executable="javac"><arg value="-version"/></exec></target></project>
+ ant -f build.javacheck.xml -v
Apache Ant(TM) version 1.10.5 compiled on March 28 2019
Buildfile: <https://ci-builds.apache.org/job/POI/job/POI-DSL-1.8/ws/build.javacheck.xml>
Detected Java version: 1.8 in: /usr/local/asfpackages/java/oraclejdk-1.8.0-291/jre
Detected OS: Linux
parsing buildfile <https://ci-builds.apache.org/job/POI/job/POI-DSL-1.8/ws/build.javacheck.xml> with URI = <https://ci-builds.apache.org/job/POI/job/POI-DSL-1.8/ws/build.javacheck.xml>
Project base dir set to: <https://ci-builds.apache.org/job/POI/job/POI-DSL-1.8/ws/>
Build sequence for target(s) `test' is [test]
Complete build sequence is [test, ]
test:
parsing buildfile jar:file:/usr/share/ant/lib/ant.jar!/org/apache/tools/ant/antlib.xml with URI = jar:file:/usr/share/ant/lib/ant.jar!/org/apache/tools/ant/antlib.xml from a zip file
[echo] Java 1.8/1.8.0_291
[exec] Current OS is Linux
[exec] Executing 'javac' with arguments:
[exec] '-version'
[exec]
[exec] The ' characters around the executable and arguments are
[exec] not part of the command.
[exec] javac 1.8.0_291
BUILD SUCCESSFUL
Total time: 0 seconds
+ exit 0
ERROR: Not all environment variables could be successfully injected. Check for similarly-named environment variables.
[POI-DSL-1.8] $ /bin/sh -xe /tmp/jenkins5667672446027061953.sh
+ touch --no-create build/*/build/test-results/TEST-*.xml build/*/build/test-results/test/TEST-*.xml
[Gradle] - Launching build.
ERROR: Not all environment variables could be successfully injected. Check for similarly-named environment variables.
[POI-DSL-1.8] $ <https://ci-builds.apache.org/job/POI/job/POI-DSL-1.8/ws/gradlew> -PjdkVersion=8 -PjdkVendor=oracle --refresh-dependencies clean jenkins
Downloading https://services.gradle.org/distributions/gradle-7.6-rc-3-bin.zip
...........10%............20%...........30%............40%............50%...........60%............70%............80%...........90%............100%
Welcome to Gradle 7.6-rc-3!
Here are the highlights of this release:
- Added support for Java 19.
- Introduced `--rerun` flag for individual task rerun.
- Improved dependency block for test suites to be strongly typed.
- Added a service provider interface for Java toolchains provisioning.
For more details see https://docs.gradle.org/7.6-rc-3/release-notes.html
To honour the JVM settings for this build a single-use Daemon process will be forked. See https://docs.gradle.org/7.6-rc-3/userguide/gradle_daemon.html#sec:disabling_the_daemon.
Daemon will be stopped at the end of the build
Configuration on demand is an incubating feature.
FAILURE: Build failed with an exception.
* What went wrong:
A problem occurred configuring root project 'poi'.
> Could not resolve all files for configuration ':classpath'.
> Could not resolve com.github.jk1:gradle-license-report:2.0.
Required by:
project : > com.github.jk1.dependency-license-report:com.github.jk1.dependency-license-report.gradle.plugin:2.0
> Could not resolve com.github.jk1:gradle-license-report:2.0.
> Could not get resource 'https://plugins.gradle.org/m2/com/github/jk1/gradle-license-report/2.0/gradle-license-report-2.0.module'.
> Could not GET 'https://jcenter.bintray.com/com/github/jk1/gradle-license-report/2.0/gradle-license-report-2.0.module'.
> sun.security.validator.ValidatorException: PKIX path validation failed: java.security.cert.CertPathValidatorException: validity check failed
> Could not resolve com.github.jk1:gradle-license-report:2.0.
> Could not get resource 'https://plugins.gradle.org/m2/com/github/jk1/gradle-license-report/2.0/gradle-license-report-2.0.module'.
> Could not GET 'https://jcenter.bintray.com/com/github/jk1/gradle-license-report/2.0/gradle-license-report-2.0.module'.
> sun.security.validator.ValidatorException: PKIX path validation failed: java.security.cert.CertPathValidatorException: validity check failed
* Try:
> Run with --stacktrace option to get the stack trace.
> Run with --info or --debug option to get more log output.
> Run with --scan to get full insights.
* Get more help at https://help.gradle.org
BUILD FAILED in 39s
Build step 'Invoke Gradle script' changed build result to FAILURE
Build step 'Invoke Gradle script' marked build as failure
[SpotBugs] Skipping execution of recorder since overall result is 'FAILURE'
ERROR: Not all environment variables could be successfully injected. Check for similarly-named environment variables.
Archiving artifacts
[Fast Archiver] Compressed 421.26 MB of artifacts by 25.7% relative to #795
ERROR: Not all environment variables could be successfully injected. Check for similarly-named environment variables.
Recording test results
ERROR: Not all environment variables could be successfully injected. Check for similarly-named environment variables.
ERROR: Step ?Publish JUnit test result report? failed: Test reports were found but none of them are new. Did leafNodes run?
For example, <https://ci-builds.apache.org/job/POI/job/POI-DSL-1.8/ws/poi-examples/build/test-results/test/TEST-org.apache.poi.integration.TestXLSX2CSV.xml> is 7 days 11 hr old
ERROR: Not all environment variables could be successfully injected. Check for similarly-named environment variables.
ERROR: Not all environment variables could be successfully injected. Check for similarly-named environment variables.
ERROR: Not all environment variables could be successfully injected. Check for similarly-named environment variables.
---------------------------------------------------------------------
To unsubscribe, e-mail: dev-unsubscribe@poi.apache.org
For additional commands, e-mail: dev-help@poi.apache.org
Jenkins build is back to normal : POI » POI-DSL-1.8 #797
Posted by Apache Jenkins Server <je...@builds.apache.org>.
See <https://ci-builds.apache.org/job/POI/job/POI-DSL-1.8/797/display/redirect?page=changes>
---------------------------------------------------------------------
To unsubscribe, e-mail: dev-unsubscribe@poi.apache.org
For additional commands, e-mail: dev-help@poi.apache.org