You are viewing a plain text version of this content. The canonical link for it is here.
Posted to builds@lucene.apache.org by Policeman Jenkins Server via builds <bu...@lucene.apache.org> on 2026/10/30 06:12:25 UTC

[JENKINS-EA] Lucene-MMAPv2-Linux (64bit/hotspot/jdk-28-ea+21) - Build # 6327 - Unstable!

Build: https://jenkins.thetaphi.de/job/Lucene-MMAPv2-Linux/6327/
Java: 64bit/hotspot/jdk-28-ea+21 -XX:+UseCompressedOops -XX:+UseSerialGC

1 tests failed.
FAILED:  org.apache.lucene.search.TestSortOptimization.testDocSortOptimization

Error Message:
java.lang.AssertionError: Expected some non-competitive hits are skipped; got collected_hits=11 num_docs=10

Stack Trace:
java.lang.AssertionError: Expected some non-competitive hits are skipped; got collected_hits=11 num_docs=10
	at __randomizedtesting.SeedInfo.seed([AE8853CE05975670:4E8DD3944BAB6F8D]:0)
	at org.junit.Assert.fail(Assert.java:89)
	at org.apache.lucene.search.TestSortOptimization.assertNonCompetitiveHitsAreSkipped(TestSortOptimization.java:1069)
	at org.apache.lucene.search.TestSortOptimization.testDocSortOptimization(TestSortOptimization.java:706)

[JENKINS] Lucene-MMAPv2-Linux (64bit/hotspot/jdk-25.0.3) - Build # 6328 - Still Unstable!

Posted by Policeman Jenkins Server via builds <bu...@lucene.apache.org>.
Build: https://jenkins.thetaphi.de/job/Lucene-MMAPv2-Linux/6328/
Java: 64bit/hotspot/jdk-25.0.3 -XX:+UseCompressedOops -XX:+UseParallelGC

1 tests failed.
FAILED:  org.apache.lucene.search.TestSortOptimization.testDocSortOptimization

Error Message:
java.lang.AssertionError: Expected some non-competitive hits are skipped; got collected_hits=10 num_docs=10

Stack Trace:
java.lang.AssertionError: Expected some non-competitive hits are skipped; got collected_hits=10 num_docs=10
	at __randomizedtesting.SeedInfo.seed([DC64935B587E5287:3C61130116426B7A]:0)
	at org.junit.Assert.fail(Assert.java:89)
	at org.apache.lucene.search.TestSortOptimization.assertNonCompetitiveHitsAreSkipped(TestSortOptimization.java:1069)
	at org.apache.lucene.search.TestSortOptimization.testDocSortOptimization(TestSortOptimization.java:706)