You are viewing a plain text version of this content. The canonical link for it is here.
Posted to commits@beam.apache.org by Apache Jenkins Server <je...@builds.apache.org> on 2018/02/05 12:47:59 UTC
Build failed in Jenkins: beam_PerformanceTests_JDBC #232
See <https://builds.apache.org/job/beam_PerformanceTests_JDBC/232/display/redirect>
------------------------------------------
GitHub pull request #4585 of commit 1e38bea87d0bd8d6c629f58410765cf3c2809216, no merge conflicts.
Setting status of 1e38bea87d0bd8d6c629f58410765cf3c2809216 to PENDING with url https://builds.apache.org/job/beam_PerformanceTests_JDBC/232/ and message: 'Build started sha1 is merged.'
Using context: Jenkins: Java JdbcIO Performance Test
[EnvInject] - Loading node environment variables.
Building remotely on beam2 (beam) in workspace <https://builds.apache.org/job/beam_PerformanceTests_JDBC/ws/>
> git rev-parse --is-inside-work-tree # timeout=10
Fetching changes from the remote Git repository
> git config remote.origin.url https://github.com/apache/beam.git # timeout=10
Fetching upstream changes from https://github.com/apache/beam.git
> git --version # timeout=10
> git fetch --tags --progress https://github.com/apache/beam.git +refs/heads/*:refs/remotes/origin/* +refs/pull/4585/*:refs/remotes/origin/pr/4585/*
> git rev-parse refs/remotes/origin/pr/4585/merge^{commit} # timeout=10
> git rev-parse refs/remotes/origin/origin/pr/4585/merge^{commit} # timeout=10
Checking out Revision b53be98449c43cf04b78dcc7881a3a98ef39c6c8 (refs/remotes/origin/pr/4585/merge)
> git config core.sparsecheckout # timeout=10
> git checkout -f b53be98449c43cf04b78dcc7881a3a98ef39c6c8
Commit message: "Merge 1e38bea87d0bd8d6c629f58410765cf3c2809216 into 93818abf901dd996aa30445457153811b13ece43"
First time build. Skipping changelog.
Cleaning workspace
> git rev-parse --verify HEAD # timeout=10
Resetting working tree
> git reset --hard # timeout=10
> git clean -fdx # timeout=10
[EnvInject] - Executing scripts and injecting environment variables after the SCM step.
[EnvInject] - Injecting as environment variables the properties content
SPARK_LOCAL_IP=127.0.0.1
[EnvInject] - Variables injected successfully.
[beam_PerformanceTests_JDBC] $ /bin/bash -xe /tmp/jenkins6662170660726059490.sh
+ gcloud container clusters list
NAME ZONE MASTER_VERSION MASTER_IP MACHINE_TYPE NODE_VERSION NUM_NODES STATUS
io-datastores us-central1-a 1.7.11-gke.1 104.154.102.21 n1-standard-1 1.7.11-gke.1 1 RUNNING
[beam_PerformanceTests_JDBC] $ /bin/bash -xe /tmp/jenkins8319512339861463527.sh
+ gcloud container clusters get-credentials io-datastores --verbosity=debug
DEBUG: Running gcloud.container.clusters.get-credentials with Namespace(__calliope_internal_deepest_parser=ArgumentParser(prog='gcloud.container.clusters.get-credentials', usage=None, description='See https://cloud.google.com/container-engine/docs/kubectl for\nkubectl documentation.', version=None, formatter_class=<class 'argparse.HelpFormatter'>, conflict_handler='error', add_help=False), account=None, api_version=None, authority_selector=None, authorization_token_file=None, cmd_func=<bound method Command.Run of <googlecloudsdk.calliope.backend.Command object at 0x7f9f8e302750>>, command_path=['gcloud', 'container', 'clusters', 'get-credentials'], configuration=None, credential_file_override=None, document=None, format=None, h=None, help=None, http_timeout=None, log_http=None, name='io-datastores', project=None, quiet=None, trace_email=None, trace_log=None, trace_token=None, user_output_enabled=None, verbosity='debug', version=None, zone=None).
WARNING: Accessing a Container Engine cluster requires the kubernetes commandline
client [kubectl]. To install, run
$ gcloud components install kubectl
DEBUG: (gcloud.container.clusters.get-credentials) The required property [zone] is not currently set.
It can be set on a per-command basis by re-running your command with the [--zone] flag.
You may set it for your current workspace by running:
$ gcloud config set compute/zone VALUE
or it can be set temporarily by the environment variable [CLOUDSDK_COMPUTE_ZONE]
Traceback (most recent call last):
File "/usr/lib/google-cloud-sdk/lib/googlecloudsdk/calliope/cli.py", line 632, in Execute
result = args.cmd_func(cli=self, args=args)
File "/usr/lib/google-cloud-sdk/lib/googlecloudsdk/calliope/backend.py", line 1369, in Run
resources = command_instance.Run(args)
File "/usr/lib/google-cloud-sdk/lib/surface/container/clusters/get_credentials.py", line 56, in Run
cluster_ref = adapter.ParseCluster(args.name)
File "/usr/lib/google-cloud-sdk/lib/googlecloudsdk/api_lib/container/api_adapter.py", line 143, in ParseCluster
properties.VALUES.compute.zone.Get(required=True)
File "/usr/lib/google-cloud-sdk/lib/googlecloudsdk/core/properties.py", line 1069, in Get
required)
File "/usr/lib/google-cloud-sdk/lib/googlecloudsdk/core/properties.py", line 1352, in _GetProperty
prop, flag=flag_to_use)
RequiredPropertyError: The required property [zone] is not currently set.
It can be set on a per-command basis by re-running your command with the [--zone] flag.
You may set it for your current workspace by running:
$ gcloud config set compute/zone VALUE
or it can be set temporarily by the environment variable [CLOUDSDK_COMPUTE_ZONE]
ERROR: (gcloud.container.clusters.get-credentials) The required property [zone] is not currently set.
It can be set on a per-command basis by re-running your command with the [--zone] flag.
You may set it for your current workspace by running:
$ gcloud config set compute/zone VALUE
or it can be set temporarily by the environment variable [CLOUDSDK_COMPUTE_ZONE]
Build step 'Execute shell' marked build as failure
Jenkins build is back to normal : beam_PerformanceTests_JDBC #243
Posted by Apache Jenkins Server <je...@builds.apache.org>.
See <https://builds.apache.org/job/beam_PerformanceTests_JDBC/243/display/redirect>
Build failed in Jenkins: beam_PerformanceTests_JDBC #242
Posted by Apache Jenkins Server <je...@builds.apache.org>.
See <https://builds.apache.org/job/beam_PerformanceTests_JDBC/242/display/redirect>
------------------------------------------
[...truncated 633.57 KB...]
[INFO] --- maven-compiler-plugin:3.7.0:testCompile (default-testCompile) @ beam-sdks-java-io-jdbc ---
[INFO] Changes detected - recompiling the module!
[INFO] Compiling 3 source files to <https://builds.apache.org/job/beam_PerformanceTests_JDBC/ws/runs/1a02f80f/beam/sdks/java/io/jdbc/target/test-classes>
[INFO]
[INFO] --- maven-checkstyle-plugin:3.0.0:check (default) @ beam-sdks-java-io-jdbc ---
[INFO] Starting audit...
Audit done.
[INFO]
[INFO] --- maven-surefire-plugin:2.20.1:test (default-test) @ beam-sdks-java-io-jdbc ---
[INFO] Tests are skipped.
[INFO]
[INFO] --- build-helper-maven-plugin:3.0.0:regex-properties (render-artifact-id) @ beam-sdks-java-io-jdbc ---
[INFO]
[INFO] --- maven-jar-plugin:3.0.2:jar (default-jar) @ beam-sdks-java-io-jdbc ---
[INFO] Building jar: <https://builds.apache.org/job/beam_PerformanceTests_JDBC/ws/runs/1a02f80f/beam/sdks/java/io/jdbc/target/beam-sdks-java-io-jdbc-2.4.0-SNAPSHOT.jar>
[INFO]
[INFO] --- maven-site-plugin:3.7:attach-descriptor (attach-descriptor) @ beam-sdks-java-io-jdbc ---
[INFO] Skipping because packaging 'jar' is not pom.
[INFO]
[INFO] --- maven-jar-plugin:3.0.2:test-jar (default-test-jar) @ beam-sdks-java-io-jdbc ---
[INFO] Building jar: <https://builds.apache.org/job/beam_PerformanceTests_JDBC/ws/runs/1a02f80f/beam/sdks/java/io/jdbc/target/beam-sdks-java-io-jdbc-2.4.0-SNAPSHOT-tests.jar>
[INFO]
[INFO] --- maven-shade-plugin:3.1.0:shade (bundle-and-repackage) @ beam-sdks-java-io-jdbc ---
[INFO] Excluding org.apache.beam:beam-sdks-java-core:jar:2.4.0-SNAPSHOT from the shaded jar.
[INFO] Excluding com.github.stephenc.findbugs:findbugs-annotations:jar:1.3.9-1 from the shaded jar.
[INFO] Excluding com.fasterxml.jackson.core:jackson-core:jar:2.8.9 from the shaded jar.
[INFO] Excluding com.fasterxml.jackson.core:jackson-annotations:jar:2.8.9 from the shaded jar.
[INFO] Excluding com.fasterxml.jackson.core:jackson-databind:jar:2.8.9 from the shaded jar.
[INFO] Excluding org.apache.avro:avro:jar:1.8.2 from the shaded jar.
[INFO] Excluding org.codehaus.jackson:jackson-core-asl:jar:1.9.13 from the shaded jar.
[INFO] Excluding org.codehaus.jackson:jackson-mapper-asl:jar:1.9.13 from the shaded jar.
[INFO] Excluding com.thoughtworks.paranamer:paranamer:jar:2.7 from the shaded jar.
[INFO] Excluding org.apache.commons:commons-compress:jar:1.14 from the shaded jar.
[INFO] Excluding org.tukaani:xz:jar:1.5 from the shaded jar.
[INFO] Excluding org.xerial.snappy:snappy-java:jar:1.1.4 from the shaded jar.
[INFO] Including com.google.guava:guava:jar:20.0 in the shaded jar.
[INFO] Excluding org.slf4j:slf4j-api:jar:1.7.25 from the shaded jar.
[INFO] Excluding com.google.code.findbugs:jsr305:jar:3.0.1 from the shaded jar.
[INFO] Excluding org.apache.commons:commons-dbcp2:jar:2.1.1 from the shaded jar.
[INFO] Excluding org.apache.commons:commons-pool2:jar:2.4.2 from the shaded jar.
[INFO] Excluding commons-logging:commons-logging:jar:1.2 from the shaded jar.
[INFO] Excluding joda-time:joda-time:jar:2.4 from the shaded jar.
[INFO] Excluding org.apache.beam:beam-runners-google-cloud-dataflow-java:jar:2.4.0-SNAPSHOT from the shaded jar.
[INFO] Excluding org.apache.beam:beam-sdks-java-extensions-google-cloud-platform-core:jar:2.4.0-SNAPSHOT from the shaded jar.
[INFO] Excluding com.google.cloud.bigdataoss:gcsio:jar:1.4.5 from the shaded jar.
[INFO] Excluding com.google.apis:google-api-services-cloudresourcemanager:jar:v1-rev6-1.22.0 from the shaded jar.
[INFO] Excluding org.apache.beam:beam-sdks-java-io-google-cloud-platform:jar:2.4.0-SNAPSHOT from the shaded jar.
[INFO] Excluding com.google.api-client:google-api-client:jar:1.22.0 from the shaded jar.
[INFO] Excluding com.google.oauth-client:google-oauth-client:jar:1.22.0 from the shaded jar.
[INFO] Excluding com.google.http-client:google-http-client:jar:1.22.0 from the shaded jar.
[INFO] Excluding org.apache.httpcomponents:httpclient:jar:4.0.1 from the shaded jar.
[INFO] Excluding org.apache.httpcomponents:httpcore:jar:4.0.1 from the shaded jar.
[INFO] Excluding commons-codec:commons-codec:jar:1.3 from the shaded jar.
[INFO] Excluding com.google.http-client:google-http-client-jackson2:jar:1.22.0 from the shaded jar.
[INFO] Excluding com.google.apis:google-api-services-dataflow:jar:v1b3-rev221-1.22.0 from the shaded jar.
[INFO] Excluding com.google.apis:google-api-services-clouddebugger:jar:v2-rev8-1.22.0 from the shaded jar.
[INFO] Excluding com.google.apis:google-api-services-storage:jar:v1-rev71-1.22.0 from the shaded jar.
[INFO] Excluding com.google.auth:google-auth-library-credentials:jar:0.7.1 from the shaded jar.
[INFO] Excluding com.google.auth:google-auth-library-oauth2-http:jar:0.7.1 from the shaded jar.
[INFO] Excluding com.google.cloud.bigdataoss:util:jar:1.4.5 from the shaded jar.
[INFO] Excluding com.google.api-client:google-api-client-java6:jar:1.22.0 from the shaded jar.
[INFO] Excluding com.google.api-client:google-api-client-jackson2:jar:1.22.0 from the shaded jar.
[INFO] Excluding com.google.oauth-client:google-oauth-client-java6:jar:1.22.0 from the shaded jar.
[INFO] Replacing original artifact with shaded artifact.
[INFO] Replacing <https://builds.apache.org/job/beam_PerformanceTests_JDBC/ws/runs/1a02f80f/beam/sdks/java/io/jdbc/target/beam-sdks-java-io-jdbc-2.4.0-SNAPSHOT.jar> with <https://builds.apache.org/job/beam_PerformanceTests_JDBC/ws/runs/1a02f80f/beam/sdks/java/io/jdbc/target/beam-sdks-java-io-jdbc-2.4.0-SNAPSHOT-shaded.jar>
[INFO] Replacing original test artifact with shaded test artifact.
[INFO] Replacing <https://builds.apache.org/job/beam_PerformanceTests_JDBC/ws/runs/1a02f80f/beam/sdks/java/io/jdbc/target/beam-sdks-java-io-jdbc-2.4.0-SNAPSHOT-tests.jar> with <https://builds.apache.org/job/beam_PerformanceTests_JDBC/ws/runs/1a02f80f/beam/sdks/java/io/jdbc/target/beam-sdks-java-io-jdbc-2.4.0-SNAPSHOT-shaded-tests.jar>
[INFO] Dependency-reduced POM written at: <https://builds.apache.org/job/beam_PerformanceTests_JDBC/ws/runs/1a02f80f/beam/sdks/java/io/jdbc/dependency-reduced-pom.xml>
[INFO]
[INFO] --- maven-failsafe-plugin:2.20.1:integration-test (default) @ beam-sdks-java-io-jdbc ---
[INFO] Failsafe report directory: <https://builds.apache.org/job/beam_PerformanceTests_JDBC/ws/runs/1a02f80f/beam/sdks/java/io/jdbc/target/failsafe-reports>
[INFO] parallel='all', perCoreThreadCount=true, threadCount=4, useUnlimitedThreads=false, threadCountSuites=0, threadCountClasses=0, threadCountMethods=0, parallelOptimized=true
[INFO]
[INFO] -------------------------------------------------------
[INFO] T E S T S
[INFO] -------------------------------------------------------
[INFO] Running org.apache.beam.sdk.io.jdbc.JdbcIOIT
[ERROR] Tests run: 1, Failures: 0, Errors: 1, Skipped: 0, Time elapsed: 0.146 s <<< FAILURE! - in org.apache.beam.sdk.io.jdbc.JdbcIOIT
[ERROR] testWriteThenRead(org.apache.beam.sdk.io.jdbc.JdbcIOIT) Time elapsed: 0.146 s <<< ERROR!
java.lang.NoClassDefFoundError: com/google/api/services/bigquery/model/TableRow
at org.apache.beam.sdk.io.gcp.bigquery.BigQueryCoderProviderRegistrar.getCoderProviders(BigQueryCoderProviderRegistrar.java:36)
at org.apache.beam.sdk.coders.CoderRegistry.<clinit>(CoderRegistry.java:173)
at org.apache.beam.sdk.Pipeline.getCoderRegistry(Pipeline.java:327)
at org.apache.beam.sdk.values.PCollection.finishSpecifyingOutput(PCollection.java:89)
at org.apache.beam.sdk.runners.TransformHierarchy.setOutput(TransformHierarchy.java:208)
at org.apache.beam.sdk.Pipeline.applyInternal(Pipeline.java:538)
at org.apache.beam.sdk.Pipeline.applyTransform(Pipeline.java:472)
at org.apache.beam.sdk.values.PBegin.apply(PBegin.java:44)
at org.apache.beam.sdk.io.GenerateSequence.expand(GenerateSequence.java:145)
at org.apache.beam.sdk.io.GenerateSequence.expand(GenerateSequence.java:65)
at org.apache.beam.sdk.Pipeline.applyInternal(Pipeline.java:537)
at org.apache.beam.sdk.Pipeline.applyTransform(Pipeline.java:472)
at org.apache.beam.sdk.values.PBegin.apply(PBegin.java:44)
at org.apache.beam.sdk.Pipeline.apply(Pipeline.java:173)
at org.apache.beam.sdk.io.jdbc.JdbcIOIT.runWrite(JdbcIOIT.java:110)
at org.apache.beam.sdk.io.jdbc.JdbcIOIT.testWriteThenRead(JdbcIOIT.java:97)
at sun.reflect.NativeMethodAccessorImpl.invoke0(Native Method)
at sun.reflect.NativeMethodAccessorImpl.invoke(NativeMethodAccessorImpl.java:62)
at sun.reflect.DelegatingMethodAccessorImpl.invoke(DelegatingMethodAccessorImpl.java:43)
at java.lang.reflect.Method.invoke(Method.java:498)
at org.junit.runners.model.FrameworkMethod$1.runReflectiveCall(FrameworkMethod.java:50)
at org.junit.internal.runners.model.ReflectiveCallable.run(ReflectiveCallable.java:12)
at org.junit.runners.model.FrameworkMethod.invokeExplosively(FrameworkMethod.java:47)
at org.junit.internal.runners.statements.InvokeMethod.evaluate(InvokeMethod.java:17)
at org.apache.beam.sdk.testing.TestPipeline$1.evaluate(TestPipeline.java:324)
at org.apache.beam.sdk.testing.TestPipeline$1.evaluate(TestPipeline.java:324)
at org.junit.rules.RunRules.evaluate(RunRules.java:20)
at org.junit.runners.ParentRunner.runLeaf(ParentRunner.java:325)
at org.junit.runners.BlockJUnit4ClassRunner.runChild(BlockJUnit4ClassRunner.java:78)
at org.junit.runners.BlockJUnit4ClassRunner.runChild(BlockJUnit4ClassRunner.java:57)
at org.junit.runners.ParentRunner$3.run(ParentRunner.java:290)
at org.apache.maven.surefire.junitcore.pc.Scheduler$1.run(Scheduler.java:410)
at java.util.concurrent.Executors$RunnableAdapter.call(Executors.java:511)
at java.util.concurrent.FutureTask.run(FutureTask.java:266)
at java.util.concurrent.ThreadPoolExecutor.runWorker(ThreadPoolExecutor.java:1149)
at java.util.concurrent.ThreadPoolExecutor$Worker.run(ThreadPoolExecutor.java:624)
at java.lang.Thread.run(Thread.java:748)
Caused by: java.lang.ClassNotFoundException: com.google.api.services.bigquery.model.TableRow
at java.net.URLClassLoader.findClass(URLClassLoader.java:381)
at java.lang.ClassLoader.loadClass(ClassLoader.java:424)
at sun.misc.Launcher$AppClassLoader.loadClass(Launcher.java:338)
at java.lang.ClassLoader.loadClass(ClassLoader.java:357)
... 37 more
[INFO]
[INFO] Results:
[INFO]
[ERROR] Errors:
[ERROR] JdbcIOIT.testWriteThenRead:97->runWrite:110 NoClassDefFound com/google/api/s...
[INFO]
[ERROR] Tests run: 1, Failures: 0, Errors: 1, Skipped: 0
[INFO]
[INFO]
[INFO] --- maven-dependency-plugin:3.0.2:analyze-only (default) @ beam-sdks-java-io-jdbc ---
[INFO] No dependency problems found
[INFO]
[INFO] --- maven-failsafe-plugin:2.20.1:verify (default) @ beam-sdks-java-io-jdbc ---
[INFO] Failsafe report directory: <https://builds.apache.org/job/beam_PerformanceTests_JDBC/ws/runs/1a02f80f/beam/sdks/java/io/jdbc/target/failsafe-reports>
[INFO] ------------------------------------------------------------------------
[INFO] BUILD FAILURE
[INFO] ------------------------------------------------------------------------
[INFO] Total time: 55.564 s
[INFO] Finished at: 2018-02-20T18:03:15Z
[INFO] Final Memory: 90M/1396M
[INFO] ------------------------------------------------------------------------
[ERROR] Failed to execute goal org.apache.maven.plugins:maven-failsafe-plugin:2.20.1:verify (default) on project beam-sdks-java-io-jdbc: There are test failures.
[ERROR]
[ERROR] Please refer to <https://builds.apache.org/job/beam_PerformanceTests_JDBC/ws/runs/1a02f80f/beam/sdks/java/io/jdbc/target/failsafe-reports> for the individual test results.
[ERROR] Please refer to dump files (if any exist) [date]-jvmRun[N].dump, [date].dumpstream and [date]-jvmRun[N].dumpstream.
[ERROR] -> [Help 1]
org.apache.maven.lifecycle.LifecycleExecutionException: Failed to execute goal org.apache.maven.plugins:maven-failsafe-plugin:2.20.1:verify (default) on project beam-sdks-java-io-jdbc: There are test failures.
Please refer to <https://builds.apache.org/job/beam_PerformanceTests_JDBC/ws/runs/1a02f80f/beam/sdks/java/io/jdbc/target/failsafe-reports> for the individual test results.
Please refer to dump files (if any exist) [date]-jvmRun[N].dump, [date].dumpstream and [date]-jvmRun[N].dumpstream.
at org.apache.maven.lifecycle.internal.MojoExecutor.execute (MojoExecutor.java:213)
at org.apache.maven.lifecycle.internal.MojoExecutor.execute (MojoExecutor.java:154)
at org.apache.maven.lifecycle.internal.MojoExecutor.execute (MojoExecutor.java:146)
at org.apache.maven.lifecycle.internal.LifecycleModuleBuilder.buildProject (LifecycleModuleBuilder.java:117)
at org.apache.maven.lifecycle.internal.LifecycleModuleBuilder.buildProject (LifecycleModuleBuilder.java:81)
at org.apache.maven.lifecycle.internal.builder.singlethreaded.SingleThreadedBuilder.build (SingleThreadedBuilder.java:51)
at org.apache.maven.lifecycle.internal.LifecycleStarter.execute (LifecycleStarter.java:128)
at org.apache.maven.DefaultMaven.doExecute (DefaultMaven.java:309)
at org.apache.maven.DefaultMaven.doExecute (DefaultMaven.java:194)
at org.apache.maven.DefaultMaven.execute (DefaultMaven.java:107)
at org.apache.maven.cli.MavenCli.execute (MavenCli.java:955)
at org.apache.maven.cli.MavenCli.doMain (MavenCli.java:290)
at org.apache.maven.cli.MavenCli.main (MavenCli.java:194)
at sun.reflect.NativeMethodAccessorImpl.invoke0 (Native Method)
at sun.reflect.NativeMethodAccessorImpl.invoke (NativeMethodAccessorImpl.java:62)
at sun.reflect.DelegatingMethodAccessorImpl.invoke (DelegatingMethodAccessorImpl.java:43)
at java.lang.reflect.Method.invoke (Method.java:498)
at org.codehaus.plexus.classworlds.launcher.Launcher.launchEnhanced (Launcher.java:289)
at org.codehaus.plexus.classworlds.launcher.Launcher.launch (Launcher.java:229)
at org.codehaus.plexus.classworlds.launcher.Launcher.mainWithExitCode (Launcher.java:415)
at org.codehaus.plexus.classworlds.launcher.Launcher.main (Launcher.java:356)
Caused by: org.apache.maven.plugin.MojoFailureException: There are test failures.
Please refer to <https://builds.apache.org/job/beam_PerformanceTests_JDBC/ws/runs/1a02f80f/beam/sdks/java/io/jdbc/target/failsafe-reports> for the individual test results.
Please refer to dump files (if any exist) [date]-jvmRun[N].dump, [date].dumpstream and [date]-jvmRun[N].dumpstream.
at org.apache.maven.plugin.surefire.SurefireHelper.throwException (SurefireHelper.java:240)
at org.apache.maven.plugin.surefire.SurefireHelper.reportExecution (SurefireHelper.java:112)
at org.apache.maven.plugin.failsafe.VerifyMojo.execute (VerifyMojo.java:188)
at org.apache.maven.plugin.DefaultBuildPluginManager.executeMojo (DefaultBuildPluginManager.java:134)
at org.apache.maven.lifecycle.internal.MojoExecutor.execute (MojoExecutor.java:208)
at org.apache.maven.lifecycle.internal.MojoExecutor.execute (MojoExecutor.java:154)
at org.apache.maven.lifecycle.internal.MojoExecutor.execute (MojoExecutor.java:146)
at org.apache.maven.lifecycle.internal.LifecycleModuleBuilder.buildProject (LifecycleModuleBuilder.java:117)
at org.apache.maven.lifecycle.internal.LifecycleModuleBuilder.buildProject (LifecycleModuleBuilder.java:81)
at org.apache.maven.lifecycle.internal.builder.singlethreaded.SingleThreadedBuilder.build (SingleThreadedBuilder.java:51)
at org.apache.maven.lifecycle.internal.LifecycleStarter.execute (LifecycleStarter.java:128)
at org.apache.maven.DefaultMaven.doExecute (DefaultMaven.java:309)
at org.apache.maven.DefaultMaven.doExecute (DefaultMaven.java:194)
at org.apache.maven.DefaultMaven.execute (DefaultMaven.java:107)
at org.apache.maven.cli.MavenCli.execute (MavenCli.java:955)
at org.apache.maven.cli.MavenCli.doMain (MavenCli.java:290)
at org.apache.maven.cli.MavenCli.main (MavenCli.java:194)
at sun.reflect.NativeMethodAccessorImpl.invoke0 (Native Method)
at sun.reflect.NativeMethodAccessorImpl.invoke (NativeMethodAccessorImpl.java:62)
at sun.reflect.DelegatingMethodAccessorImpl.invoke (DelegatingMethodAccessorImpl.java:43)
at java.lang.reflect.Method.invoke (Method.java:498)
at org.codehaus.plexus.classworlds.launcher.Launcher.launchEnhanced (Launcher.java:289)
at org.codehaus.plexus.classworlds.launcher.Launcher.launch (Launcher.java:229)
at org.codehaus.plexus.classworlds.launcher.Launcher.mainWithExitCode (Launcher.java:415)
at org.codehaus.plexus.classworlds.launcher.Launcher.main (Launcher.java:356)
[ERROR]
[ERROR] Re-run Maven using the -X switch to enable full debug logging.
[ERROR]
[ERROR] For more information about the errors and possible solutions, please read the following articles:
[ERROR] [Help 1] http://cwiki.apache.org/confluence/display/MAVEN/MojoFailureException
STDERR:
2018-02-20 18:03:15,865 1a02f80f MainThread beam_integration_benchmark(1/1) ERROR Error during benchmark beam_integration_benchmark
Traceback (most recent call last):
File "<https://builds.apache.org/job/beam_PerformanceTests_JDBC/ws/PerfKitBenchmarker/perfkitbenchmarker/pkb.py",> line 622, in RunBenchmark
DoRunPhase(spec, collector, detailed_timer)
File "<https://builds.apache.org/job/beam_PerformanceTests_JDBC/ws/PerfKitBenchmarker/perfkitbenchmarker/pkb.py",> line 525, in DoRunPhase
samples = spec.BenchmarkRun(spec)
File "<https://builds.apache.org/job/beam_PerformanceTests_JDBC/ws/PerfKitBenchmarker/perfkitbenchmarker/linux_benchmarks/beam_integration_benchmark.py",> line 159, in Run
job_type=job_type)
File "<https://builds.apache.org/job/beam_PerformanceTests_JDBC/ws/PerfKitBenchmarker/perfkitbenchmarker/providers/gcp/gcp_dpb_dataflow.py",> line 90, in SubmitJob
assert retcode == 0, "Integration Test Failed."
AssertionError: Integration Test Failed.
2018-02-20 18:03:15,866 1a02f80f MainThread beam_integration_benchmark(1/1) INFO Cleaning up benchmark beam_integration_benchmark
2018-02-20 18:03:15,867 1a02f80f MainThread beam_integration_benchmark(1/1) INFO Running: kubectl --kubeconfig=/home/jenkins/.kube/config delete -f <https://builds.apache.org/job/beam_PerformanceTests_JDBC/ws/src/.test-infra/kubernetes/postgres/postgres.yml>
2018-02-20 18:03:16,233 1a02f80f MainThread beam_integration_benchmark(1/1) INFO Running: kubectl --kubeconfig=/home/jenkins/.kube/config delete -f <https://builds.apache.org/job/beam_PerformanceTests_JDBC/ws/src/.test-infra/kubernetes/postgres/postgres-service-for-local-dev.yml>
2018-02-20 18:03:16,457 1a02f80f MainThread beam_integration_benchmark(1/1) ERROR Exception running benchmark
Traceback (most recent call last):
File "<https://builds.apache.org/job/beam_PerformanceTests_JDBC/ws/PerfKitBenchmarker/perfkitbenchmarker/pkb.py",> line 732, in RunBenchmarkTask
RunBenchmark(spec, collector)
File "<https://builds.apache.org/job/beam_PerformanceTests_JDBC/ws/PerfKitBenchmarker/perfkitbenchmarker/pkb.py",> line 622, in RunBenchmark
DoRunPhase(spec, collector, detailed_timer)
File "<https://builds.apache.org/job/beam_PerformanceTests_JDBC/ws/PerfKitBenchmarker/perfkitbenchmarker/pkb.py",> line 525, in DoRunPhase
samples = spec.BenchmarkRun(spec)
File "<https://builds.apache.org/job/beam_PerformanceTests_JDBC/ws/PerfKitBenchmarker/perfkitbenchmarker/linux_benchmarks/beam_integration_benchmark.py",> line 159, in Run
job_type=job_type)
File "<https://builds.apache.org/job/beam_PerformanceTests_JDBC/ws/PerfKitBenchmarker/perfkitbenchmarker/providers/gcp/gcp_dpb_dataflow.py",> line 90, in SubmitJob
assert retcode == 0, "Integration Test Failed."
AssertionError: Integration Test Failed.
2018-02-20 18:03:16,457 1a02f80f MainThread beam_integration_benchmark(1/1) ERROR Benchmark 1/1 beam_integration_benchmark (UID: beam_integration_benchmark0) failed. Execution will continue.
2018-02-20 18:03:16,458 1a02f80f MainThread beam_integration_benchmark(1/1) INFO Benchmark run statuses:
---------------------------------------------------------------------------------
Name UID Status Failed Substatus
---------------------------------------------------------------------------------
beam_integration_benchmark beam_integration_benchmark0 FAILED
---------------------------------------------------------------------------------
Success rate: 0.00% (0/1)
2018-02-20 18:03:16,458 1a02f80f MainThread beam_integration_benchmark(1/1) INFO Complete logs can be found at: <https://builds.apache.org/job/beam_PerformanceTests_JDBC/ws/runs/1a02f80f/pkb.log>
2018-02-20 18:03:16,458 1a02f80f MainThread beam_integration_benchmark(1/1) INFO Completion statuses can be found at: <https://builds.apache.org/job/beam_PerformanceTests_JDBC/ws/runs/1a02f80f/completion_statuses.json>
Build step 'Execute shell' marked build as failure
Build failed in Jenkins: beam_PerformanceTests_JDBC #241
Posted by Apache Jenkins Server <je...@builds.apache.org>.
See <https://builds.apache.org/job/beam_PerformanceTests_JDBC/241/display/redirect?page=changes>
Changes:
[lukasz.gajowy] fixup! fixup! [BEAM-3456] Re-enable JDBC performance test
------------------------------------------
[...truncated 63.67 KB...]
2018-02-20 16:09:30,451 44b5776f MainThread INFO Ran: {bq load --source_format=NEWLINE_DELIMITED_JSON beam_performance.jdbcioit_pkb_results <https://builds.apache.org/job/beam_PerformanceTests_JDBC/ws/runs/44b5776f/perfkit-bq-pub93PqxI.json}> ReturnCode:1, WallTime:0:00.64s, CPU:0.22s, MaxMemory:24624kb
STDOUT: BigQuery error in load operation: No schema specified on job or table.
STDERR: /usr/lib/google-cloud-sdk/platform/bq/third_party/oauth2client/contrib/gce.py:73: UserWarning: You have requested explicit scopes to be used with a GCE service account.
Using this argument will have no effect on the actual scopes for tokens
requested. These scopes are set at VM instance creation time and
can't be overridden in the request.
warnings.warn(_SCOPES_WARNING)
2018-02-20 16:09:30,452 44b5776f MainThread INFO Retrying exception running IssueRetryableCommand: Command returned a non-zero exit code.
2018-02-20 16:09:58,116 44b5776f MainThread INFO Running: bq load --source_format=NEWLINE_DELIMITED_JSON beam_performance.jdbcioit_pkb_results <https://builds.apache.org/job/beam_PerformanceTests_JDBC/ws/runs/44b5776f/perfkit-bq-pub93PqxI.json>
2018-02-20 16:09:58,782 44b5776f MainThread INFO Ran: {bq load --source_format=NEWLINE_DELIMITED_JSON beam_performance.jdbcioit_pkb_results <https://builds.apache.org/job/beam_PerformanceTests_JDBC/ws/runs/44b5776f/perfkit-bq-pub93PqxI.json}> ReturnCode:1, WallTime:0:00.66s, CPU:0.22s, MaxMemory:24624kb
STDOUT: BigQuery error in load operation: No schema specified on job or table.
STDERR: /usr/lib/google-cloud-sdk/platform/bq/third_party/oauth2client/contrib/gce.py:73: UserWarning: You have requested explicit scopes to be used with a GCE service account.
Using this argument will have no effect on the actual scopes for tokens
requested. These scopes are set at VM instance creation time and
can't be overridden in the request.
warnings.warn(_SCOPES_WARNING)
2018-02-20 16:09:58,783 44b5776f MainThread INFO Retrying exception running IssueRetryableCommand: Command returned a non-zero exit code.
2018-02-20 16:10:22,021 44b5776f MainThread INFO Running: bq load --source_format=NEWLINE_DELIMITED_JSON beam_performance.jdbcioit_pkb_results <https://builds.apache.org/job/beam_PerformanceTests_JDBC/ws/runs/44b5776f/perfkit-bq-pub93PqxI.json>
2018-02-20 16:10:22,656 44b5776f MainThread INFO Ran: {bq load --source_format=NEWLINE_DELIMITED_JSON beam_performance.jdbcioit_pkb_results <https://builds.apache.org/job/beam_PerformanceTests_JDBC/ws/runs/44b5776f/perfkit-bq-pub93PqxI.json}> ReturnCode:1, WallTime:0:00.62s, CPU:0.22s, MaxMemory:24652kb
STDOUT: BigQuery error in load operation: No schema specified on job or table.
STDERR: /usr/lib/google-cloud-sdk/platform/bq/third_party/oauth2client/contrib/gce.py:73: UserWarning: You have requested explicit scopes to be used with a GCE service account.
Using this argument will have no effect on the actual scopes for tokens
requested. These scopes are set at VM instance creation time and
can't be overridden in the request.
warnings.warn(_SCOPES_WARNING)
2018-02-20 16:10:22,656 44b5776f MainThread INFO Retrying exception running IssueRetryableCommand: Command returned a non-zero exit code.
2018-02-20 16:10:40,761 44b5776f MainThread INFO Running: bq load --source_format=NEWLINE_DELIMITED_JSON beam_performance.jdbcioit_pkb_results <https://builds.apache.org/job/beam_PerformanceTests_JDBC/ws/runs/44b5776f/perfkit-bq-pub93PqxI.json>
2018-02-20 16:10:41,419 44b5776f MainThread INFO Ran: {bq load --source_format=NEWLINE_DELIMITED_JSON beam_performance.jdbcioit_pkb_results <https://builds.apache.org/job/beam_PerformanceTests_JDBC/ws/runs/44b5776f/perfkit-bq-pub93PqxI.json}> ReturnCode:1, WallTime:0:00.65s, CPU:0.24s, MaxMemory:24692kb
STDOUT: BigQuery error in load operation: No schema specified on job or table.
STDERR: /usr/lib/google-cloud-sdk/platform/bq/third_party/oauth2client/contrib/gce.py:73: UserWarning: You have requested explicit scopes to be used with a GCE service account.
Using this argument will have no effect on the actual scopes for tokens
requested. These scopes are set at VM instance creation time and
can't be overridden in the request.
warnings.warn(_SCOPES_WARNING)
2018-02-20 16:10:41,419 44b5776f MainThread INFO Retrying exception running IssueRetryableCommand: Command returned a non-zero exit code.
2018-02-20 16:10:56,698 44b5776f MainThread INFO Running: bq load --source_format=NEWLINE_DELIMITED_JSON beam_performance.jdbcioit_pkb_results <https://builds.apache.org/job/beam_PerformanceTests_JDBC/ws/runs/44b5776f/perfkit-bq-pub93PqxI.json>
2018-02-20 16:10:57,305 44b5776f MainThread INFO Ran: {bq load --source_format=NEWLINE_DELIMITED_JSON beam_performance.jdbcioit_pkb_results <https://builds.apache.org/job/beam_PerformanceTests_JDBC/ws/runs/44b5776f/perfkit-bq-pub93PqxI.json}> ReturnCode:1, WallTime:0:00.60s, CPU:0.24s, MaxMemory:24580kb
STDOUT: BigQuery error in load operation: No schema specified on job or table.
STDERR: /usr/lib/google-cloud-sdk/platform/bq/third_party/oauth2client/contrib/gce.py:73: UserWarning: You have requested explicit scopes to be used with a GCE service account.
Using this argument will have no effect on the actual scopes for tokens
requested. These scopes are set at VM instance creation time and
can't be overridden in the request.
warnings.warn(_SCOPES_WARNING)
2018-02-20 16:10:57,305 44b5776f MainThread INFO Retrying exception running IssueRetryableCommand: Command returned a non-zero exit code.
2018-02-20 16:11:23,415 44b5776f MainThread INFO Running: bq load --source_format=NEWLINE_DELIMITED_JSON beam_performance.jdbcioit_pkb_results <https://builds.apache.org/job/beam_PerformanceTests_JDBC/ws/runs/44b5776f/perfkit-bq-pub93PqxI.json>
2018-02-20 16:11:24,066 44b5776f MainThread INFO Ran: {bq load --source_format=NEWLINE_DELIMITED_JSON beam_performance.jdbcioit_pkb_results <https://builds.apache.org/job/beam_PerformanceTests_JDBC/ws/runs/44b5776f/perfkit-bq-pub93PqxI.json}> ReturnCode:1, WallTime:0:00.64s, CPU:0.24s, MaxMemory:24648kb
STDOUT: BigQuery error in load operation: No schema specified on job or table.
STDERR: /usr/lib/google-cloud-sdk/platform/bq/third_party/oauth2client/contrib/gce.py:73: UserWarning: You have requested explicit scopes to be used with a GCE service account.
Using this argument will have no effect on the actual scopes for tokens
requested. These scopes are set at VM instance creation time and
can't be overridden in the request.
warnings.warn(_SCOPES_WARNING)
2018-02-20 16:11:24,066 44b5776f MainThread INFO Retrying exception running IssueRetryableCommand: Command returned a non-zero exit code.
2018-02-20 16:11:42,286 44b5776f MainThread INFO Running: bq load --source_format=NEWLINE_DELIMITED_JSON beam_performance.jdbcioit_pkb_results <https://builds.apache.org/job/beam_PerformanceTests_JDBC/ws/runs/44b5776f/perfkit-bq-pub93PqxI.json>
2018-02-20 16:11:42,931 44b5776f MainThread INFO Ran: {bq load --source_format=NEWLINE_DELIMITED_JSON beam_performance.jdbcioit_pkb_results <https://builds.apache.org/job/beam_PerformanceTests_JDBC/ws/runs/44b5776f/perfkit-bq-pub93PqxI.json}> ReturnCode:1, WallTime:0:00.63s, CPU:0.23s, MaxMemory:24624kb
STDOUT: BigQuery error in load operation: No schema specified on job or table.
STDERR: /usr/lib/google-cloud-sdk/platform/bq/third_party/oauth2client/contrib/gce.py:73: UserWarning: You have requested explicit scopes to be used with a GCE service account.
Using this argument will have no effect on the actual scopes for tokens
requested. These scopes are set at VM instance creation time and
can't be overridden in the request.
warnings.warn(_SCOPES_WARNING)
2018-02-20 16:11:42,931 44b5776f MainThread INFO Retrying exception running IssueRetryableCommand: Command returned a non-zero exit code.
2018-02-20 16:12:11,846 44b5776f MainThread INFO Running: bq load --source_format=NEWLINE_DELIMITED_JSON beam_performance.jdbcioit_pkb_results <https://builds.apache.org/job/beam_PerformanceTests_JDBC/ws/runs/44b5776f/perfkit-bq-pub93PqxI.json>
2018-02-20 16:12:12,506 44b5776f MainThread INFO Ran: {bq load --source_format=NEWLINE_DELIMITED_JSON beam_performance.jdbcioit_pkb_results <https://builds.apache.org/job/beam_PerformanceTests_JDBC/ws/runs/44b5776f/perfkit-bq-pub93PqxI.json}> ReturnCode:1, WallTime:0:00.65s, CPU:0.21s, MaxMemory:24656kb
STDOUT: BigQuery error in load operation: No schema specified on job or table.
STDERR: /usr/lib/google-cloud-sdk/platform/bq/third_party/oauth2client/contrib/gce.py:73: UserWarning: You have requested explicit scopes to be used with a GCE service account.
Using this argument will have no effect on the actual scopes for tokens
requested. These scopes are set at VM instance creation time and
can't be overridden in the request.
warnings.warn(_SCOPES_WARNING)
2018-02-20 16:12:12,506 44b5776f MainThread INFO Retrying exception running IssueRetryableCommand: Command returned a non-zero exit code.
2018-02-20 16:12:30,930 44b5776f MainThread INFO Running: bq load --source_format=NEWLINE_DELIMITED_JSON beam_performance.jdbcioit_pkb_results <https://builds.apache.org/job/beam_PerformanceTests_JDBC/ws/runs/44b5776f/perfkit-bq-pub93PqxI.json>
2018-02-20 16:12:31,552 44b5776f MainThread INFO Ran: {bq load --source_format=NEWLINE_DELIMITED_JSON beam_performance.jdbcioit_pkb_results <https://builds.apache.org/job/beam_PerformanceTests_JDBC/ws/runs/44b5776f/perfkit-bq-pub93PqxI.json}> ReturnCode:1, WallTime:0:00.61s, CPU:0.22s, MaxMemory:24596kb
STDOUT: BigQuery error in load operation: No schema specified on job or table.
STDERR: /usr/lib/google-cloud-sdk/platform/bq/third_party/oauth2client/contrib/gce.py:73: UserWarning: You have requested explicit scopes to be used with a GCE service account.
Using this argument will have no effect on the actual scopes for tokens
requested. These scopes are set at VM instance creation time and
can't be overridden in the request.
warnings.warn(_SCOPES_WARNING)
2018-02-20 16:12:31,553 44b5776f MainThread INFO Retrying exception running IssueRetryableCommand: Command returned a non-zero exit code.
2018-02-20 16:12:55,999 44b5776f MainThread INFO Running: bq load --source_format=NEWLINE_DELIMITED_JSON beam_performance.jdbcioit_pkb_results <https://builds.apache.org/job/beam_PerformanceTests_JDBC/ws/runs/44b5776f/perfkit-bq-pub93PqxI.json>
2018-02-20 16:12:57,528 44b5776f MainThread INFO Ran: {bq load --source_format=NEWLINE_DELIMITED_JSON beam_performance.jdbcioit_pkb_results <https://builds.apache.org/job/beam_PerformanceTests_JDBC/ws/runs/44b5776f/perfkit-bq-pub93PqxI.json}> ReturnCode:1, WallTime:0:01.52s, CPU:0.25s, MaxMemory:24656kb
STDOUT: BigQuery error in load operation: No schema specified on job or table.
STDERR: /usr/lib/google-cloud-sdk/platform/bq/third_party/oauth2client/contrib/gce.py:73: UserWarning: You have requested explicit scopes to be used with a GCE service account.
Using this argument will have no effect on the actual scopes for tokens
requested. These scopes are set at VM instance creation time and
can't be overridden in the request.
warnings.warn(_SCOPES_WARNING)
2018-02-20 16:12:57,528 44b5776f MainThread INFO Retrying exception running IssueRetryableCommand: Command returned a non-zero exit code.
2018-02-20 16:13:17,646 44b5776f MainThread INFO Running: bq load --source_format=NEWLINE_DELIMITED_JSON beam_performance.jdbcioit_pkb_results <https://builds.apache.org/job/beam_PerformanceTests_JDBC/ws/runs/44b5776f/perfkit-bq-pub93PqxI.json>
2018-02-20 16:13:18,142 44b5776f MainThread INFO Ran: {bq load --source_format=NEWLINE_DELIMITED_JSON beam_performance.jdbcioit_pkb_results <https://builds.apache.org/job/beam_PerformanceTests_JDBC/ws/runs/44b5776f/perfkit-bq-pub93PqxI.json}> ReturnCode:1, WallTime:0:00.49s, CPU:0.24s, MaxMemory:24520kb
STDOUT: BigQuery error in load operation: No schema specified on job or table.
STDERR: /usr/lib/google-cloud-sdk/platform/bq/third_party/oauth2client/contrib/gce.py:73: UserWarning: You have requested explicit scopes to be used with a GCE service account.
Using this argument will have no effect on the actual scopes for tokens
requested. These scopes are set at VM instance creation time and
can't be overridden in the request.
warnings.warn(_SCOPES_WARNING)
2018-02-20 16:13:18,142 44b5776f MainThread INFO Retrying exception running IssueRetryableCommand: Command returned a non-zero exit code.
2018-02-20 16:13:41,928 44b5776f MainThread INFO Running: bq load --source_format=NEWLINE_DELIMITED_JSON beam_performance.jdbcioit_pkb_results <https://builds.apache.org/job/beam_PerformanceTests_JDBC/ws/runs/44b5776f/perfkit-bq-pub93PqxI.json>
2018-02-20 16:13:42,550 44b5776f MainThread INFO Ran: {bq load --source_format=NEWLINE_DELIMITED_JSON beam_performance.jdbcioit_pkb_results <https://builds.apache.org/job/beam_PerformanceTests_JDBC/ws/runs/44b5776f/perfkit-bq-pub93PqxI.json}> ReturnCode:1, WallTime:0:00.61s, CPU:0.25s, MaxMemory:24612kb
STDOUT: BigQuery error in load operation: No schema specified on job or table.
STDERR: /usr/lib/google-cloud-sdk/platform/bq/third_party/oauth2client/contrib/gce.py:73: UserWarning: You have requested explicit scopes to be used with a GCE service account.
Using this argument will have no effect on the actual scopes for tokens
requested. These scopes are set at VM instance creation time and
can't be overridden in the request.
warnings.warn(_SCOPES_WARNING)
2018-02-20 16:13:42,551 44b5776f MainThread INFO Retrying exception running IssueRetryableCommand: Command returned a non-zero exit code.
2018-02-20 16:14:12,384 44b5776f MainThread INFO Running: bq load --source_format=NEWLINE_DELIMITED_JSON beam_performance.jdbcioit_pkb_results <https://builds.apache.org/job/beam_PerformanceTests_JDBC/ws/runs/44b5776f/perfkit-bq-pub93PqxI.json>
2018-02-20 16:14:12,970 44b5776f MainThread INFO Ran: {bq load --source_format=NEWLINE_DELIMITED_JSON beam_performance.jdbcioit_pkb_results <https://builds.apache.org/job/beam_PerformanceTests_JDBC/ws/runs/44b5776f/perfkit-bq-pub93PqxI.json}> ReturnCode:1, WallTime:0:00.58s, CPU:0.23s, MaxMemory:24656kb
STDOUT: BigQuery error in load operation: No schema specified on job or table.
STDERR: /usr/lib/google-cloud-sdk/platform/bq/third_party/oauth2client/contrib/gce.py:73: UserWarning: You have requested explicit scopes to be used with a GCE service account.
Using this argument will have no effect on the actual scopes for tokens
requested. These scopes are set at VM instance creation time and
can't be overridden in the request.
warnings.warn(_SCOPES_WARNING)
2018-02-20 16:14:12,971 44b5776f MainThread INFO Retrying exception running IssueRetryableCommand: Command returned a non-zero exit code.
2018-02-20 16:14:40,281 44b5776f MainThread INFO Running: bq load --source_format=NEWLINE_DELIMITED_JSON beam_performance.jdbcioit_pkb_results <https://builds.apache.org/job/beam_PerformanceTests_JDBC/ws/runs/44b5776f/perfkit-bq-pub93PqxI.json>
2018-02-20 16:14:40,907 44b5776f MainThread INFO Ran: {bq load --source_format=NEWLINE_DELIMITED_JSON beam_performance.jdbcioit_pkb_results <https://builds.apache.org/job/beam_PerformanceTests_JDBC/ws/runs/44b5776f/perfkit-bq-pub93PqxI.json}> ReturnCode:1, WallTime:0:00.62s, CPU:0.22s, MaxMemory:24644kb
STDOUT: BigQuery error in load operation: No schema specified on job or table.
STDERR: /usr/lib/google-cloud-sdk/platform/bq/third_party/oauth2client/contrib/gce.py:73: UserWarning: You have requested explicit scopes to be used with a GCE service account.
Using this argument will have no effect on the actual scopes for tokens
requested. These scopes are set at VM instance creation time and
can't be overridden in the request.
warnings.warn(_SCOPES_WARNING)
2018-02-20 16:14:40,908 44b5776f MainThread INFO Retrying exception running IssueRetryableCommand: Command returned a non-zero exit code.
2018-02-20 16:15:03,651 44b5776f MainThread INFO Running: bq load --source_format=NEWLINE_DELIMITED_JSON beam_performance.jdbcioit_pkb_results <https://builds.apache.org/job/beam_PerformanceTests_JDBC/ws/runs/44b5776f/perfkit-bq-pub93PqxI.json>
2018-02-20 16:15:04,285 44b5776f MainThread INFO Ran: {bq load --source_format=NEWLINE_DELIMITED_JSON beam_performance.jdbcioit_pkb_results <https://builds.apache.org/job/beam_PerformanceTests_JDBC/ws/runs/44b5776f/perfkit-bq-pub93PqxI.json}> ReturnCode:1, WallTime:0:00.62s, CPU:0.22s, MaxMemory:24668kb
STDOUT: BigQuery error in load operation: No schema specified on job or table.
STDERR: /usr/lib/google-cloud-sdk/platform/bq/third_party/oauth2client/contrib/gce.py:73: UserWarning: You have requested explicit scopes to be used with a GCE service account.
Using this argument will have no effect on the actual scopes for tokens
requested. These scopes are set at VM instance creation time and
can't be overridden in the request.
warnings.warn(_SCOPES_WARNING)
2018-02-20 16:15:04,285 44b5776f MainThread INFO Retrying exception running IssueRetryableCommand: Command returned a non-zero exit code.
2018-02-20 16:15:29,542 44b5776f MainThread INFO Running: bq load --source_format=NEWLINE_DELIMITED_JSON beam_performance.jdbcioit_pkb_results <https://builds.apache.org/job/beam_PerformanceTests_JDBC/ws/runs/44b5776f/perfkit-bq-pub93PqxI.json>
2018-02-20 16:15:30,093 44b5776f MainThread INFO Ran: {bq load --source_format=NEWLINE_DELIMITED_JSON beam_performance.jdbcioit_pkb_results <https://builds.apache.org/job/beam_PerformanceTests_JDBC/ws/runs/44b5776f/perfkit-bq-pub93PqxI.json}> ReturnCode:1, WallTime:0:00.54s, CPU:0.24s, MaxMemory:24644kb
STDOUT: BigQuery error in load operation: No schema specified on job or table.
STDERR: /usr/lib/google-cloud-sdk/platform/bq/third_party/oauth2client/contrib/gce.py:73: UserWarning: You have requested explicit scopes to be used with a GCE service account.
Using this argument will have no effect on the actual scopes for tokens
requested. These scopes are set at VM instance creation time and
can't be overridden in the request.
warnings.warn(_SCOPES_WARNING)
2018-02-20 16:15:30,094 44b5776f MainThread INFO Retrying exception running IssueRetryableCommand: Command returned a non-zero exit code.
2018-02-20 16:15:52,830 44b5776f MainThread INFO Running: bq load --source_format=NEWLINE_DELIMITED_JSON beam_performance.jdbcioit_pkb_results <https://builds.apache.org/job/beam_PerformanceTests_JDBC/ws/runs/44b5776f/perfkit-bq-pub93PqxI.json>
2018-02-20 16:15:54,383 44b5776f MainThread INFO Ran: {bq load --source_format=NEWLINE_DELIMITED_JSON beam_performance.jdbcioit_pkb_results <https://builds.apache.org/job/beam_PerformanceTests_JDBC/ws/runs/44b5776f/perfkit-bq-pub93PqxI.json}> ReturnCode:1, WallTime:0:01.54s, CPU:0.23s, MaxMemory:24656kb
STDOUT: BigQuery error in load operation: No schema specified on job or table.
STDERR: /usr/lib/google-cloud-sdk/platform/bq/third_party/oauth2client/contrib/gce.py:73: UserWarning: You have requested explicit scopes to be used with a GCE service account.
Using this argument will have no effect on the actual scopes for tokens
requested. These scopes are set at VM instance creation time and
can't be overridden in the request.
warnings.warn(_SCOPES_WARNING)
2018-02-20 16:15:54,384 44b5776f MainThread INFO Retrying exception running IssueRetryableCommand: Command returned a non-zero exit code.
2018-02-20 16:16:19,669 44b5776f MainThread INFO Running: bq load --source_format=NEWLINE_DELIMITED_JSON beam_performance.jdbcioit_pkb_results <https://builds.apache.org/job/beam_PerformanceTests_JDBC/ws/runs/44b5776f/perfkit-bq-pub93PqxI.json>
2018-02-20 16:16:20,321 44b5776f MainThread INFO Ran: {bq load --source_format=NEWLINE_DELIMITED_JSON beam_performance.jdbcioit_pkb_results <https://builds.apache.org/job/beam_PerformanceTests_JDBC/ws/runs/44b5776f/perfkit-bq-pub93PqxI.json}> ReturnCode:1, WallTime:0:00.64s, CPU:0.23s, MaxMemory:24648kb
STDOUT: BigQuery error in load operation: No schema specified on job or table.
STDERR: /usr/lib/google-cloud-sdk/platform/bq/third_party/oauth2client/contrib/gce.py:73: UserWarning: You have requested explicit scopes to be used with a GCE service account.
Using this argument will have no effect on the actual scopes for tokens
requested. These scopes are set at VM instance creation time and
can't be overridden in the request.
warnings.warn(_SCOPES_WARNING)
Traceback (most recent call last):
File "PerfKitBenchmarker/pkb.py", line 21, in <module>
sys.exit(Main())
File "<https://builds.apache.org/job/beam_PerformanceTests_JDBC/ws/PerfKitBenchmarker/perfkitbenchmarker/pkb.py",> line 926, in Main
return RunBenchmarks()
File "<https://builds.apache.org/job/beam_PerformanceTests_JDBC/ws/PerfKitBenchmarker/perfkitbenchmarker/pkb.py",> line 853, in RunBenchmarks
collector.PublishSamples()
File "<https://builds.apache.org/job/beam_PerformanceTests_JDBC/ws/PerfKitBenchmarker/perfkitbenchmarker/publisher.py",> line 885, in PublishSamples
publisher.PublishSamples(self.samples)
File "<https://builds.apache.org/job/beam_PerformanceTests_JDBC/ws/PerfKitBenchmarker/perfkitbenchmarker/publisher.py",> line 537, in PublishSamples
vm_util.IssueRetryableCommand(load_cmd)
File "<https://builds.apache.org/job/beam_PerformanceTests_JDBC/ws/PerfKitBenchmarker/perfkitbenchmarker/vm_util.py",> line 247, in WrappedFunction
return f(*args, **kwargs)
File "<https://builds.apache.org/job/beam_PerformanceTests_JDBC/ws/PerfKitBenchmarker/perfkitbenchmarker/vm_util.py",> line 383, in IssueRetryableCommand
'Command returned a non-zero exit code.\n')
perfkitbenchmarker.errors.CalledProcessException: Command returned a non-zero exit code.
Build step 'Execute shell' marked build as failure
Build failed in Jenkins: beam_PerformanceTests_JDBC #240
Posted by Apache Jenkins Server <je...@builds.apache.org>.
See <https://builds.apache.org/job/beam_PerformanceTests_JDBC/240/display/redirect>
------------------------------------------
[...truncated 39.17 KB...]
[INFO] Replacing original artifact with shaded artifact.
[INFO] Replacing <https://builds.apache.org/job/beam_PerformanceTests_JDBC/ws/runs/233a5c8e/beam/sdks/java/io/jdbc/target/beam-sdks-java-io-jdbc-2.4.0-SNAPSHOT.jar> with <https://builds.apache.org/job/beam_PerformanceTests_JDBC/ws/runs/233a5c8e/beam/sdks/java/io/jdbc/target/beam-sdks-java-io-jdbc-2.4.0-SNAPSHOT-shaded.jar>
[INFO] Replacing original test artifact with shaded test artifact.
[INFO] Replacing <https://builds.apache.org/job/beam_PerformanceTests_JDBC/ws/runs/233a5c8e/beam/sdks/java/io/jdbc/target/beam-sdks-java-io-jdbc-2.4.0-SNAPSHOT-tests.jar> with <https://builds.apache.org/job/beam_PerformanceTests_JDBC/ws/runs/233a5c8e/beam/sdks/java/io/jdbc/target/beam-sdks-java-io-jdbc-2.4.0-SNAPSHOT-shaded-tests.jar>
[INFO] Dependency-reduced POM written at: <https://builds.apache.org/job/beam_PerformanceTests_JDBC/ws/runs/233a5c8e/beam/sdks/java/io/jdbc/dependency-reduced-pom.xml>
[INFO]
[INFO] --- maven-failsafe-plugin:2.20.1:integration-test (default) @ beam-sdks-java-io-jdbc ---
[INFO] Failsafe report directory: <https://builds.apache.org/job/beam_PerformanceTests_JDBC/ws/runs/233a5c8e/beam/sdks/java/io/jdbc/target/failsafe-reports>
[INFO] parallel='all', perCoreThreadCount=true, threadCount=4, useUnlimitedThreads=false, threadCountSuites=0, threadCountClasses=0, threadCountMethods=0, parallelOptimized=true
[INFO]
[INFO] -------------------------------------------------------
[INFO] T E S T S
[INFO] -------------------------------------------------------
[INFO] Running org.apache.beam.sdk.io.jdbc.JdbcIOIT
[ERROR] Tests run: 1, Failures: 0, Errors: 1, Skipped: 0, Time elapsed: 319.993 s <<< FAILURE! - in org.apache.beam.sdk.io.jdbc.JdbcIOIT
[ERROR] testWriteThenRead(org.apache.beam.sdk.io.jdbc.JdbcIOIT) Time elapsed: 319.993 s <<< ERROR!
java.lang.RuntimeException:
(56cdb1dc11e54889): java.lang.RuntimeException: org.apache.beam.sdk.util.UserCodeException: org.postgresql.util.PSQLException: The connection attempt failed.
at com.google.cloud.dataflow.worker.MapTaskExecutorFactory$3.typedApply(MapTaskExecutorFactory.java:404)
at com.google.cloud.dataflow.worker.MapTaskExecutorFactory$3.typedApply(MapTaskExecutorFactory.java:374)
at com.google.cloud.dataflow.worker.graph.Networks$TypeSafeNodeFunction.apply(Networks.java:63)
at com.google.cloud.dataflow.worker.graph.Networks$TypeSafeNodeFunction.apply(Networks.java:50)
at com.google.cloud.dataflow.worker.graph.Networks.replaceDirectedNetworkNodes(Networks.java:87)
at com.google.cloud.dataflow.worker.MapTaskExecutorFactory.create(MapTaskExecutorFactory.java:158)
at com.google.cloud.dataflow.worker.DataflowWorker.doWork(DataflowWorker.java:308)
at com.google.cloud.dataflow.worker.DataflowWorker.getAndPerformWork(DataflowWorker.java:264)
at com.google.cloud.dataflow.worker.DataflowBatchWorkerHarness$WorkerThread.doWork(DataflowBatchWorkerHarness.java:133)
at com.google.cloud.dataflow.worker.DataflowBatchWorkerHarness$WorkerThread.call(DataflowBatchWorkerHarness.java:113)
at com.google.cloud.dataflow.worker.DataflowBatchWorkerHarness$WorkerThread.call(DataflowBatchWorkerHarness.java:100)
at java.util.concurrent.FutureTask.run(FutureTask.java:266)
at java.util.concurrent.ThreadPoolExecutor.runWorker(ThreadPoolExecutor.java:1142)
at java.util.concurrent.ThreadPoolExecutor$Worker.run(ThreadPoolExecutor.java:617)
at java.lang.Thread.run(Thread.java:745)
Caused by: org.apache.beam.sdk.util.UserCodeException: org.postgresql.util.PSQLException: The connection attempt failed.
at org.apache.beam.sdk.util.UserCodeException.wrap(UserCodeException.java:36)
at org.apache.beam.sdk.io.jdbc.JdbcIO$Write$WriteFn$DoFnInvoker.invokeSetup(Unknown Source)
at com.google.cloud.dataflow.worker.DoFnInstanceManagers$ConcurrentQueueInstanceManager.deserializeCopy(DoFnInstanceManagers.java:63)
at com.google.cloud.dataflow.worker.DoFnInstanceManagers$ConcurrentQueueInstanceManager.peek(DoFnInstanceManagers.java:45)
at com.google.cloud.dataflow.worker.UserParDoFnFactory.create(UserParDoFnFactory.java:94)
at com.google.cloud.dataflow.worker.DefaultParDoFnFactory.create(DefaultParDoFnFactory.java:74)
at com.google.cloud.dataflow.worker.MapTaskExecutorFactory.createParDoOperation(MapTaskExecutorFactory.java:481)
at com.google.cloud.dataflow.worker.MapTaskExecutorFactory$3.typedApply(MapTaskExecutorFactory.java:392)
... 14 more
Caused by: org.postgresql.util.PSQLException: The connection attempt failed.
at org.postgresql.core.v3.ConnectionFactoryImpl.openConnectionImpl(ConnectionFactoryImpl.java:272)
at org.postgresql.core.ConnectionFactory.openConnection(ConnectionFactory.java:51)
at org.postgresql.jdbc.PgConnection.<init>(PgConnection.java:215)
at org.postgresql.Driver.makeConnection(Driver.java:404)
at org.postgresql.Driver.connect(Driver.java:272)
at java.sql.DriverManager.getConnection(DriverManager.java:664)
at java.sql.DriverManager.getConnection(DriverManager.java:247)
at org.postgresql.ds.common.BaseDataSource.getConnection(BaseDataSource.java:86)
at org.postgresql.ds.common.BaseDataSource.getConnection(BaseDataSource.java:71)
at org.apache.beam.sdk.io.jdbc.JdbcIO$Write$WriteFn.setup(JdbcIO.java:631)
Caused by: java.net.SocketTimeoutException: connect timed out
at java.net.PlainSocketImpl.socketConnect(Native Method)
at java.net.AbstractPlainSocketImpl.doConnect(AbstractPlainSocketImpl.java:350)
at java.net.AbstractPlainSocketImpl.connectToAddress(AbstractPlainSocketImpl.java:206)
at java.net.AbstractPlainSocketImpl.connect(AbstractPlainSocketImpl.java:188)
at java.net.SocksSocketImpl.connect(SocksSocketImpl.java:392)
at java.net.Socket.connect(Socket.java:589)
at org.postgresql.core.PGStream.<init>(PGStream.java:61)
at org.postgresql.core.v3.ConnectionFactoryImpl.openConnectionImpl(ConnectionFactoryImpl.java:144)
at org.postgresql.core.ConnectionFactory.openConnection(ConnectionFactory.java:51)
at org.postgresql.jdbc.PgConnection.<init>(PgConnection.java:215)
at org.postgresql.Driver.makeConnection(Driver.java:404)
at org.postgresql.Driver.connect(Driver.java:272)
at java.sql.DriverManager.getConnection(DriverManager.java:664)
at java.sql.DriverManager.getConnection(DriverManager.java:247)
at org.postgresql.ds.common.BaseDataSource.getConnection(BaseDataSource.java:86)
at org.postgresql.ds.common.BaseDataSource.getConnection(BaseDataSource.java:71)
at org.apache.beam.sdk.io.jdbc.JdbcIO$Write$WriteFn.setup(JdbcIO.java:631)
at org.apache.beam.sdk.io.jdbc.JdbcIO$Write$WriteFn$DoFnInvoker.invokeSetup(Unknown Source)
at com.google.cloud.dataflow.worker.DoFnInstanceManagers$ConcurrentQueueInstanceManager.deserializeCopy(DoFnInstanceManagers.java:63)
at com.google.cloud.dataflow.worker.DoFnInstanceManagers$ConcurrentQueueInstanceManager.peek(DoFnInstanceManagers.java:45)
at com.google.cloud.dataflow.worker.UserParDoFnFactory.create(UserParDoFnFactory.java:94)
at com.google.cloud.dataflow.worker.DefaultParDoFnFactory.create(DefaultParDoFnFactory.java:74)
at com.google.cloud.dataflow.worker.MapTaskExecutorFactory.createParDoOperation(MapTaskExecutorFactory.java:481)
at com.google.cloud.dataflow.worker.MapTaskExecutorFactory$3.typedApply(MapTaskExecutorFactory.java:392)
at com.google.cloud.dataflow.worker.MapTaskExecutorFactory$3.typedApply(MapTaskExecutorFactory.java:374)
at com.google.cloud.dataflow.worker.graph.Networks$TypeSafeNodeFunction.apply(Networks.java:63)
at com.google.cloud.dataflow.worker.graph.Networks$TypeSafeNodeFunction.apply(Networks.java:50)
at com.google.cloud.dataflow.worker.graph.Networks.replaceDirectedNetworkNodes(Networks.java:87)
at com.google.cloud.dataflow.worker.MapTaskExecutorFactory.create(MapTaskExecutorFactory.java:158)
at com.google.cloud.dataflow.worker.DataflowWorker.doWork(DataflowWorker.java:308)
at com.google.cloud.dataflow.worker.DataflowWorker.getAndPerformWork(DataflowWorker.java:264)
at com.google.cloud.dataflow.worker.DataflowBatchWorkerHarness$WorkerThread.doWork(DataflowBatchWorkerHarness.java:133)
at com.google.cloud.dataflow.worker.DataflowBatchWorkerHarness$WorkerThread.call(DataflowBatchWorkerHarness.java:113)
at com.google.cloud.dataflow.worker.DataflowBatchWorkerHarness$WorkerThread.call(DataflowBatchWorkerHarness.java:100)
at java.util.concurrent.FutureTask.run(FutureTask.java:266)
at java.util.concurrent.ThreadPoolExecutor.runWorker(ThreadPoolExecutor.java:1142)
at java.util.concurrent.ThreadPoolExecutor$Worker.run(ThreadPoolExecutor.java:617)
at java.lang.Thread.run(Thread.java:745)
at org.apache.beam.runners.dataflow.TestDataflowRunner.run(TestDataflowRunner.java:133)
at org.apache.beam.runners.dataflow.TestDataflowRunner.run(TestDataflowRunner.java:89)
at org.apache.beam.runners.dataflow.TestDataflowRunner.run(TestDataflowRunner.java:54)
at org.apache.beam.sdk.Pipeline.run(Pipeline.java:311)
at org.apache.beam.sdk.testing.TestPipeline.run(TestPipeline.java:353)
at org.apache.beam.sdk.testing.TestPipeline.run(TestPipeline.java:335)
at org.apache.beam.sdk.io.jdbc.JdbcIOIT.runWrite(JdbcIOIT.java:117)
at org.apache.beam.sdk.io.jdbc.JdbcIOIT.testWriteThenRead(JdbcIOIT.java:97)
at sun.reflect.NativeMethodAccessorImpl.invoke0(Native Method)
at sun.reflect.NativeMethodAccessorImpl.invoke(NativeMethodAccessorImpl.java:62)
at sun.reflect.DelegatingMethodAccessorImpl.invoke(DelegatingMethodAccessorImpl.java:43)
at java.lang.reflect.Method.invoke(Method.java:498)
at org.junit.runners.model.FrameworkMethod$1.runReflectiveCall(FrameworkMethod.java:50)
at org.junit.internal.runners.model.ReflectiveCallable.run(ReflectiveCallable.java:12)
at org.junit.runners.model.FrameworkMethod.invokeExplosively(FrameworkMethod.java:47)
at org.junit.internal.runners.statements.InvokeMethod.evaluate(InvokeMethod.java:17)
at org.apache.beam.sdk.testing.TestPipeline$1.evaluate(TestPipeline.java:324)
at org.apache.beam.sdk.testing.TestPipeline$1.evaluate(TestPipeline.java:324)
at org.junit.rules.RunRules.evaluate(RunRules.java:20)
at org.junit.runners.ParentRunner.runLeaf(ParentRunner.java:325)
at org.junit.runners.BlockJUnit4ClassRunner.runChild(BlockJUnit4ClassRunner.java:78)
at org.junit.runners.BlockJUnit4ClassRunner.runChild(BlockJUnit4ClassRunner.java:57)
at org.junit.runners.ParentRunner$3.run(ParentRunner.java:290)
at org.apache.maven.surefire.junitcore.pc.Scheduler$1.run(Scheduler.java:410)
at java.util.concurrent.Executors$RunnableAdapter.call(Executors.java:511)
at java.util.concurrent.FutureTask.run(FutureTask.java:266)
at java.util.concurrent.ThreadPoolExecutor.runWorker(ThreadPoolExecutor.java:1149)
at java.util.concurrent.ThreadPoolExecutor$Worker.run(ThreadPoolExecutor.java:624)
at java.lang.Thread.run(Thread.java:748)
[INFO]
[INFO] Results:
[INFO]
[ERROR] Errors:
[ERROR] JdbcIOIT.testWriteThenRead:97->runWrite:117 Runtime (56cdb1dc11e54889): java...
[INFO]
[ERROR] Tests run: 1, Failures: 0, Errors: 1, Skipped: 0
[INFO]
[INFO]
[INFO] --- maven-dependency-plugin:3.0.2:analyze-only (default) @ beam-sdks-java-io-jdbc ---
[INFO] No dependency problems found
[INFO]
[INFO] --- maven-failsafe-plugin:2.20.1:verify (default) @ beam-sdks-java-io-jdbc ---
[INFO] Failsafe report directory: <https://builds.apache.org/job/beam_PerformanceTests_JDBC/ws/runs/233a5c8e/beam/sdks/java/io/jdbc/target/failsafe-reports>
[INFO] ------------------------------------------------------------------------
[INFO] BUILD FAILURE
[INFO] ------------------------------------------------------------------------
[INFO] Total time: 05:36 min
[INFO] Finished at: 2018-02-20T15:06:15Z
[INFO] Final Memory: 91M/1162M
[INFO] ------------------------------------------------------------------------
[ERROR] Failed to execute goal org.apache.maven.plugins:maven-failsafe-plugin:2.20.1:verify (default) on project beam-sdks-java-io-jdbc: There are test failures.
[ERROR]
[ERROR] Please refer to <https://builds.apache.org/job/beam_PerformanceTests_JDBC/ws/runs/233a5c8e/beam/sdks/java/io/jdbc/target/failsafe-reports> for the individual test results.
[ERROR] Please refer to dump files (if any exist) [date]-jvmRun[N].dump, [date].dumpstream and [date]-jvmRun[N].dumpstream.
[ERROR] -> [Help 1]
org.apache.maven.lifecycle.LifecycleExecutionException: Failed to execute goal org.apache.maven.plugins:maven-failsafe-plugin:2.20.1:verify (default) on project beam-sdks-java-io-jdbc: There are test failures.
Please refer to <https://builds.apache.org/job/beam_PerformanceTests_JDBC/ws/runs/233a5c8e/beam/sdks/java/io/jdbc/target/failsafe-reports> for the individual test results.
Please refer to dump files (if any exist) [date]-jvmRun[N].dump, [date].dumpstream and [date]-jvmRun[N].dumpstream.
at org.apache.maven.lifecycle.internal.MojoExecutor.execute (MojoExecutor.java:213)
at org.apache.maven.lifecycle.internal.MojoExecutor.execute (MojoExecutor.java:154)
at org.apache.maven.lifecycle.internal.MojoExecutor.execute (MojoExecutor.java:146)
at org.apache.maven.lifecycle.internal.LifecycleModuleBuilder.buildProject (LifecycleModuleBuilder.java:117)
at org.apache.maven.lifecycle.internal.LifecycleModuleBuilder.buildProject (LifecycleModuleBuilder.java:81)
at org.apache.maven.lifecycle.internal.builder.singlethreaded.SingleThreadedBuilder.build (SingleThreadedBuilder.java:51)
at org.apache.maven.lifecycle.internal.LifecycleStarter.execute (LifecycleStarter.java:128)
at org.apache.maven.DefaultMaven.doExecute (DefaultMaven.java:309)
at org.apache.maven.DefaultMaven.doExecute (DefaultMaven.java:194)
at org.apache.maven.DefaultMaven.execute (DefaultMaven.java:107)
at org.apache.maven.cli.MavenCli.execute (MavenCli.java:955)
at org.apache.maven.cli.MavenCli.doMain (MavenCli.java:290)
at org.apache.maven.cli.MavenCli.main (MavenCli.java:194)
at sun.reflect.NativeMethodAccessorImpl.invoke0 (Native Method)
at sun.reflect.NativeMethodAccessorImpl.invoke (NativeMethodAccessorImpl.java:62)
at sun.reflect.DelegatingMethodAccessorImpl.invoke (DelegatingMethodAccessorImpl.java:43)
at java.lang.reflect.Method.invoke (Method.java:498)
at org.codehaus.plexus.classworlds.launcher.Launcher.launchEnhanced (Launcher.java:289)
at org.codehaus.plexus.classworlds.launcher.Launcher.launch (Launcher.java:229)
at org.codehaus.plexus.classworlds.launcher.Launcher.mainWithExitCode (Launcher.java:415)
at org.codehaus.plexus.classworlds.launcher.Launcher.main (Launcher.java:356)
Caused by: org.apache.maven.plugin.MojoFailureException: There are test failures.
Please refer to <https://builds.apache.org/job/beam_PerformanceTests_JDBC/ws/runs/233a5c8e/beam/sdks/java/io/jdbc/target/failsafe-reports> for the individual test results.
Please refer to dump files (if any exist) [date]-jvmRun[N].dump, [date].dumpstream and [date]-jvmRun[N].dumpstream.
at org.apache.maven.plugin.surefire.SurefireHelper.throwException (SurefireHelper.java:240)
at org.apache.maven.plugin.surefire.SurefireHelper.reportExecution (SurefireHelper.java:112)
at org.apache.maven.plugin.failsafe.VerifyMojo.execute (VerifyMojo.java:188)
at org.apache.maven.plugin.DefaultBuildPluginManager.executeMojo (DefaultBuildPluginManager.java:134)
at org.apache.maven.lifecycle.internal.MojoExecutor.execute (MojoExecutor.java:208)
at org.apache.maven.lifecycle.internal.MojoExecutor.execute (MojoExecutor.java:154)
at org.apache.maven.lifecycle.internal.MojoExecutor.execute (MojoExecutor.java:146)
at org.apache.maven.lifecycle.internal.LifecycleModuleBuilder.buildProject (LifecycleModuleBuilder.java:117)
at org.apache.maven.lifecycle.internal.LifecycleModuleBuilder.buildProject (LifecycleModuleBuilder.java:81)
at org.apache.maven.lifecycle.internal.builder.singlethreaded.SingleThreadedBuilder.build (SingleThreadedBuilder.java:51)
at org.apache.maven.lifecycle.internal.LifecycleStarter.execute (LifecycleStarter.java:128)
at org.apache.maven.DefaultMaven.doExecute (DefaultMaven.java:309)
at org.apache.maven.DefaultMaven.doExecute (DefaultMaven.java:194)
at org.apache.maven.DefaultMaven.execute (DefaultMaven.java:107)
at org.apache.maven.cli.MavenCli.execute (MavenCli.java:955)
at org.apache.maven.cli.MavenCli.doMain (MavenCli.java:290)
at org.apache.maven.cli.MavenCli.main (MavenCli.java:194)
at sun.reflect.NativeMethodAccessorImpl.invoke0 (Native Method)
at sun.reflect.NativeMethodAccessorImpl.invoke (NativeMethodAccessorImpl.java:62)
at sun.reflect.DelegatingMethodAccessorImpl.invoke (DelegatingMethodAccessorImpl.java:43)
at java.lang.reflect.Method.invoke (Method.java:498)
at org.codehaus.plexus.classworlds.launcher.Launcher.launchEnhanced (Launcher.java:289)
at org.codehaus.plexus.classworlds.launcher.Launcher.launch (Launcher.java:229)
at org.codehaus.plexus.classworlds.launcher.Launcher.mainWithExitCode (Launcher.java:415)
at org.codehaus.plexus.classworlds.launcher.Launcher.main (Launcher.java:356)
[ERROR]
[ERROR] Re-run Maven using the -X switch to enable full debug logging.
[ERROR]
[ERROR] For more information about the errors and possible solutions, please read the following articles:
[ERROR] [Help 1] http://cwiki.apache.org/confluence/display/MAVEN/MojoFailureException
STDERR:
2018-02-20 15:06:15,730 233a5c8e MainThread beam_integration_benchmark(1/1) ERROR Error during benchmark beam_integration_benchmark
Traceback (most recent call last):
File "<https://builds.apache.org/job/beam_PerformanceTests_JDBC/ws/PerfKitBenchmarker/perfkitbenchmarker/pkb.py",> line 622, in RunBenchmark
DoRunPhase(spec, collector, detailed_timer)
File "<https://builds.apache.org/job/beam_PerformanceTests_JDBC/ws/PerfKitBenchmarker/perfkitbenchmarker/pkb.py",> line 525, in DoRunPhase
samples = spec.BenchmarkRun(spec)
File "<https://builds.apache.org/job/beam_PerformanceTests_JDBC/ws/PerfKitBenchmarker/perfkitbenchmarker/linux_benchmarks/beam_integration_benchmark.py",> line 159, in Run
job_type=job_type)
File "<https://builds.apache.org/job/beam_PerformanceTests_JDBC/ws/PerfKitBenchmarker/perfkitbenchmarker/providers/gcp/gcp_dpb_dataflow.py",> line 90, in SubmitJob
assert retcode == 0, "Integration Test Failed."
AssertionError: Integration Test Failed.
2018-02-20 15:06:15,730 233a5c8e MainThread beam_integration_benchmark(1/1) INFO Cleaning up benchmark beam_integration_benchmark
2018-02-20 15:06:15,731 233a5c8e MainThread beam_integration_benchmark(1/1) INFO Running: kubectl --kubeconfig=/home/jenkins/.kube/config delete -f <https://builds.apache.org/job/beam_PerformanceTests_JDBC/ws/src/.test-infra/kubernetes/postgres/postgres.yml>
2018-02-20 15:06:15,965 233a5c8e MainThread beam_integration_benchmark(1/1) INFO Running: kubectl --kubeconfig=/home/jenkins/.kube/config delete -f <https://builds.apache.org/job/beam_PerformanceTests_JDBC/ws/src/.test-infra/kubernetes/postgres/postgres-service-for-local-dev.yml>
2018-02-20 15:06:16,102 233a5c8e MainThread beam_integration_benchmark(1/1) ERROR Exception running benchmark
Traceback (most recent call last):
File "<https://builds.apache.org/job/beam_PerformanceTests_JDBC/ws/PerfKitBenchmarker/perfkitbenchmarker/pkb.py",> line 732, in RunBenchmarkTask
RunBenchmark(spec, collector)
File "<https://builds.apache.org/job/beam_PerformanceTests_JDBC/ws/PerfKitBenchmarker/perfkitbenchmarker/pkb.py",> line 622, in RunBenchmark
DoRunPhase(spec, collector, detailed_timer)
File "<https://builds.apache.org/job/beam_PerformanceTests_JDBC/ws/PerfKitBenchmarker/perfkitbenchmarker/pkb.py",> line 525, in DoRunPhase
samples = spec.BenchmarkRun(spec)
File "<https://builds.apache.org/job/beam_PerformanceTests_JDBC/ws/PerfKitBenchmarker/perfkitbenchmarker/linux_benchmarks/beam_integration_benchmark.py",> line 159, in Run
job_type=job_type)
File "<https://builds.apache.org/job/beam_PerformanceTests_JDBC/ws/PerfKitBenchmarker/perfkitbenchmarker/providers/gcp/gcp_dpb_dataflow.py",> line 90, in SubmitJob
assert retcode == 0, "Integration Test Failed."
AssertionError: Integration Test Failed.
2018-02-20 15:06:16,102 233a5c8e MainThread beam_integration_benchmark(1/1) ERROR Benchmark 1/1 beam_integration_benchmark (UID: beam_integration_benchmark0) failed. Execution will continue.
2018-02-20 15:06:16,103 233a5c8e MainThread beam_integration_benchmark(1/1) INFO Benchmark run statuses:
---------------------------------------------------------------------------------
Name UID Status Failed Substatus
---------------------------------------------------------------------------------
beam_integration_benchmark beam_integration_benchmark0 FAILED
---------------------------------------------------------------------------------
Success rate: 0.00% (0/1)
2018-02-20 15:06:16,103 233a5c8e MainThread beam_integration_benchmark(1/1) INFO Complete logs can be found at: <https://builds.apache.org/job/beam_PerformanceTests_JDBC/ws/runs/233a5c8e/pkb.log>
2018-02-20 15:06:16,103 233a5c8e MainThread beam_integration_benchmark(1/1) INFO Completion statuses can be found at: <https://builds.apache.org/job/beam_PerformanceTests_JDBC/ws/runs/233a5c8e/completion_statuses.json>
Build step 'Execute shell' marked build as failure
Build failed in Jenkins: beam_PerformanceTests_JDBC #239
Posted by Apache Jenkins Server <je...@builds.apache.org>.
See <https://builds.apache.org/job/beam_PerformanceTests_JDBC/239/display/redirect>
------------------------------------------
[...truncated 712.85 KB...]
[INFO] Excluding org.apache.beam:beam-sdks-java-io-google-cloud-platform:jar:2.4.0-SNAPSHOT from the shaded jar.
[INFO] Excluding org.apache.beam:beam-sdks-java-extensions-protobuf:jar:2.4.0-SNAPSHOT from the shaded jar.
[INFO] Excluding io.grpc:grpc-core:jar:1.2.0 from the shaded jar.
[INFO] Excluding com.google.errorprone:error_prone_annotations:jar:2.0.15 from the shaded jar.
[INFO] Excluding io.grpc:grpc-context:jar:1.2.0 from the shaded jar.
[INFO] Excluding com.google.instrumentation:instrumentation-api:jar:0.3.0 from the shaded jar.
[INFO] Excluding com.google.apis:google-api-services-bigquery:jar:v2-rev355-1.22.0 from the shaded jar.
[INFO] Excluding com.google.api:gax-grpc:jar:0.20.0 from the shaded jar.
[INFO] Excluding io.grpc:grpc-protobuf:jar:1.2.0 from the shaded jar.
[INFO] Excluding com.google.api:api-common:jar:1.0.0-rc2 from the shaded jar.
[INFO] Excluding com.google.api:gax:jar:1.3.1 from the shaded jar.
[INFO] Excluding org.threeten:threetenbp:jar:1.3.3 from the shaded jar.
[INFO] Excluding com.google.cloud:google-cloud-core-grpc:jar:1.2.0 from the shaded jar.
[INFO] Excluding com.google.protobuf:protobuf-java-util:jar:3.2.0 from the shaded jar.
[INFO] Excluding com.google.code.gson:gson:jar:2.7 from the shaded jar.
[INFO] Excluding com.google.apis:google-api-services-pubsub:jar:v1-rev10-1.22.0 from the shaded jar.
[INFO] Excluding com.google.api.grpc:grpc-google-cloud-pubsub-v1:jar:0.1.18 from the shaded jar.
[INFO] Excluding com.google.api.grpc:proto-google-cloud-pubsub-v1:jar:0.1.18 from the shaded jar.
[INFO] Excluding com.google.api.grpc:proto-google-iam-v1:jar:0.1.18 from the shaded jar.
[INFO] Excluding com.google.cloud.datastore:datastore-v1-proto-client:jar:1.4.0 from the shaded jar.
[INFO] Excluding com.google.http-client:google-http-client-protobuf:jar:1.22.0 from the shaded jar.
[INFO] Excluding com.google.http-client:google-http-client-jackson:jar:1.22.0 from the shaded jar.
[INFO] Excluding com.google.cloud.datastore:datastore-v1-protos:jar:1.3.0 from the shaded jar.
[INFO] Excluding com.google.api.grpc:grpc-google-common-protos:jar:0.1.9 from the shaded jar.
[INFO] Excluding io.grpc:grpc-auth:jar:1.2.0 from the shaded jar.
[INFO] Excluding io.grpc:grpc-netty:jar:1.2.0 from the shaded jar.
[INFO] Excluding io.netty:netty-codec-http2:jar:4.1.8.Final from the shaded jar.
[INFO] Excluding io.netty:netty-codec-http:jar:4.1.8.Final from the shaded jar.
[INFO] Excluding io.netty:netty-handler-proxy:jar:4.1.8.Final from the shaded jar.
[INFO] Excluding io.netty:netty-codec-socks:jar:4.1.8.Final from the shaded jar.
[INFO] Excluding io.netty:netty-handler:jar:4.1.8.Final from the shaded jar.
[INFO] Excluding io.netty:netty-buffer:jar:4.1.8.Final from the shaded jar.
[INFO] Excluding io.netty:netty-common:jar:4.1.8.Final from the shaded jar.
[INFO] Excluding io.netty:netty-transport:jar:4.1.8.Final from the shaded jar.
[INFO] Excluding io.netty:netty-resolver:jar:4.1.8.Final from the shaded jar.
[INFO] Excluding io.netty:netty-codec:jar:4.1.8.Final from the shaded jar.
[INFO] Excluding io.grpc:grpc-stub:jar:1.2.0 from the shaded jar.
[INFO] Excluding io.grpc:grpc-all:jar:1.2.0 from the shaded jar.
[INFO] Excluding io.grpc:grpc-okhttp:jar:1.2.0 from the shaded jar.
[INFO] Excluding com.squareup.okhttp:okhttp:jar:2.5.0 from the shaded jar.
[INFO] Excluding com.squareup.okio:okio:jar:1.6.0 from the shaded jar.
[INFO] Excluding io.grpc:grpc-protobuf-lite:jar:1.2.0 from the shaded jar.
[INFO] Excluding io.grpc:grpc-protobuf-nano:jar:1.2.0 from the shaded jar.
[INFO] Excluding com.google.protobuf.nano:protobuf-javanano:jar:3.0.0-alpha-5 from the shaded jar.
[INFO] Excluding com.google.cloud:google-cloud-core:jar:1.0.2 from the shaded jar.
[INFO] Excluding org.json:json:jar:20160810 from the shaded jar.
[INFO] Excluding com.google.cloud:google-cloud-spanner:jar:0.20.0-beta from the shaded jar.
[INFO] Excluding com.google.api.grpc:proto-google-cloud-spanner-v1:jar:0.1.11 from the shaded jar.
[INFO] Excluding com.google.api.grpc:proto-google-cloud-spanner-admin-instance-v1:jar:0.1.11 from the shaded jar.
[INFO] Excluding com.google.api.grpc:grpc-google-cloud-spanner-v1:jar:0.1.11 from the shaded jar.
[INFO] Excluding com.google.api.grpc:grpc-google-cloud-spanner-admin-database-v1:jar:0.1.11 from the shaded jar.
[INFO] Excluding com.google.api.grpc:grpc-google-cloud-spanner-admin-instance-v1:jar:0.1.11 from the shaded jar.
[INFO] Excluding com.google.api.grpc:grpc-google-longrunning-v1:jar:0.1.11 from the shaded jar.
[INFO] Excluding com.google.api.grpc:proto-google-longrunning-v1:jar:0.1.11 from the shaded jar.
[INFO] Excluding com.google.cloud.bigtable:bigtable-protos:jar:1.0.0-pre3 from the shaded jar.
[INFO] Excluding com.google.cloud.bigtable:bigtable-client-core:jar:1.0.0 from the shaded jar.
[INFO] Excluding com.google.auth:google-auth-library-appengine:jar:0.7.0 from the shaded jar.
[INFO] Excluding io.opencensus:opencensus-contrib-grpc-util:jar:0.7.0 from the shaded jar.
[INFO] Excluding io.opencensus:opencensus-api:jar:0.7.0 from the shaded jar.
[INFO] Excluding io.dropwizard.metrics:metrics-core:jar:3.1.2 from the shaded jar.
[INFO] Excluding com.google.protobuf:protobuf-java:jar:3.2.0 from the shaded jar.
[INFO] Excluding io.netty:netty-tcnative-boringssl-static:jar:1.1.33.Fork26 from the shaded jar.
[INFO] Excluding com.google.api.grpc:proto-google-cloud-spanner-admin-database-v1:jar:0.1.9 from the shaded jar.
[INFO] Excluding com.google.api.grpc:proto-google-common-protos:jar:0.1.9 from the shaded jar.
[INFO] Excluding com.google.api-client:google-api-client:jar:1.22.0 from the shaded jar.
[INFO] Excluding com.google.oauth-client:google-oauth-client:jar:1.22.0 from the shaded jar.
[INFO] Excluding com.google.http-client:google-http-client:jar:1.22.0 from the shaded jar.
[INFO] Excluding org.apache.httpcomponents:httpclient:jar:4.0.1 from the shaded jar.
[INFO] Excluding org.apache.httpcomponents:httpcore:jar:4.0.1 from the shaded jar.
[INFO] Excluding commons-codec:commons-codec:jar:1.3 from the shaded jar.
[INFO] Excluding com.google.http-client:google-http-client-jackson2:jar:1.22.0 from the shaded jar.
[INFO] Excluding com.google.apis:google-api-services-dataflow:jar:v1b3-rev221-1.22.0 from the shaded jar.
[INFO] Excluding com.google.apis:google-api-services-clouddebugger:jar:v2-rev8-1.22.0 from the shaded jar.
[INFO] Excluding com.google.apis:google-api-services-storage:jar:v1-rev71-1.22.0 from the shaded jar.
[INFO] Excluding com.google.auth:google-auth-library-credentials:jar:0.7.1 from the shaded jar.
[INFO] Excluding com.google.auth:google-auth-library-oauth2-http:jar:0.7.1 from the shaded jar.
[INFO] Excluding com.google.cloud.bigdataoss:util:jar:1.4.5 from the shaded jar.
[INFO] Excluding com.google.api-client:google-api-client-java6:jar:1.22.0 from the shaded jar.
[INFO] Excluding com.google.api-client:google-api-client-jackson2:jar:1.22.0 from the shaded jar.
[INFO] Excluding com.google.oauth-client:google-oauth-client-java6:jar:1.22.0 from the shaded jar.
[INFO] Replacing original artifact with shaded artifact.
[INFO] Replacing <https://builds.apache.org/job/beam_PerformanceTests_JDBC/ws/runs/6da303df/beam/sdks/java/io/jdbc/target/beam-sdks-java-io-jdbc-2.4.0-SNAPSHOT.jar> with <https://builds.apache.org/job/beam_PerformanceTests_JDBC/ws/runs/6da303df/beam/sdks/java/io/jdbc/target/beam-sdks-java-io-jdbc-2.4.0-SNAPSHOT-shaded.jar>
[INFO] Replacing original test artifact with shaded test artifact.
[INFO] Replacing <https://builds.apache.org/job/beam_PerformanceTests_JDBC/ws/runs/6da303df/beam/sdks/java/io/jdbc/target/beam-sdks-java-io-jdbc-2.4.0-SNAPSHOT-tests.jar> with <https://builds.apache.org/job/beam_PerformanceTests_JDBC/ws/runs/6da303df/beam/sdks/java/io/jdbc/target/beam-sdks-java-io-jdbc-2.4.0-SNAPSHOT-shaded-tests.jar>
[INFO] Dependency-reduced POM written at: <https://builds.apache.org/job/beam_PerformanceTests_JDBC/ws/runs/6da303df/beam/sdks/java/io/jdbc/dependency-reduced-pom.xml>
[INFO]
[INFO] --- maven-failsafe-plugin:2.20.1:integration-test (default) @ beam-sdks-java-io-jdbc ---
[INFO] Failsafe report directory: <https://builds.apache.org/job/beam_PerformanceTests_JDBC/ws/runs/6da303df/beam/sdks/java/io/jdbc/target/failsafe-reports>
[INFO] parallel='all', perCoreThreadCount=true, threadCount=4, useUnlimitedThreads=false, threadCountSuites=0, threadCountClasses=0, threadCountMethods=0, parallelOptimized=true
[INFO]
[INFO] -------------------------------------------------------
[INFO] T E S T S
[INFO] -------------------------------------------------------
[INFO] Running org.apache.beam.sdk.io.jdbc.JdbcIOIT
[ERROR] Tests run: 1, Failures: 0, Errors: 1, Skipped: 0, Time elapsed: 0 s <<< FAILURE! - in org.apache.beam.sdk.io.jdbc.JdbcIOIT
[ERROR] org.apache.beam.sdk.io.jdbc.JdbcIOIT Time elapsed: 0 s <<< ERROR!
java.lang.IllegalArgumentException: expected one element but was: <postgres, postgres>
at org.apache.beam.sdk.repackaged.com.google.common.collect.Iterators.getOnlyElement(Iterators.java:322)
at org.apache.beam.sdk.repackaged.com.google.common.collect.Iterables.getOnlyElement(Iterables.java:294)
at org.apache.beam.sdk.options.PipelineOptionsFactory.parseObjects(PipelineOptionsFactory.java:1655)
at org.apache.beam.sdk.options.PipelineOptionsFactory.access$400(PipelineOptionsFactory.java:107)
at org.apache.beam.sdk.options.PipelineOptionsFactory$Builder.as(PipelineOptionsFactory.java:294)
at org.apache.beam.sdk.testing.TestPipeline.testingPipelineOptions(TestPipeline.java:451)
at org.apache.beam.sdk.io.jdbc.JdbcIOIT.setup(JdbcIOIT.java:78)
at sun.reflect.NativeMethodAccessorImpl.invoke0(Native Method)
at sun.reflect.NativeMethodAccessorImpl.invoke(NativeMethodAccessorImpl.java:62)
at sun.reflect.DelegatingMethodAccessorImpl.invoke(DelegatingMethodAccessorImpl.java:43)
at java.lang.reflect.Method.invoke(Method.java:498)
at org.junit.runners.model.FrameworkMethod$1.runReflectiveCall(FrameworkMethod.java:50)
at org.junit.internal.runners.model.ReflectiveCallable.run(ReflectiveCallable.java:12)
at org.junit.runners.model.FrameworkMethod.invokeExplosively(FrameworkMethod.java:47)
at org.junit.internal.runners.statements.RunBefores.evaluate(RunBefores.java:24)
at org.junit.internal.runners.statements.RunAfters.evaluate(RunAfters.java:27)
at org.junit.runners.ParentRunner.run(ParentRunner.java:363)
at org.junit.runners.Suite.runChild(Suite.java:128)
at org.junit.runners.Suite.runChild(Suite.java:27)
at org.junit.runners.ParentRunner$3.run(ParentRunner.java:290)
at org.apache.maven.surefire.junitcore.pc.Scheduler$1.run(Scheduler.java:410)
at java.util.concurrent.Executors$RunnableAdapter.call(Executors.java:511)
at java.util.concurrent.FutureTask.run(FutureTask.java:266)
at java.util.concurrent.ThreadPoolExecutor.runWorker(ThreadPoolExecutor.java:1149)
at java.util.concurrent.ThreadPoolExecutor$Worker.run(ThreadPoolExecutor.java:624)
at java.lang.Thread.run(Thread.java:748)
[INFO]
[INFO] Results:
[INFO]
[ERROR] Errors:
[ERROR] JdbcIOIT.setup:78 IllegalArgument expected one element but was: <postgres, p...
[INFO]
[ERROR] Tests run: 1, Failures: 0, Errors: 1, Skipped: 0
[INFO]
[INFO]
[INFO] --- maven-dependency-plugin:3.0.2:analyze-only (default) @ beam-sdks-java-io-jdbc ---
[INFO] No dependency problems found
[INFO]
[INFO] --- maven-failsafe-plugin:2.20.1:verify (default) @ beam-sdks-java-io-jdbc ---
[INFO] Failsafe report directory: <https://builds.apache.org/job/beam_PerformanceTests_JDBC/ws/runs/6da303df/beam/sdks/java/io/jdbc/target/failsafe-reports>
[INFO] ------------------------------------------------------------------------
[INFO] BUILD FAILURE
[INFO] ------------------------------------------------------------------------
[INFO] Total time: 36.669 s
[INFO] Finished at: 2018-02-20T14:43:36Z
[INFO] Final Memory: 86M/978M
[INFO] ------------------------------------------------------------------------
[ERROR] Failed to execute goal org.apache.maven.plugins:maven-failsafe-plugin:2.20.1:verify (default) on project beam-sdks-java-io-jdbc: There are test failures.
[ERROR]
[ERROR] Please refer to <https://builds.apache.org/job/beam_PerformanceTests_JDBC/ws/runs/6da303df/beam/sdks/java/io/jdbc/target/failsafe-reports> for the individual test results.
[ERROR] Please refer to dump files (if any exist) [date]-jvmRun[N].dump, [date].dumpstream and [date]-jvmRun[N].dumpstream.
[ERROR] -> [Help 1]
org.apache.maven.lifecycle.LifecycleExecutionException: Failed to execute goal org.apache.maven.plugins:maven-failsafe-plugin:2.20.1:verify (default) on project beam-sdks-java-io-jdbc: There are test failures.
Please refer to <https://builds.apache.org/job/beam_PerformanceTests_JDBC/ws/runs/6da303df/beam/sdks/java/io/jdbc/target/failsafe-reports> for the individual test results.
Please refer to dump files (if any exist) [date]-jvmRun[N].dump, [date].dumpstream and [date]-jvmRun[N].dumpstream.
at org.apache.maven.lifecycle.internal.MojoExecutor.execute (MojoExecutor.java:213)
at org.apache.maven.lifecycle.internal.MojoExecutor.execute (MojoExecutor.java:154)
at org.apache.maven.lifecycle.internal.MojoExecutor.execute (MojoExecutor.java:146)
at org.apache.maven.lifecycle.internal.LifecycleModuleBuilder.buildProject (LifecycleModuleBuilder.java:117)
at org.apache.maven.lifecycle.internal.LifecycleModuleBuilder.buildProject (LifecycleModuleBuilder.java:81)
at org.apache.maven.lifecycle.internal.builder.singlethreaded.SingleThreadedBuilder.build (SingleThreadedBuilder.java:51)
at org.apache.maven.lifecycle.internal.LifecycleStarter.execute (LifecycleStarter.java:128)
at org.apache.maven.DefaultMaven.doExecute (DefaultMaven.java:309)
at org.apache.maven.DefaultMaven.doExecute (DefaultMaven.java:194)
at org.apache.maven.DefaultMaven.execute (DefaultMaven.java:107)
at org.apache.maven.cli.MavenCli.execute (MavenCli.java:955)
at org.apache.maven.cli.MavenCli.doMain (MavenCli.java:290)
at org.apache.maven.cli.MavenCli.main (MavenCli.java:194)
at sun.reflect.NativeMethodAccessorImpl.invoke0 (Native Method)
at sun.reflect.NativeMethodAccessorImpl.invoke (NativeMethodAccessorImpl.java:62)
at sun.reflect.DelegatingMethodAccessorImpl.invoke (DelegatingMethodAccessorImpl.java:43)
at java.lang.reflect.Method.invoke (Method.java:498)
at org.codehaus.plexus.classworlds.launcher.Launcher.launchEnhanced (Launcher.java:289)
at org.codehaus.plexus.classworlds.launcher.Launcher.launch (Launcher.java:229)
at org.codehaus.plexus.classworlds.launcher.Launcher.mainWithExitCode (Launcher.java:415)
at org.codehaus.plexus.classworlds.launcher.Launcher.main (Launcher.java:356)
Caused by: org.apache.maven.plugin.MojoFailureException: There are test failures.
Please refer to <https://builds.apache.org/job/beam_PerformanceTests_JDBC/ws/runs/6da303df/beam/sdks/java/io/jdbc/target/failsafe-reports> for the individual test results.
Please refer to dump files (if any exist) [date]-jvmRun[N].dump, [date].dumpstream and [date]-jvmRun[N].dumpstream.
at org.apache.maven.plugin.surefire.SurefireHelper.throwException (SurefireHelper.java:240)
at org.apache.maven.plugin.surefire.SurefireHelper.reportExecution (SurefireHelper.java:112)
at org.apache.maven.plugin.failsafe.VerifyMojo.execute (VerifyMojo.java:188)
at org.apache.maven.plugin.DefaultBuildPluginManager.executeMojo (DefaultBuildPluginManager.java:134)
at org.apache.maven.lifecycle.internal.MojoExecutor.execute (MojoExecutor.java:208)
at org.apache.maven.lifecycle.internal.MojoExecutor.execute (MojoExecutor.java:154)
at org.apache.maven.lifecycle.internal.MojoExecutor.execute (MojoExecutor.java:146)
at org.apache.maven.lifecycle.internal.LifecycleModuleBuilder.buildProject (LifecycleModuleBuilder.java:117)
at org.apache.maven.lifecycle.internal.LifecycleModuleBuilder.buildProject (LifecycleModuleBuilder.java:81)
at org.apache.maven.lifecycle.internal.builder.singlethreaded.SingleThreadedBuilder.build (SingleThreadedBuilder.java:51)
at org.apache.maven.lifecycle.internal.LifecycleStarter.execute (LifecycleStarter.java:128)
at org.apache.maven.DefaultMaven.doExecute (DefaultMaven.java:309)
at org.apache.maven.DefaultMaven.doExecute (DefaultMaven.java:194)
at org.apache.maven.DefaultMaven.execute (DefaultMaven.java:107)
at org.apache.maven.cli.MavenCli.execute (MavenCli.java:955)
at org.apache.maven.cli.MavenCli.doMain (MavenCli.java:290)
at org.apache.maven.cli.MavenCli.main (MavenCli.java:194)
at sun.reflect.NativeMethodAccessorImpl.invoke0 (Native Method)
at sun.reflect.NativeMethodAccessorImpl.invoke (NativeMethodAccessorImpl.java:62)
at sun.reflect.DelegatingMethodAccessorImpl.invoke (DelegatingMethodAccessorImpl.java:43)
at java.lang.reflect.Method.invoke (Method.java:498)
at org.codehaus.plexus.classworlds.launcher.Launcher.launchEnhanced (Launcher.java:289)
at org.codehaus.plexus.classworlds.launcher.Launcher.launch (Launcher.java:229)
at org.codehaus.plexus.classworlds.launcher.Launcher.mainWithExitCode (Launcher.java:415)
at org.codehaus.plexus.classworlds.launcher.Launcher.main (Launcher.java:356)
[ERROR]
[ERROR] Re-run Maven using the -X switch to enable full debug logging.
[ERROR]
[ERROR] For more information about the errors and possible solutions, please read the following articles:
[ERROR] [Help 1] http://cwiki.apache.org/confluence/display/MAVEN/MojoFailureException
STDERR:
2018-02-20 14:43:37,170 6da303df MainThread beam_integration_benchmark(1/1) ERROR Error during benchmark beam_integration_benchmark
Traceback (most recent call last):
File "<https://builds.apache.org/job/beam_PerformanceTests_JDBC/ws/PerfKitBenchmarker/perfkitbenchmarker/pkb.py",> line 622, in RunBenchmark
DoRunPhase(spec, collector, detailed_timer)
File "<https://builds.apache.org/job/beam_PerformanceTests_JDBC/ws/PerfKitBenchmarker/perfkitbenchmarker/pkb.py",> line 525, in DoRunPhase
samples = spec.BenchmarkRun(spec)
File "<https://builds.apache.org/job/beam_PerformanceTests_JDBC/ws/PerfKitBenchmarker/perfkitbenchmarker/linux_benchmarks/beam_integration_benchmark.py",> line 159, in Run
job_type=job_type)
File "<https://builds.apache.org/job/beam_PerformanceTests_JDBC/ws/PerfKitBenchmarker/perfkitbenchmarker/providers/gcp/gcp_dpb_dataflow.py",> line 90, in SubmitJob
assert retcode == 0, "Integration Test Failed."
AssertionError: Integration Test Failed.
2018-02-20 14:43:37,171 6da303df MainThread beam_integration_benchmark(1/1) INFO Cleaning up benchmark beam_integration_benchmark
2018-02-20 14:43:37,171 6da303df MainThread beam_integration_benchmark(1/1) INFO Running: kubectl --kubeconfig=/home/jenkins/.kube/config delete -f <https://builds.apache.org/job/beam_PerformanceTests_JDBC/ws/src/.test-infra/kubernetes/postgres/postgres.yml>
2018-02-20 14:43:37,532 6da303df MainThread beam_integration_benchmark(1/1) INFO Running: kubectl --kubeconfig=/home/jenkins/.kube/config delete -f <https://builds.apache.org/job/beam_PerformanceTests_JDBC/ws/src/.test-infra/kubernetes/postgres/postgres-service-for-local-dev.yml>
2018-02-20 14:43:37,674 6da303df MainThread beam_integration_benchmark(1/1) ERROR Exception running benchmark
Traceback (most recent call last):
File "<https://builds.apache.org/job/beam_PerformanceTests_JDBC/ws/PerfKitBenchmarker/perfkitbenchmarker/pkb.py",> line 732, in RunBenchmarkTask
RunBenchmark(spec, collector)
File "<https://builds.apache.org/job/beam_PerformanceTests_JDBC/ws/PerfKitBenchmarker/perfkitbenchmarker/pkb.py",> line 622, in RunBenchmark
DoRunPhase(spec, collector, detailed_timer)
File "<https://builds.apache.org/job/beam_PerformanceTests_JDBC/ws/PerfKitBenchmarker/perfkitbenchmarker/pkb.py",> line 525, in DoRunPhase
samples = spec.BenchmarkRun(spec)
File "<https://builds.apache.org/job/beam_PerformanceTests_JDBC/ws/PerfKitBenchmarker/perfkitbenchmarker/linux_benchmarks/beam_integration_benchmark.py",> line 159, in Run
job_type=job_type)
File "<https://builds.apache.org/job/beam_PerformanceTests_JDBC/ws/PerfKitBenchmarker/perfkitbenchmarker/providers/gcp/gcp_dpb_dataflow.py",> line 90, in SubmitJob
assert retcode == 0, "Integration Test Failed."
AssertionError: Integration Test Failed.
2018-02-20 14:43:37,674 6da303df MainThread beam_integration_benchmark(1/1) ERROR Benchmark 1/1 beam_integration_benchmark (UID: beam_integration_benchmark0) failed. Execution will continue.
2018-02-20 14:43:37,674 6da303df MainThread beam_integration_benchmark(1/1) INFO Benchmark run statuses:
---------------------------------------------------------------------------------
Name UID Status Failed Substatus
---------------------------------------------------------------------------------
beam_integration_benchmark beam_integration_benchmark0 FAILED
---------------------------------------------------------------------------------
Success rate: 0.00% (0/1)
2018-02-20 14:43:37,675 6da303df MainThread beam_integration_benchmark(1/1) INFO Complete logs can be found at: <https://builds.apache.org/job/beam_PerformanceTests_JDBC/ws/runs/6da303df/pkb.log>
2018-02-20 14:43:37,675 6da303df MainThread beam_integration_benchmark(1/1) INFO Completion statuses can be found at: <https://builds.apache.org/job/beam_PerformanceTests_JDBC/ws/runs/6da303df/completion_statuses.json>
Build step 'Execute shell' marked build as failure
Build failed in Jenkins: beam_PerformanceTests_JDBC #238
Posted by Apache Jenkins Server <je...@builds.apache.org>.
See <https://builds.apache.org/job/beam_PerformanceTests_JDBC/238/display/redirect>
------------------------------------------
GitHub pull request #4715 of commit 2f0ec08c6892bab1505a7a91ad4d47dee42695ed, no merge conflicts.
Setting status of 2f0ec08c6892bab1505a7a91ad4d47dee42695ed to PENDING with url https://builds.apache.org/job/beam_PerformanceTests_JDBC/238/ and message: 'Build started sha1 is merged.'
Using context: Jenkins: Java JdbcIO Performance Test
[EnvInject] - Loading node environment variables.
Building remotely on beam2 (beam) in workspace <https://builds.apache.org/job/beam_PerformanceTests_JDBC/ws/>
> git rev-parse --is-inside-work-tree # timeout=10
Fetching changes from the remote Git repository
> git config remote.origin.url https://github.com/apache/beam.git # timeout=10
Fetching upstream changes from https://github.com/apache/beam.git
> git --version # timeout=10
> git fetch --tags --progress https://github.com/apache/beam.git +refs/heads/*:refs/remotes/origin/* +refs/pull/4715/*:refs/remotes/origin/pr/4715/*
> git rev-parse refs/remotes/origin/pr/4715/merge^{commit} # timeout=10
> git rev-parse refs/remotes/origin/origin/pr/4715/merge^{commit} # timeout=10
Checking out Revision 0ed6e60599504b0b3e35cfcf7166387dbfe4b06d (refs/remotes/origin/pr/4715/merge)
> git config core.sparsecheckout # timeout=10
> git checkout -f 0ed6e60599504b0b3e35cfcf7166387dbfe4b06d
Commit message: "Merge 2f0ec08c6892bab1505a7a91ad4d47dee42695ed into 153f8a8e52f880896ca3dc5c8366d8f003ffaf5a"
First time build. Skipping changelog.
Cleaning workspace
> git rev-parse --verify HEAD # timeout=10
Resetting working tree
> git reset --hard # timeout=10
> git clean -fdx # timeout=10
[EnvInject] - Executing scripts and injecting environment variables after the SCM step.
[EnvInject] - Injecting as environment variables the properties content
SPARK_LOCAL_IP=127.0.0.1
[EnvInject] - Variables injected successfully.
[beam_PerformanceTests_JDBC] $ /bin/bash -xe /tmp/jenkins5450784041149769963.sh
+ gcloud container clusters get-credentials io-datastores --zone=us-central1-a --verbosity=debug
DEBUG: Running gcloud.container.clusters.get-credentials with Namespace(__calliope_internal_deepest_parser=ArgumentParser(prog='gcloud.container.clusters.get-credentials', usage=None, description='See https://cloud.google.com/container-engine/docs/kubectl for\nkubectl documentation.', version=None, formatter_class=<class 'argparse.HelpFormatter'>, conflict_handler='error', add_help=False), account=None, api_version=None, authority_selector=None, authorization_token_file=None, cmd_func=<bound method Command.Run of <googlecloudsdk.calliope.backend.Command object at 0x7f008e5f3790>>, command_path=['gcloud', 'container', 'clusters', 'get-credentials'], configuration=None, credential_file_override=None, document=None, format=None, h=None, help=None, http_timeout=None, log_http=None, name='io-datastores', project=None, quiet=None, trace_email=None, trace_log=None, trace_token=None, user_output_enabled=None, verbosity='debug', version=None, zone='us-central1-a').
WARNING: Accessing a Container Engine cluster requires the kubernetes commandline
client [kubectl]. To install, run
$ gcloud components install kubectl
Fetching cluster endpoint and auth data.
DEBUG: Saved kubeconfig to /home/jenkins/.kube/config
kubeconfig entry generated for io-datastores.
INFO: Display format "default".
[beam_PerformanceTests_JDBC] $ /bin/bash -xe /tmp/jenkins8011909918865662956.sh
+ kubectl delete rc postgres
Error from server (NotFound): replicationcontrollers "postgres" not found
+ kubectl delete service postgres
Error from server (NotFound): services "postgres" not found
+ kubectl delete service postgres-for-dev
Error from server (NotFound): services "postgres-for-dev" not found
Build step 'Execute shell' marked build as failure
Build failed in Jenkins: beam_PerformanceTests_JDBC #237
Posted by Apache Jenkins Server <je...@builds.apache.org>.
See <https://builds.apache.org/job/beam_PerformanceTests_JDBC/237/display/redirect?page=changes>
Changes:
[lcwik] Adjust gradle build dirs and hints to help IntelliJ (#4583)
[coheigea] BEAM-3618 - Remove extraneous "return" statement
------------------------------------------
[...truncated 29.32 KB...]
[INFO] Excluding com.thoughtworks.paranamer:paranamer:jar:2.7 from the shaded jar.
[INFO] Excluding org.apache.commons:commons-compress:jar:1.14 from the shaded jar.
[INFO] Excluding org.tukaani:xz:jar:1.5 from the shaded jar.
[INFO] Excluding org.xerial.snappy:snappy-java:jar:1.1.4 from the shaded jar.
[INFO] Excluding joda-time:joda-time:jar:2.4 from the shaded jar.
[INFO] Including com.google.guava:guava:jar:20.0 in the shaded jar.
[INFO] Excluding com.google.code.findbugs:jsr305:jar:3.0.1 from the shaded jar.
[INFO] Excluding org.apache.commons:commons-dbcp2:jar:2.1.1 from the shaded jar.
[INFO] Excluding org.apache.commons:commons-pool2:jar:2.4.2 from the shaded jar.
[INFO] Excluding commons-logging:commons-logging:jar:1.2 from the shaded jar.
[INFO] Excluding org.apache.beam:beam-runners-google-cloud-dataflow-java:jar:2.4.0-SNAPSHOT from the shaded jar.
[INFO] Excluding org.apache.beam:beam-sdks-java-extensions-google-cloud-platform-core:jar:2.4.0-SNAPSHOT from the shaded jar.
[INFO] Excluding com.google.cloud.bigdataoss:gcsio:jar:1.4.5 from the shaded jar.
[INFO] Excluding com.google.apis:google-api-services-cloudresourcemanager:jar:v1-rev6-1.22.0 from the shaded jar.
[INFO] Excluding org.apache.beam:beam-sdks-java-io-google-cloud-platform:jar:2.4.0-SNAPSHOT from the shaded jar.
[INFO] Excluding org.apache.beam:beam-sdks-java-extensions-protobuf:jar:2.4.0-SNAPSHOT from the shaded jar.
[INFO] Excluding io.grpc:grpc-core:jar:1.2.0 from the shaded jar.
[INFO] Excluding com.google.errorprone:error_prone_annotations:jar:2.0.15 from the shaded jar.
[INFO] Excluding io.grpc:grpc-context:jar:1.2.0 from the shaded jar.
[INFO] Excluding com.google.instrumentation:instrumentation-api:jar:0.3.0 from the shaded jar.
[INFO] Excluding com.google.apis:google-api-services-bigquery:jar:v2-rev355-1.22.0 from the shaded jar.
[INFO] Excluding com.google.api:gax-grpc:jar:0.20.0 from the shaded jar.
[INFO] Excluding io.grpc:grpc-protobuf:jar:1.2.0 from the shaded jar.
[INFO] Excluding com.google.api:api-common:jar:1.0.0-rc2 from the shaded jar.
[INFO] Excluding com.google.api:gax:jar:1.3.1 from the shaded jar.
[INFO] Excluding org.threeten:threetenbp:jar:1.3.3 from the shaded jar.
[INFO] Excluding com.google.cloud:google-cloud-core-grpc:jar:1.2.0 from the shaded jar.
[INFO] Excluding com.google.protobuf:protobuf-java-util:jar:3.2.0 from the shaded jar.
[INFO] Excluding com.google.code.gson:gson:jar:2.7 from the shaded jar.
[INFO] Excluding com.google.apis:google-api-services-pubsub:jar:v1-rev10-1.22.0 from the shaded jar.
[INFO] Excluding com.google.api.grpc:grpc-google-cloud-pubsub-v1:jar:0.1.18 from the shaded jar.
[INFO] Excluding com.google.api.grpc:proto-google-cloud-pubsub-v1:jar:0.1.18 from the shaded jar.
[INFO] Excluding com.google.api.grpc:proto-google-iam-v1:jar:0.1.18 from the shaded jar.
[INFO] Excluding com.google.cloud.datastore:datastore-v1-proto-client:jar:1.4.0 from the shaded jar.
[INFO] Excluding com.google.http-client:google-http-client-protobuf:jar:1.22.0 from the shaded jar.
[INFO] Excluding com.google.http-client:google-http-client-jackson:jar:1.22.0 from the shaded jar.
[INFO] Excluding com.google.cloud.datastore:datastore-v1-protos:jar:1.3.0 from the shaded jar.
[INFO] Excluding com.google.api.grpc:grpc-google-common-protos:jar:0.1.9 from the shaded jar.
[INFO] Excluding io.grpc:grpc-auth:jar:1.2.0 from the shaded jar.
[INFO] Excluding io.grpc:grpc-netty:jar:1.2.0 from the shaded jar.
[INFO] Excluding io.netty:netty-codec-http2:jar:4.1.8.Final from the shaded jar.
[INFO] Excluding io.netty:netty-codec-http:jar:4.1.8.Final from the shaded jar.
[INFO] Excluding io.netty:netty-handler-proxy:jar:4.1.8.Final from the shaded jar.
[INFO] Excluding io.netty:netty-codec-socks:jar:4.1.8.Final from the shaded jar.
[INFO] Excluding io.netty:netty-handler:jar:4.1.8.Final from the shaded jar.
[INFO] Excluding io.netty:netty-buffer:jar:4.1.8.Final from the shaded jar.
[INFO] Excluding io.netty:netty-common:jar:4.1.8.Final from the shaded jar.
[INFO] Excluding io.netty:netty-transport:jar:4.1.8.Final from the shaded jar.
[INFO] Excluding io.netty:netty-resolver:jar:4.1.8.Final from the shaded jar.
[INFO] Excluding io.netty:netty-codec:jar:4.1.8.Final from the shaded jar.
[INFO] Excluding io.grpc:grpc-stub:jar:1.2.0 from the shaded jar.
[INFO] Excluding io.grpc:grpc-all:jar:1.2.0 from the shaded jar.
[INFO] Excluding io.grpc:grpc-okhttp:jar:1.2.0 from the shaded jar.
[INFO] Excluding com.squareup.okhttp:okhttp:jar:2.5.0 from the shaded jar.
[INFO] Excluding com.squareup.okio:okio:jar:1.6.0 from the shaded jar.
[INFO] Excluding io.grpc:grpc-protobuf-lite:jar:1.2.0 from the shaded jar.
[INFO] Excluding io.grpc:grpc-protobuf-nano:jar:1.2.0 from the shaded jar.
[INFO] Excluding com.google.protobuf.nano:protobuf-javanano:jar:3.0.0-alpha-5 from the shaded jar.
[INFO] Excluding com.google.cloud:google-cloud-core:jar:1.0.2 from the shaded jar.
[INFO] Excluding org.json:json:jar:20160810 from the shaded jar.
[INFO] Excluding com.google.cloud:google-cloud-spanner:jar:0.20.0-beta from the shaded jar.
[INFO] Excluding com.google.api.grpc:proto-google-cloud-spanner-v1:jar:0.1.11 from the shaded jar.
[INFO] Excluding com.google.api.grpc:proto-google-cloud-spanner-admin-instance-v1:jar:0.1.11 from the shaded jar.
[INFO] Excluding com.google.api.grpc:grpc-google-cloud-spanner-v1:jar:0.1.11 from the shaded jar.
[INFO] Excluding com.google.api.grpc:grpc-google-cloud-spanner-admin-database-v1:jar:0.1.11 from the shaded jar.
[INFO] Excluding com.google.api.grpc:grpc-google-cloud-spanner-admin-instance-v1:jar:0.1.11 from the shaded jar.
[INFO] Excluding com.google.api.grpc:grpc-google-longrunning-v1:jar:0.1.11 from the shaded jar.
[INFO] Excluding com.google.api.grpc:proto-google-longrunning-v1:jar:0.1.11 from the shaded jar.
[INFO] Excluding com.google.cloud.bigtable:bigtable-protos:jar:1.0.0-pre3 from the shaded jar.
[INFO] Excluding com.google.cloud.bigtable:bigtable-client-core:jar:1.0.0 from the shaded jar.
[INFO] Excluding com.google.auth:google-auth-library-appengine:jar:0.7.0 from the shaded jar.
[INFO] Excluding io.opencensus:opencensus-contrib-grpc-util:jar:0.7.0 from the shaded jar.
[INFO] Excluding io.opencensus:opencensus-api:jar:0.7.0 from the shaded jar.
[INFO] Excluding io.dropwizard.metrics:metrics-core:jar:3.1.2 from the shaded jar.
[INFO] Excluding com.google.protobuf:protobuf-java:jar:3.2.0 from the shaded jar.
[INFO] Excluding io.netty:netty-tcnative-boringssl-static:jar:1.1.33.Fork26 from the shaded jar.
[INFO] Excluding com.google.api.grpc:proto-google-cloud-spanner-admin-database-v1:jar:0.1.9 from the shaded jar.
[INFO] Excluding com.google.api.grpc:proto-google-common-protos:jar:0.1.9 from the shaded jar.
[INFO] Excluding com.google.api-client:google-api-client:jar:1.22.0 from the shaded jar.
[INFO] Excluding com.google.oauth-client:google-oauth-client:jar:1.22.0 from the shaded jar.
[INFO] Excluding com.google.http-client:google-http-client:jar:1.22.0 from the shaded jar.
[INFO] Excluding org.apache.httpcomponents:httpclient:jar:4.0.1 from the shaded jar.
[INFO] Excluding org.apache.httpcomponents:httpcore:jar:4.0.1 from the shaded jar.
[INFO] Excluding commons-codec:commons-codec:jar:1.3 from the shaded jar.
[INFO] Excluding com.google.http-client:google-http-client-jackson2:jar:1.22.0 from the shaded jar.
[INFO] Excluding com.google.apis:google-api-services-dataflow:jar:v1b3-rev221-1.22.0 from the shaded jar.
[INFO] Excluding com.google.apis:google-api-services-clouddebugger:jar:v2-rev8-1.22.0 from the shaded jar.
[INFO] Excluding com.google.apis:google-api-services-storage:jar:v1-rev71-1.22.0 from the shaded jar.
[INFO] Excluding com.google.auth:google-auth-library-credentials:jar:0.7.1 from the shaded jar.
[INFO] Excluding com.google.auth:google-auth-library-oauth2-http:jar:0.7.1 from the shaded jar.
[INFO] Excluding com.google.cloud.bigdataoss:util:jar:1.4.5 from the shaded jar.
[INFO] Excluding com.google.api-client:google-api-client-java6:jar:1.22.0 from the shaded jar.
[INFO] Excluding com.google.api-client:google-api-client-jackson2:jar:1.22.0 from the shaded jar.
[INFO] Excluding com.google.oauth-client:google-oauth-client-java6:jar:1.22.0 from the shaded jar.
[INFO] Replacing original artifact with shaded artifact.
[INFO] Replacing <https://builds.apache.org/job/beam_PerformanceTests_JDBC/ws/runs/0671a66c/beam/sdks/java/io/jdbc/target/beam-sdks-java-io-jdbc-2.4.0-SNAPSHOT.jar> with <https://builds.apache.org/job/beam_PerformanceTests_JDBC/ws/runs/0671a66c/beam/sdks/java/io/jdbc/target/beam-sdks-java-io-jdbc-2.4.0-SNAPSHOT-shaded.jar>
[INFO] Replacing original test artifact with shaded test artifact.
[INFO] Replacing <https://builds.apache.org/job/beam_PerformanceTests_JDBC/ws/runs/0671a66c/beam/sdks/java/io/jdbc/target/beam-sdks-java-io-jdbc-2.4.0-SNAPSHOT-tests.jar> with <https://builds.apache.org/job/beam_PerformanceTests_JDBC/ws/runs/0671a66c/beam/sdks/java/io/jdbc/target/beam-sdks-java-io-jdbc-2.4.0-SNAPSHOT-shaded-tests.jar>
[INFO] Dependency-reduced POM written at: <https://builds.apache.org/job/beam_PerformanceTests_JDBC/ws/runs/0671a66c/beam/sdks/java/io/jdbc/dependency-reduced-pom.xml>
[INFO]
[INFO] --- maven-failsafe-plugin:2.20.1:integration-test (default) @ beam-sdks-java-io-jdbc ---
[INFO] Failsafe report directory: <https://builds.apache.org/job/beam_PerformanceTests_JDBC/ws/runs/0671a66c/beam/sdks/java/io/jdbc/target/failsafe-reports>
[INFO] parallel='all', perCoreThreadCount=true, threadCount=4, useUnlimitedThreads=false, threadCountSuites=0, threadCountClasses=0, threadCountMethods=0, parallelOptimized=true
[INFO]
[INFO] -------------------------------------------------------
[INFO] T E S T S
[INFO] -------------------------------------------------------
[INFO] Running org.apache.beam.sdk.io.jdbc.JdbcIOIT
[ERROR] Tests run: 1, Failures: 0, Errors: 1, Skipped: 0, Time elapsed: 0 s <<< FAILURE! - in org.apache.beam.sdk.io.jdbc.JdbcIOIT
[ERROR] org.apache.beam.sdk.io.jdbc.JdbcIOIT Time elapsed: 0 s <<< ERROR!
java.lang.IllegalArgumentException: expected one element but was: <10.36.0.11, 10.36.0.11>
at org.apache.beam.sdk.repackaged.com.google.common.collect.Iterators.getOnlyElement(Iterators.java:322)
at org.apache.beam.sdk.repackaged.com.google.common.collect.Iterables.getOnlyElement(Iterables.java:294)
at org.apache.beam.sdk.options.PipelineOptionsFactory.parseObjects(PipelineOptionsFactory.java:1655)
at org.apache.beam.sdk.options.PipelineOptionsFactory.access$400(PipelineOptionsFactory.java:107)
at org.apache.beam.sdk.options.PipelineOptionsFactory$Builder.as(PipelineOptionsFactory.java:294)
at org.apache.beam.sdk.testing.TestPipeline.testingPipelineOptions(TestPipeline.java:451)
at org.apache.beam.sdk.io.jdbc.JdbcIOIT.setup(JdbcIOIT.java:78)
at sun.reflect.NativeMethodAccessorImpl.invoke0(Native Method)
at sun.reflect.NativeMethodAccessorImpl.invoke(NativeMethodAccessorImpl.java:62)
at sun.reflect.DelegatingMethodAccessorImpl.invoke(DelegatingMethodAccessorImpl.java:43)
at java.lang.reflect.Method.invoke(Method.java:498)
at org.junit.runners.model.FrameworkMethod$1.runReflectiveCall(FrameworkMethod.java:50)
at org.junit.internal.runners.model.ReflectiveCallable.run(ReflectiveCallable.java:12)
at org.junit.runners.model.FrameworkMethod.invokeExplosively(FrameworkMethod.java:47)
at org.junit.internal.runners.statements.RunBefores.evaluate(RunBefores.java:24)
at org.junit.internal.runners.statements.RunAfters.evaluate(RunAfters.java:27)
at org.junit.runners.ParentRunner.run(ParentRunner.java:363)
at org.junit.runners.Suite.runChild(Suite.java:128)
at org.junit.runners.Suite.runChild(Suite.java:27)
at org.junit.runners.ParentRunner$3.run(ParentRunner.java:290)
at org.apache.maven.surefire.junitcore.pc.Scheduler$1.run(Scheduler.java:410)
at java.util.concurrent.Executors$RunnableAdapter.call(Executors.java:511)
at java.util.concurrent.FutureTask.run(FutureTask.java:266)
at java.util.concurrent.ThreadPoolExecutor.runWorker(ThreadPoolExecutor.java:1149)
at java.util.concurrent.ThreadPoolExecutor$Worker.run(ThreadPoolExecutor.java:624)
at java.lang.Thread.run(Thread.java:748)
[INFO]
[INFO] Results:
[INFO]
[ERROR] Errors:
[ERROR] JdbcIOIT.setup:78 IllegalArgument expected one element but was: <10.36.0.11,...
[INFO]
[ERROR] Tests run: 1, Failures: 0, Errors: 1, Skipped: 0
[INFO]
[INFO]
[INFO] --- maven-dependency-plugin:3.0.2:analyze-only (default) @ beam-sdks-java-io-jdbc ---
[INFO] No dependency problems found
[INFO]
[INFO] --- maven-failsafe-plugin:2.20.1:verify (default) @ beam-sdks-java-io-jdbc ---
[INFO] Failsafe report directory: <https://builds.apache.org/job/beam_PerformanceTests_JDBC/ws/runs/0671a66c/beam/sdks/java/io/jdbc/target/failsafe-reports>
[INFO] ------------------------------------------------------------------------
[INFO] BUILD FAILURE
[INFO] ------------------------------------------------------------------------
[INFO] Total time: 37.311 s
[INFO] Finished at: 2018-02-05T18:01:46Z
[INFO] Final Memory: 91M/1374M
[INFO] ------------------------------------------------------------------------
[ERROR] Failed to execute goal org.apache.maven.plugins:maven-failsafe-plugin:2.20.1:verify (default) on project beam-sdks-java-io-jdbc: There are test failures.
[ERROR]
[ERROR] Please refer to <https://builds.apache.org/job/beam_PerformanceTests_JDBC/ws/runs/0671a66c/beam/sdks/java/io/jdbc/target/failsafe-reports> for the individual test results.
[ERROR] Please refer to dump files (if any exist) [date]-jvmRun[N].dump, [date].dumpstream and [date]-jvmRun[N].dumpstream.
[ERROR] -> [Help 1]
org.apache.maven.lifecycle.LifecycleExecutionException: Failed to execute goal org.apache.maven.plugins:maven-failsafe-plugin:2.20.1:verify (default) on project beam-sdks-java-io-jdbc: There are test failures.
Please refer to <https://builds.apache.org/job/beam_PerformanceTests_JDBC/ws/runs/0671a66c/beam/sdks/java/io/jdbc/target/failsafe-reports> for the individual test results.
Please refer to dump files (if any exist) [date]-jvmRun[N].dump, [date].dumpstream and [date]-jvmRun[N].dumpstream.
at org.apache.maven.lifecycle.internal.MojoExecutor.execute (MojoExecutor.java:213)
at org.apache.maven.lifecycle.internal.MojoExecutor.execute (MojoExecutor.java:154)
at org.apache.maven.lifecycle.internal.MojoExecutor.execute (MojoExecutor.java:146)
at org.apache.maven.lifecycle.internal.LifecycleModuleBuilder.buildProject (LifecycleModuleBuilder.java:117)
at org.apache.maven.lifecycle.internal.LifecycleModuleBuilder.buildProject (LifecycleModuleBuilder.java:81)
at org.apache.maven.lifecycle.internal.builder.singlethreaded.SingleThreadedBuilder.build (SingleThreadedBuilder.java:51)
at org.apache.maven.lifecycle.internal.LifecycleStarter.execute (LifecycleStarter.java:128)
at org.apache.maven.DefaultMaven.doExecute (DefaultMaven.java:309)
at org.apache.maven.DefaultMaven.doExecute (DefaultMaven.java:194)
at org.apache.maven.DefaultMaven.execute (DefaultMaven.java:107)
at org.apache.maven.cli.MavenCli.execute (MavenCli.java:955)
at org.apache.maven.cli.MavenCli.doMain (MavenCli.java:290)
at org.apache.maven.cli.MavenCli.main (MavenCli.java:194)
at sun.reflect.NativeMethodAccessorImpl.invoke0 (Native Method)
at sun.reflect.NativeMethodAccessorImpl.invoke (NativeMethodAccessorImpl.java:62)
at sun.reflect.DelegatingMethodAccessorImpl.invoke (DelegatingMethodAccessorImpl.java:43)
at java.lang.reflect.Method.invoke (Method.java:498)
at org.codehaus.plexus.classworlds.launcher.Launcher.launchEnhanced (Launcher.java:289)
at org.codehaus.plexus.classworlds.launcher.Launcher.launch (Launcher.java:229)
at org.codehaus.plexus.classworlds.launcher.Launcher.mainWithExitCode (Launcher.java:415)
at org.codehaus.plexus.classworlds.launcher.Launcher.main (Launcher.java:356)
Caused by: org.apache.maven.plugin.MojoFailureException: There are test failures.
Please refer to <https://builds.apache.org/job/beam_PerformanceTests_JDBC/ws/runs/0671a66c/beam/sdks/java/io/jdbc/target/failsafe-reports> for the individual test results.
Please refer to dump files (if any exist) [date]-jvmRun[N].dump, [date].dumpstream and [date]-jvmRun[N].dumpstream.
at org.apache.maven.plugin.surefire.SurefireHelper.throwException (SurefireHelper.java:240)
at org.apache.maven.plugin.surefire.SurefireHelper.reportExecution (SurefireHelper.java:112)
at org.apache.maven.plugin.failsafe.VerifyMojo.execute (VerifyMojo.java:188)
at org.apache.maven.plugin.DefaultBuildPluginManager.executeMojo (DefaultBuildPluginManager.java:134)
at org.apache.maven.lifecycle.internal.MojoExecutor.execute (MojoExecutor.java:208)
at org.apache.maven.lifecycle.internal.MojoExecutor.execute (MojoExecutor.java:154)
at org.apache.maven.lifecycle.internal.MojoExecutor.execute (MojoExecutor.java:146)
at org.apache.maven.lifecycle.internal.LifecycleModuleBuilder.buildProject (LifecycleModuleBuilder.java:117)
at org.apache.maven.lifecycle.internal.LifecycleModuleBuilder.buildProject (LifecycleModuleBuilder.java:81)
at org.apache.maven.lifecycle.internal.builder.singlethreaded.SingleThreadedBuilder.build (SingleThreadedBuilder.java:51)
at org.apache.maven.lifecycle.internal.LifecycleStarter.execute (LifecycleStarter.java:128)
at org.apache.maven.DefaultMaven.doExecute (DefaultMaven.java:309)
at org.apache.maven.DefaultMaven.doExecute (DefaultMaven.java:194)
at org.apache.maven.DefaultMaven.execute (DefaultMaven.java:107)
at org.apache.maven.cli.MavenCli.execute (MavenCli.java:955)
at org.apache.maven.cli.MavenCli.doMain (MavenCli.java:290)
at org.apache.maven.cli.MavenCli.main (MavenCli.java:194)
at sun.reflect.NativeMethodAccessorImpl.invoke0 (Native Method)
at sun.reflect.NativeMethodAccessorImpl.invoke (NativeMethodAccessorImpl.java:62)
at sun.reflect.DelegatingMethodAccessorImpl.invoke (DelegatingMethodAccessorImpl.java:43)
at java.lang.reflect.Method.invoke (Method.java:498)
at org.codehaus.plexus.classworlds.launcher.Launcher.launchEnhanced (Launcher.java:289)
at org.codehaus.plexus.classworlds.launcher.Launcher.launch (Launcher.java:229)
at org.codehaus.plexus.classworlds.launcher.Launcher.mainWithExitCode (Launcher.java:415)
at org.codehaus.plexus.classworlds.launcher.Launcher.main (Launcher.java:356)
[ERROR]
[ERROR] Re-run Maven using the -X switch to enable full debug logging.
[ERROR]
[ERROR] For more information about the errors and possible solutions, please read the following articles:
[ERROR] [Help 1] http://cwiki.apache.org/confluence/display/MAVEN/MojoFailureException
STDERR:
2018-02-05 18:01:46,773 0671a66c MainThread beam_integration_benchmark(1/1) ERROR Error during benchmark beam_integration_benchmark
Traceback (most recent call last):
File "<https://builds.apache.org/job/beam_PerformanceTests_JDBC/ws/PerfKitBenchmarker/perfkitbenchmarker/pkb.py",> line 601, in RunBenchmark
DoRunPhase(spec, collector, detailed_timer)
File "<https://builds.apache.org/job/beam_PerformanceTests_JDBC/ws/PerfKitBenchmarker/perfkitbenchmarker/pkb.py",> line 504, in DoRunPhase
samples = spec.BenchmarkRun(spec)
File "<https://builds.apache.org/job/beam_PerformanceTests_JDBC/ws/PerfKitBenchmarker/perfkitbenchmarker/linux_benchmarks/beam_integration_benchmark.py",> line 159, in Run
job_type=job_type)
File "<https://builds.apache.org/job/beam_PerformanceTests_JDBC/ws/PerfKitBenchmarker/perfkitbenchmarker/providers/gcp/gcp_dpb_dataflow.py",> line 90, in SubmitJob
assert retcode == 0, "Integration Test Failed."
AssertionError: Integration Test Failed.
2018-02-05 18:01:46,773 0671a66c MainThread beam_integration_benchmark(1/1) INFO Cleaning up benchmark beam_integration_benchmark
2018-02-05 18:01:46,774 0671a66c MainThread beam_integration_benchmark(1/1) INFO Running: kubectl --kubeconfig=/home/jenkins/.kube/config delete -f <https://builds.apache.org/job/beam_PerformanceTests_JDBC/ws/src/.test-infra/kubernetes/postgres/postgres.yml>
2018-02-05 18:01:47,567 0671a66c MainThread beam_integration_benchmark(1/1) ERROR Benchmark 1/1 beam_integration_benchmark (UID: beam_integration_benchmark0) failed. Execution will continue.
2018-02-05 18:01:47,591 0671a66c MainThread INFO Benchmark run statuses:
---------------------------------------------------------------
Name UID Status
---------------------------------------------------------------
beam_integration_benchmark beam_integration_benchmark0 FAILED
---------------------------------------------------------------
Success rate: 0.00% (0/1)
2018-02-05 18:01:47,591 0671a66c MainThread INFO Complete logs can be found at: <https://builds.apache.org/job/beam_PerformanceTests_JDBC/ws/runs/0671a66c/pkb.log>
2018-02-05 18:01:47,592 0671a66c MainThread INFO Completion statuses can be found at: <https://builds.apache.org/job/beam_PerformanceTests_JDBC/ws/runs/0671a66c/completion_statuses.json>
Build step 'Execute shell' marked build as failure
Build failed in Jenkins: beam_PerformanceTests_JDBC #236
Posted by Apache Jenkins Server <je...@builds.apache.org>.
See <https://builds.apache.org/job/beam_PerformanceTests_JDBC/236/display/redirect>
------------------------------------------
[...truncated 52.95 KB...]
Error from server (AlreadyExists): error when creating "<https://builds.apache.org/job/beam_PerformanceTests_JDBC/ws/src/.test-infra/kubernetes/postgres/postgres.yml">: replicationcontrollers "postgres" already exists
2018-02-05 16:10:29,349 0f96c487 MainThread beam_integration_benchmark(1/1) INFO Retrying exception running IssueRetryableCommand: Command returned a non-zero exit code.
2018-02-05 16:10:48,322 0f96c487 MainThread beam_integration_benchmark(1/1) INFO Running: kubectl --kubeconfig=/home/jenkins/.kube/config create -f <https://builds.apache.org/job/beam_PerformanceTests_JDBC/ws/src/.test-infra/kubernetes/postgres/postgres.yml>
2018-02-05 16:10:48,497 0f96c487 MainThread beam_integration_benchmark(1/1) INFO Ran kubectl --kubeconfig=/home/jenkins/.kube/config create -f <https://builds.apache.org/job/beam_PerformanceTests_JDBC/ws/src/.test-infra/kubernetes/postgres/postgres.yml.> Got return code (1).
STDOUT:
STDERR: Error from server (Invalid): error when creating "<https://builds.apache.org/job/beam_PerformanceTests_JDBC/ws/src/.test-infra/kubernetes/postgres/postgres.yml">: Service "postgres" is invalid: spec.ports[0].nodePort: Invalid value: 31234: provided port is already allocated
Error from server (AlreadyExists): error when creating "<https://builds.apache.org/job/beam_PerformanceTests_JDBC/ws/src/.test-infra/kubernetes/postgres/postgres.yml">: replicationcontrollers "postgres" already exists
2018-02-05 16:10:48,498 0f96c487 MainThread beam_integration_benchmark(1/1) INFO Retrying exception running IssueRetryableCommand: Command returned a non-zero exit code.
2018-02-05 16:11:18,273 0f96c487 MainThread beam_integration_benchmark(1/1) INFO Running: kubectl --kubeconfig=/home/jenkins/.kube/config create -f <https://builds.apache.org/job/beam_PerformanceTests_JDBC/ws/src/.test-infra/kubernetes/postgres/postgres.yml>
2018-02-05 16:11:18,541 0f96c487 MainThread beam_integration_benchmark(1/1) INFO Ran kubectl --kubeconfig=/home/jenkins/.kube/config create -f <https://builds.apache.org/job/beam_PerformanceTests_JDBC/ws/src/.test-infra/kubernetes/postgres/postgres.yml.> Got return code (1).
STDOUT:
STDERR: Error from server (Invalid): error when creating "<https://builds.apache.org/job/beam_PerformanceTests_JDBC/ws/src/.test-infra/kubernetes/postgres/postgres.yml">: Service "postgres" is invalid: spec.ports[0].nodePort: Invalid value: 31234: provided port is already allocated
Error from server (AlreadyExists): error when creating "<https://builds.apache.org/job/beam_PerformanceTests_JDBC/ws/src/.test-infra/kubernetes/postgres/postgres.yml">: replicationcontrollers "postgres" already exists
2018-02-05 16:11:18,541 0f96c487 MainThread beam_integration_benchmark(1/1) INFO Retrying exception running IssueRetryableCommand: Command returned a non-zero exit code.
2018-02-05 16:11:46,415 0f96c487 MainThread beam_integration_benchmark(1/1) INFO Running: kubectl --kubeconfig=/home/jenkins/.kube/config create -f <https://builds.apache.org/job/beam_PerformanceTests_JDBC/ws/src/.test-infra/kubernetes/postgres/postgres.yml>
2018-02-05 16:11:46,582 0f96c487 MainThread beam_integration_benchmark(1/1) INFO Ran kubectl --kubeconfig=/home/jenkins/.kube/config create -f <https://builds.apache.org/job/beam_PerformanceTests_JDBC/ws/src/.test-infra/kubernetes/postgres/postgres.yml.> Got return code (1).
STDOUT:
STDERR: Error from server (Invalid): error when creating "<https://builds.apache.org/job/beam_PerformanceTests_JDBC/ws/src/.test-infra/kubernetes/postgres/postgres.yml">: Service "postgres" is invalid: spec.ports[0].nodePort: Invalid value: 31234: provided port is already allocated
Error from server (AlreadyExists): error when creating "<https://builds.apache.org/job/beam_PerformanceTests_JDBC/ws/src/.test-infra/kubernetes/postgres/postgres.yml">: replicationcontrollers "postgres" already exists
2018-02-05 16:11:46,582 0f96c487 MainThread beam_integration_benchmark(1/1) INFO Retrying exception running IssueRetryableCommand: Command returned a non-zero exit code.
2018-02-05 16:12:15,198 0f96c487 MainThread beam_integration_benchmark(1/1) INFO Running: kubectl --kubeconfig=/home/jenkins/.kube/config create -f <https://builds.apache.org/job/beam_PerformanceTests_JDBC/ws/src/.test-infra/kubernetes/postgres/postgres.yml>
2018-02-05 16:12:15,368 0f96c487 MainThread beam_integration_benchmark(1/1) INFO Ran kubectl --kubeconfig=/home/jenkins/.kube/config create -f <https://builds.apache.org/job/beam_PerformanceTests_JDBC/ws/src/.test-infra/kubernetes/postgres/postgres.yml.> Got return code (1).
STDOUT:
STDERR: Error from server (Invalid): error when creating "<https://builds.apache.org/job/beam_PerformanceTests_JDBC/ws/src/.test-infra/kubernetes/postgres/postgres.yml">: Service "postgres" is invalid: spec.ports[0].nodePort: Invalid value: 31234: provided port is already allocated
Error from server (AlreadyExists): error when creating "<https://builds.apache.org/job/beam_PerformanceTests_JDBC/ws/src/.test-infra/kubernetes/postgres/postgres.yml">: replicationcontrollers "postgres" already exists
2018-02-05 16:12:15,368 0f96c487 MainThread beam_integration_benchmark(1/1) INFO Retrying exception running IssueRetryableCommand: Command returned a non-zero exit code.
2018-02-05 16:12:34,354 0f96c487 MainThread beam_integration_benchmark(1/1) INFO Running: kubectl --kubeconfig=/home/jenkins/.kube/config create -f <https://builds.apache.org/job/beam_PerformanceTests_JDBC/ws/src/.test-infra/kubernetes/postgres/postgres.yml>
2018-02-05 16:12:34,522 0f96c487 MainThread beam_integration_benchmark(1/1) INFO Ran kubectl --kubeconfig=/home/jenkins/.kube/config create -f <https://builds.apache.org/job/beam_PerformanceTests_JDBC/ws/src/.test-infra/kubernetes/postgres/postgres.yml.> Got return code (1).
STDOUT:
STDERR: Error from server (Invalid): error when creating "<https://builds.apache.org/job/beam_PerformanceTests_JDBC/ws/src/.test-infra/kubernetes/postgres/postgres.yml">: Service "postgres" is invalid: spec.ports[0].nodePort: Invalid value: 31234: provided port is already allocated
Error from server (AlreadyExists): error when creating "<https://builds.apache.org/job/beam_PerformanceTests_JDBC/ws/src/.test-infra/kubernetes/postgres/postgres.yml">: replicationcontrollers "postgres" already exists
2018-02-05 16:12:34,523 0f96c487 MainThread beam_integration_benchmark(1/1) INFO Retrying exception running IssueRetryableCommand: Command returned a non-zero exit code.
2018-02-05 16:12:50,155 0f96c487 MainThread beam_integration_benchmark(1/1) INFO Running: kubectl --kubeconfig=/home/jenkins/.kube/config create -f <https://builds.apache.org/job/beam_PerformanceTests_JDBC/ws/src/.test-infra/kubernetes/postgres/postgres.yml>
2018-02-05 16:12:50,332 0f96c487 MainThread beam_integration_benchmark(1/1) INFO Ran kubectl --kubeconfig=/home/jenkins/.kube/config create -f <https://builds.apache.org/job/beam_PerformanceTests_JDBC/ws/src/.test-infra/kubernetes/postgres/postgres.yml.> Got return code (1).
STDOUT:
STDERR: Error from server (Invalid): error when creating "<https://builds.apache.org/job/beam_PerformanceTests_JDBC/ws/src/.test-infra/kubernetes/postgres/postgres.yml">: Service "postgres" is invalid: spec.ports[0].nodePort: Invalid value: 31234: provided port is already allocated
Error from server (AlreadyExists): error when creating "<https://builds.apache.org/job/beam_PerformanceTests_JDBC/ws/src/.test-infra/kubernetes/postgres/postgres.yml">: replicationcontrollers "postgres" already exists
2018-02-05 16:12:50,333 0f96c487 MainThread beam_integration_benchmark(1/1) INFO Retrying exception running IssueRetryableCommand: Command returned a non-zero exit code.
2018-02-05 16:13:16,864 0f96c487 MainThread beam_integration_benchmark(1/1) INFO Running: kubectl --kubeconfig=/home/jenkins/.kube/config create -f <https://builds.apache.org/job/beam_PerformanceTests_JDBC/ws/src/.test-infra/kubernetes/postgres/postgres.yml>
2018-02-05 16:13:17,024 0f96c487 MainThread beam_integration_benchmark(1/1) INFO Ran kubectl --kubeconfig=/home/jenkins/.kube/config create -f <https://builds.apache.org/job/beam_PerformanceTests_JDBC/ws/src/.test-infra/kubernetes/postgres/postgres.yml.> Got return code (1).
STDOUT:
STDERR: Error from server (Invalid): error when creating "<https://builds.apache.org/job/beam_PerformanceTests_JDBC/ws/src/.test-infra/kubernetes/postgres/postgres.yml">: Service "postgres" is invalid: spec.ports[0].nodePort: Invalid value: 31234: provided port is already allocated
Error from server (AlreadyExists): error when creating "<https://builds.apache.org/job/beam_PerformanceTests_JDBC/ws/src/.test-infra/kubernetes/postgres/postgres.yml">: replicationcontrollers "postgres" already exists
2018-02-05 16:13:17,025 0f96c487 MainThread beam_integration_benchmark(1/1) INFO Retrying exception running IssueRetryableCommand: Command returned a non-zero exit code.
2018-02-05 16:13:34,660 0f96c487 MainThread beam_integration_benchmark(1/1) INFO Running: kubectl --kubeconfig=/home/jenkins/.kube/config create -f <https://builds.apache.org/job/beam_PerformanceTests_JDBC/ws/src/.test-infra/kubernetes/postgres/postgres.yml>
2018-02-05 16:13:34,836 0f96c487 MainThread beam_integration_benchmark(1/1) INFO Ran kubectl --kubeconfig=/home/jenkins/.kube/config create -f <https://builds.apache.org/job/beam_PerformanceTests_JDBC/ws/src/.test-infra/kubernetes/postgres/postgres.yml.> Got return code (1).
STDOUT:
STDERR: Error from server (Invalid): error when creating "<https://builds.apache.org/job/beam_PerformanceTests_JDBC/ws/src/.test-infra/kubernetes/postgres/postgres.yml">: Service "postgres" is invalid: spec.ports[0].nodePort: Invalid value: 31234: provided port is already allocated
Error from server (AlreadyExists): error when creating "<https://builds.apache.org/job/beam_PerformanceTests_JDBC/ws/src/.test-infra/kubernetes/postgres/postgres.yml">: replicationcontrollers "postgres" already exists
2018-02-05 16:13:34,836 0f96c487 MainThread beam_integration_benchmark(1/1) INFO Retrying exception running IssueRetryableCommand: Command returned a non-zero exit code.
2018-02-05 16:13:52,203 0f96c487 MainThread beam_integration_benchmark(1/1) INFO Running: kubectl --kubeconfig=/home/jenkins/.kube/config create -f <https://builds.apache.org/job/beam_PerformanceTests_JDBC/ws/src/.test-infra/kubernetes/postgres/postgres.yml>
2018-02-05 16:13:52,362 0f96c487 MainThread beam_integration_benchmark(1/1) INFO Ran kubectl --kubeconfig=/home/jenkins/.kube/config create -f <https://builds.apache.org/job/beam_PerformanceTests_JDBC/ws/src/.test-infra/kubernetes/postgres/postgres.yml.> Got return code (1).
STDOUT:
STDERR: Error from server (Invalid): error when creating "<https://builds.apache.org/job/beam_PerformanceTests_JDBC/ws/src/.test-infra/kubernetes/postgres/postgres.yml">: Service "postgres" is invalid: spec.ports[0].nodePort: Invalid value: 31234: provided port is already allocated
Error from server (AlreadyExists): error when creating "<https://builds.apache.org/job/beam_PerformanceTests_JDBC/ws/src/.test-infra/kubernetes/postgres/postgres.yml">: replicationcontrollers "postgres" already exists
2018-02-05 16:13:52,362 0f96c487 MainThread beam_integration_benchmark(1/1) INFO Retrying exception running IssueRetryableCommand: Command returned a non-zero exit code.
2018-02-05 16:14:20,486 0f96c487 MainThread beam_integration_benchmark(1/1) INFO Running: kubectl --kubeconfig=/home/jenkins/.kube/config create -f <https://builds.apache.org/job/beam_PerformanceTests_JDBC/ws/src/.test-infra/kubernetes/postgres/postgres.yml>
2018-02-05 16:14:20,681 0f96c487 MainThread beam_integration_benchmark(1/1) INFO Ran kubectl --kubeconfig=/home/jenkins/.kube/config create -f <https://builds.apache.org/job/beam_PerformanceTests_JDBC/ws/src/.test-infra/kubernetes/postgres/postgres.yml.> Got return code (1).
STDOUT:
STDERR: Error from server (Invalid): error when creating "<https://builds.apache.org/job/beam_PerformanceTests_JDBC/ws/src/.test-infra/kubernetes/postgres/postgres.yml">: Service "postgres" is invalid: spec.ports[0].nodePort: Invalid value: 31234: provided port is already allocated
Error from server (AlreadyExists): error when creating "<https://builds.apache.org/job/beam_PerformanceTests_JDBC/ws/src/.test-infra/kubernetes/postgres/postgres.yml">: replicationcontrollers "postgres" already exists
2018-02-05 16:14:20,682 0f96c487 MainThread beam_integration_benchmark(1/1) INFO Retrying exception running IssueRetryableCommand: Command returned a non-zero exit code.
2018-02-05 16:14:43,922 0f96c487 MainThread beam_integration_benchmark(1/1) INFO Running: kubectl --kubeconfig=/home/jenkins/.kube/config create -f <https://builds.apache.org/job/beam_PerformanceTests_JDBC/ws/src/.test-infra/kubernetes/postgres/postgres.yml>
2018-02-05 16:14:44,101 0f96c487 MainThread beam_integration_benchmark(1/1) INFO Ran kubectl --kubeconfig=/home/jenkins/.kube/config create -f <https://builds.apache.org/job/beam_PerformanceTests_JDBC/ws/src/.test-infra/kubernetes/postgres/postgres.yml.> Got return code (1).
STDOUT:
STDERR: Error from server (Invalid): error when creating "<https://builds.apache.org/job/beam_PerformanceTests_JDBC/ws/src/.test-infra/kubernetes/postgres/postgres.yml">: Service "postgres" is invalid: spec.ports[0].nodePort: Invalid value: 31234: provided port is already allocated
Error from server (AlreadyExists): error when creating "<https://builds.apache.org/job/beam_PerformanceTests_JDBC/ws/src/.test-infra/kubernetes/postgres/postgres.yml">: replicationcontrollers "postgres" already exists
2018-02-05 16:14:44,101 0f96c487 MainThread beam_integration_benchmark(1/1) INFO Retrying exception running IssueRetryableCommand: Command returned a non-zero exit code.
2018-02-05 16:15:11,705 0f96c487 MainThread beam_integration_benchmark(1/1) INFO Running: kubectl --kubeconfig=/home/jenkins/.kube/config create -f <https://builds.apache.org/job/beam_PerformanceTests_JDBC/ws/src/.test-infra/kubernetes/postgres/postgres.yml>
2018-02-05 16:15:11,872 0f96c487 MainThread beam_integration_benchmark(1/1) INFO Ran kubectl --kubeconfig=/home/jenkins/.kube/config create -f <https://builds.apache.org/job/beam_PerformanceTests_JDBC/ws/src/.test-infra/kubernetes/postgres/postgres.yml.> Got return code (1).
STDOUT:
STDERR: Error from server (Invalid): error when creating "<https://builds.apache.org/job/beam_PerformanceTests_JDBC/ws/src/.test-infra/kubernetes/postgres/postgres.yml">: Service "postgres" is invalid: spec.ports[0].nodePort: Invalid value: 31234: provided port is already allocated
Error from server (AlreadyExists): error when creating "<https://builds.apache.org/job/beam_PerformanceTests_JDBC/ws/src/.test-infra/kubernetes/postgres/postgres.yml">: replicationcontrollers "postgres" already exists
2018-02-05 16:15:11,872 0f96c487 MainThread beam_integration_benchmark(1/1) INFO Retrying exception running IssueRetryableCommand: Command returned a non-zero exit code.
2018-02-05 16:15:32,247 0f96c487 MainThread beam_integration_benchmark(1/1) INFO Running: kubectl --kubeconfig=/home/jenkins/.kube/config create -f <https://builds.apache.org/job/beam_PerformanceTests_JDBC/ws/src/.test-infra/kubernetes/postgres/postgres.yml>
2018-02-05 16:15:32,411 0f96c487 MainThread beam_integration_benchmark(1/1) INFO Ran kubectl --kubeconfig=/home/jenkins/.kube/config create -f <https://builds.apache.org/job/beam_PerformanceTests_JDBC/ws/src/.test-infra/kubernetes/postgres/postgres.yml.> Got return code (1).
STDOUT:
STDERR: Error from server (Invalid): error when creating "<https://builds.apache.org/job/beam_PerformanceTests_JDBC/ws/src/.test-infra/kubernetes/postgres/postgres.yml">: Service "postgres" is invalid: spec.ports[0].nodePort: Invalid value: 31234: provided port is already allocated
Error from server (AlreadyExists): error when creating "<https://builds.apache.org/job/beam_PerformanceTests_JDBC/ws/src/.test-infra/kubernetes/postgres/postgres.yml">: replicationcontrollers "postgres" already exists
2018-02-05 16:15:32,411 0f96c487 MainThread beam_integration_benchmark(1/1) INFO Retrying exception running IssueRetryableCommand: Command returned a non-zero exit code.
2018-02-05 16:16:02,202 0f96c487 MainThread beam_integration_benchmark(1/1) INFO Running: kubectl --kubeconfig=/home/jenkins/.kube/config create -f <https://builds.apache.org/job/beam_PerformanceTests_JDBC/ws/src/.test-infra/kubernetes/postgres/postgres.yml>
2018-02-05 16:16:02,378 0f96c487 MainThread beam_integration_benchmark(1/1) INFO Ran kubectl --kubeconfig=/home/jenkins/.kube/config create -f <https://builds.apache.org/job/beam_PerformanceTests_JDBC/ws/src/.test-infra/kubernetes/postgres/postgres.yml.> Got return code (1).
STDOUT:
STDERR: Error from server (Invalid): error when creating "<https://builds.apache.org/job/beam_PerformanceTests_JDBC/ws/src/.test-infra/kubernetes/postgres/postgres.yml">: Service "postgres" is invalid: spec.ports[0].nodePort: Invalid value: 31234: provided port is already allocated
Error from server (AlreadyExists): error when creating "<https://builds.apache.org/job/beam_PerformanceTests_JDBC/ws/src/.test-infra/kubernetes/postgres/postgres.yml">: replicationcontrollers "postgres" already exists
2018-02-05 16:16:02,378 0f96c487 MainThread beam_integration_benchmark(1/1) INFO Retrying exception running IssueRetryableCommand: Command returned a non-zero exit code.
2018-02-05 16:16:23,911 0f96c487 MainThread beam_integration_benchmark(1/1) INFO Running: kubectl --kubeconfig=/home/jenkins/.kube/config create -f <https://builds.apache.org/job/beam_PerformanceTests_JDBC/ws/src/.test-infra/kubernetes/postgres/postgres.yml>
2018-02-05 16:16:24,082 0f96c487 MainThread beam_integration_benchmark(1/1) INFO Ran kubectl --kubeconfig=/home/jenkins/.kube/config create -f <https://builds.apache.org/job/beam_PerformanceTests_JDBC/ws/src/.test-infra/kubernetes/postgres/postgres.yml.> Got return code (1).
STDOUT:
STDERR: Error from server (Invalid): error when creating "<https://builds.apache.org/job/beam_PerformanceTests_JDBC/ws/src/.test-infra/kubernetes/postgres/postgres.yml">: Service "postgres" is invalid: spec.ports[0].nodePort: Invalid value: 31234: provided port is already allocated
Error from server (AlreadyExists): error when creating "<https://builds.apache.org/job/beam_PerformanceTests_JDBC/ws/src/.test-infra/kubernetes/postgres/postgres.yml">: replicationcontrollers "postgres" already exists
2018-02-05 16:16:24,082 0f96c487 MainThread beam_integration_benchmark(1/1) INFO Retrying exception running IssueRetryableCommand: Command returned a non-zero exit code.
2018-02-05 16:16:49,327 0f96c487 MainThread beam_integration_benchmark(1/1) INFO Running: kubectl --kubeconfig=/home/jenkins/.kube/config create -f <https://builds.apache.org/job/beam_PerformanceTests_JDBC/ws/src/.test-infra/kubernetes/postgres/postgres.yml>
2018-02-05 16:16:49,496 0f96c487 MainThread beam_integration_benchmark(1/1) INFO Ran kubectl --kubeconfig=/home/jenkins/.kube/config create -f <https://builds.apache.org/job/beam_PerformanceTests_JDBC/ws/src/.test-infra/kubernetes/postgres/postgres.yml.> Got return code (1).
STDOUT:
STDERR: Error from server (Invalid): error when creating "<https://builds.apache.org/job/beam_PerformanceTests_JDBC/ws/src/.test-infra/kubernetes/postgres/postgres.yml">: Service "postgres" is invalid: spec.ports[0].nodePort: Invalid value: 31234: provided port is already allocated
Error from server (AlreadyExists): error when creating "<https://builds.apache.org/job/beam_PerformanceTests_JDBC/ws/src/.test-infra/kubernetes/postgres/postgres.yml">: replicationcontrollers "postgres" already exists
2018-02-05 16:16:49,496 0f96c487 MainThread beam_integration_benchmark(1/1) INFO Retrying exception running IssueRetryableCommand: Command returned a non-zero exit code.
2018-02-05 16:17:15,908 0f96c487 MainThread beam_integration_benchmark(1/1) INFO Running: kubectl --kubeconfig=/home/jenkins/.kube/config create -f <https://builds.apache.org/job/beam_PerformanceTests_JDBC/ws/src/.test-infra/kubernetes/postgres/postgres.yml>
2018-02-05 16:17:16,070 0f96c487 MainThread beam_integration_benchmark(1/1) INFO Ran kubectl --kubeconfig=/home/jenkins/.kube/config create -f <https://builds.apache.org/job/beam_PerformanceTests_JDBC/ws/src/.test-infra/kubernetes/postgres/postgres.yml.> Got return code (1).
STDOUT:
STDERR: Error from server (Invalid): error when creating "<https://builds.apache.org/job/beam_PerformanceTests_JDBC/ws/src/.test-infra/kubernetes/postgres/postgres.yml">: Service "postgres" is invalid: spec.ports[0].nodePort: Invalid value: 31234: provided port is already allocated
Error from server (AlreadyExists): error when creating "<https://builds.apache.org/job/beam_PerformanceTests_JDBC/ws/src/.test-infra/kubernetes/postgres/postgres.yml">: replicationcontrollers "postgres" already exists
2018-02-05 16:17:16,071 0f96c487 MainThread beam_integration_benchmark(1/1) INFO Retrying exception running IssueRetryableCommand: Command returned a non-zero exit code.
2018-02-05 16:17:33,514 0f96c487 MainThread beam_integration_benchmark(1/1) INFO Running: kubectl --kubeconfig=/home/jenkins/.kube/config create -f <https://builds.apache.org/job/beam_PerformanceTests_JDBC/ws/src/.test-infra/kubernetes/postgres/postgres.yml>
2018-02-05 16:17:33,728 0f96c487 MainThread beam_integration_benchmark(1/1) INFO Ran kubectl --kubeconfig=/home/jenkins/.kube/config create -f <https://builds.apache.org/job/beam_PerformanceTests_JDBC/ws/src/.test-infra/kubernetes/postgres/postgres.yml.> Got return code (1).
STDOUT:
STDERR: Error from server (Invalid): error when creating "<https://builds.apache.org/job/beam_PerformanceTests_JDBC/ws/src/.test-infra/kubernetes/postgres/postgres.yml">: Service "postgres" is invalid: spec.ports[0].nodePort: Invalid value: 31234: provided port is already allocated
Error from server (AlreadyExists): error when creating "<https://builds.apache.org/job/beam_PerformanceTests_JDBC/ws/src/.test-infra/kubernetes/postgres/postgres.yml">: replicationcontrollers "postgres" already exists
2018-02-05 16:17:33,729 0f96c487 MainThread beam_integration_benchmark(1/1) INFO Retrying exception running IssueRetryableCommand: Command returned a non-zero exit code.
2018-02-05 16:17:49,093 0f96c487 MainThread beam_integration_benchmark(1/1) INFO Running: kubectl --kubeconfig=/home/jenkins/.kube/config create -f <https://builds.apache.org/job/beam_PerformanceTests_JDBC/ws/src/.test-infra/kubernetes/postgres/postgres.yml>
2018-02-05 16:17:49,256 0f96c487 MainThread beam_integration_benchmark(1/1) INFO Ran kubectl --kubeconfig=/home/jenkins/.kube/config create -f <https://builds.apache.org/job/beam_PerformanceTests_JDBC/ws/src/.test-infra/kubernetes/postgres/postgres.yml.> Got return code (1).
STDOUT:
STDERR: Error from server (Invalid): error when creating "<https://builds.apache.org/job/beam_PerformanceTests_JDBC/ws/src/.test-infra/kubernetes/postgres/postgres.yml">: Service "postgres" is invalid: spec.ports[0].nodePort: Invalid value: 31234: provided port is already allocated
Error from server (AlreadyExists): error when creating "<https://builds.apache.org/job/beam_PerformanceTests_JDBC/ws/src/.test-infra/kubernetes/postgres/postgres.yml">: replicationcontrollers "postgres" already exists
2018-02-05 16:17:49,256 0f96c487 MainThread beam_integration_benchmark(1/1) INFO Retrying exception running IssueRetryableCommand: Command returned a non-zero exit code.
2018-02-05 16:18:11,165 0f96c487 MainThread beam_integration_benchmark(1/1) INFO Running: kubectl --kubeconfig=/home/jenkins/.kube/config create -f <https://builds.apache.org/job/beam_PerformanceTests_JDBC/ws/src/.test-infra/kubernetes/postgres/postgres.yml>
2018-02-05 16:18:11,327 0f96c487 MainThread beam_integration_benchmark(1/1) INFO Ran kubectl --kubeconfig=/home/jenkins/.kube/config create -f <https://builds.apache.org/job/beam_PerformanceTests_JDBC/ws/src/.test-infra/kubernetes/postgres/postgres.yml.> Got return code (1).
STDOUT:
STDERR: Error from server (Invalid): error when creating "<https://builds.apache.org/job/beam_PerformanceTests_JDBC/ws/src/.test-infra/kubernetes/postgres/postgres.yml">: Service "postgres" is invalid: spec.ports[0].nodePort: Invalid value: 31234: provided port is already allocated
Error from server (AlreadyExists): error when creating "<https://builds.apache.org/job/beam_PerformanceTests_JDBC/ws/src/.test-infra/kubernetes/postgres/postgres.yml">: replicationcontrollers "postgres" already exists
2018-02-05 16:18:11,327 0f96c487 MainThread beam_integration_benchmark(1/1) INFO Retrying exception running IssueRetryableCommand: Command returned a non-zero exit code.
2018-02-05 16:18:40,944 0f96c487 MainThread beam_integration_benchmark(1/1) INFO Running: kubectl --kubeconfig=/home/jenkins/.kube/config create -f <https://builds.apache.org/job/beam_PerformanceTests_JDBC/ws/src/.test-infra/kubernetes/postgres/postgres.yml>
2018-02-05 16:18:41,110 0f96c487 MainThread beam_integration_benchmark(1/1) INFO Ran kubectl --kubeconfig=/home/jenkins/.kube/config create -f <https://builds.apache.org/job/beam_PerformanceTests_JDBC/ws/src/.test-infra/kubernetes/postgres/postgres.yml.> Got return code (1).
STDOUT:
STDERR: Error from server (Invalid): error when creating "<https://builds.apache.org/job/beam_PerformanceTests_JDBC/ws/src/.test-infra/kubernetes/postgres/postgres.yml">: Service "postgres" is invalid: spec.ports[0].nodePort: Invalid value: 31234: provided port is already allocated
Error from server (AlreadyExists): error when creating "<https://builds.apache.org/job/beam_PerformanceTests_JDBC/ws/src/.test-infra/kubernetes/postgres/postgres.yml">: replicationcontrollers "postgres" already exists
2018-02-05 16:18:41,111 0f96c487 MainThread beam_integration_benchmark(1/1) INFO Retrying exception running IssueRetryableCommand: Command returned a non-zero exit code.
2018-02-05 16:19:09,295 0f96c487 MainThread beam_integration_benchmark(1/1) INFO Running: kubectl --kubeconfig=/home/jenkins/.kube/config create -f <https://builds.apache.org/job/beam_PerformanceTests_JDBC/ws/src/.test-infra/kubernetes/postgres/postgres.yml>
2018-02-05 16:19:09,461 0f96c487 MainThread beam_integration_benchmark(1/1) INFO Ran kubectl --kubeconfig=/home/jenkins/.kube/config create -f <https://builds.apache.org/job/beam_PerformanceTests_JDBC/ws/src/.test-infra/kubernetes/postgres/postgres.yml.> Got return code (1).
STDOUT:
STDERR: Error from server (Invalid): error when creating "<https://builds.apache.org/job/beam_PerformanceTests_JDBC/ws/src/.test-infra/kubernetes/postgres/postgres.yml">: Service "postgres" is invalid: spec.ports[0].nodePort: Invalid value: 31234: provided port is already allocated
Error from server (AlreadyExists): error when creating "<https://builds.apache.org/job/beam_PerformanceTests_JDBC/ws/src/.test-infra/kubernetes/postgres/postgres.yml">: replicationcontrollers "postgres" already exists
2018-02-05 16:19:09,461 0f96c487 MainThread beam_integration_benchmark(1/1) INFO Retrying exception running IssueRetryableCommand: Command returned a non-zero exit code.
2018-02-05 16:19:31,609 0f96c487 MainThread beam_integration_benchmark(1/1) INFO Running: kubectl --kubeconfig=/home/jenkins/.kube/config create -f <https://builds.apache.org/job/beam_PerformanceTests_JDBC/ws/src/.test-infra/kubernetes/postgres/postgres.yml>
2018-02-05 16:19:31,772 0f96c487 MainThread beam_integration_benchmark(1/1) INFO Ran kubectl --kubeconfig=/home/jenkins/.kube/config create -f <https://builds.apache.org/job/beam_PerformanceTests_JDBC/ws/src/.test-infra/kubernetes/postgres/postgres.yml.> Got return code (1).
STDOUT:
STDERR: Error from server (Invalid): error when creating "<https://builds.apache.org/job/beam_PerformanceTests_JDBC/ws/src/.test-infra/kubernetes/postgres/postgres.yml">: Service "postgres" is invalid: spec.ports[0].nodePort: Invalid value: 31234: provided port is already allocated
Error from server (AlreadyExists): error when creating "<https://builds.apache.org/job/beam_PerformanceTests_JDBC/ws/src/.test-infra/kubernetes/postgres/postgres.yml">: replicationcontrollers "postgres" already exists
2018-02-05 16:19:31,772 0f96c487 MainThread beam_integration_benchmark(1/1) INFO Retrying exception running IssueRetryableCommand: Command returned a non-zero exit code.
2018-02-05 16:19:54,048 0f96c487 MainThread beam_integration_benchmark(1/1) INFO Running: kubectl --kubeconfig=/home/jenkins/.kube/config create -f <https://builds.apache.org/job/beam_PerformanceTests_JDBC/ws/src/.test-infra/kubernetes/postgres/postgres.yml>
2018-02-05 16:19:54,220 0f96c487 MainThread beam_integration_benchmark(1/1) INFO Ran kubectl --kubeconfig=/home/jenkins/.kube/config create -f <https://builds.apache.org/job/beam_PerformanceTests_JDBC/ws/src/.test-infra/kubernetes/postgres/postgres.yml.> Got return code (1).
STDOUT:
STDERR: Error from server (Invalid): error when creating "<https://builds.apache.org/job/beam_PerformanceTests_JDBC/ws/src/.test-infra/kubernetes/postgres/postgres.yml">: Service "postgres" is invalid: spec.ports[0].nodePort: Invalid value: 31234: provided port is already allocated
Error from server (AlreadyExists): error when creating "<https://builds.apache.org/job/beam_PerformanceTests_JDBC/ws/src/.test-infra/kubernetes/postgres/postgres.yml">: replicationcontrollers "postgres" already exists
2018-02-05 16:19:54,220 0f96c487 MainThread beam_integration_benchmark(1/1) INFO Retrying exception running IssueRetryableCommand: Command returned a non-zero exit code.
2018-02-05 16:20:09,270 0f96c487 MainThread beam_integration_benchmark(1/1) INFO Running: kubectl --kubeconfig=/home/jenkins/.kube/config create -f <https://builds.apache.org/job/beam_PerformanceTests_JDBC/ws/src/.test-infra/kubernetes/postgres/postgres.yml>
2018-02-05 16:20:09,439 0f96c487 MainThread beam_integration_benchmark(1/1) INFO Ran kubectl --kubeconfig=/home/jenkins/.kube/config create -f <https://builds.apache.org/job/beam_PerformanceTests_JDBC/ws/src/.test-infra/kubernetes/postgres/postgres.yml.> Got return code (1).
STDOUT:
STDERR: Error from server (Invalid): error when creating "<https://builds.apache.org/job/beam_PerformanceTests_JDBC/ws/src/.test-infra/kubernetes/postgres/postgres.yml">: Service "postgres" is invalid: spec.ports[0].nodePort: Invalid value: 31234: provided port is already allocated
Error from server (AlreadyExists): error when creating "<https://builds.apache.org/job/beam_PerformanceTests_JDBC/ws/src/.test-infra/kubernetes/postgres/postgres.yml">: replicationcontrollers "postgres" already exists
2018-02-05 16:20:09,439 0f96c487 MainThread beam_integration_benchmark(1/1) INFO Retrying exception running IssueRetryableCommand: Command returned a non-zero exit code.
2018-02-05 16:20:35,822 0f96c487 MainThread beam_integration_benchmark(1/1) INFO Running: kubectl --kubeconfig=/home/jenkins/.kube/config create -f <https://builds.apache.org/job/beam_PerformanceTests_JDBC/ws/src/.test-infra/kubernetes/postgres/postgres.yml>
2018-02-05 16:20:35,985 0f96c487 MainThread beam_integration_benchmark(1/1) INFO Ran kubectl --kubeconfig=/home/jenkins/.kube/config create -f <https://builds.apache.org/job/beam_PerformanceTests_JDBC/ws/src/.test-infra/kubernetes/postgres/postgres.yml.> Got return code (1).
STDOUT:
STDERR: Error from server (Invalid): error when creating "<https://builds.apache.org/job/beam_PerformanceTests_JDBC/ws/src/.test-infra/kubernetes/postgres/postgres.yml">: Service "postgres" is invalid: spec.ports[0].nodePort: Invalid value: 31234: provided port is already allocated
Error from server (AlreadyExists): error when creating "<https://builds.apache.org/job/beam_PerformanceTests_JDBC/ws/src/.test-infra/kubernetes/postgres/postgres.yml">: replicationcontrollers "postgres" already exists
2018-02-05 16:20:35,985 0f96c487 MainThread beam_integration_benchmark(1/1) INFO Retrying exception running IssueRetryableCommand: Command returned a non-zero exit code.
2018-02-05 16:21:02,535 0f96c487 MainThread beam_integration_benchmark(1/1) INFO Running: kubectl --kubeconfig=/home/jenkins/.kube/config create -f <https://builds.apache.org/job/beam_PerformanceTests_JDBC/ws/src/.test-infra/kubernetes/postgres/postgres.yml>
2018-02-05 16:21:02,693 0f96c487 MainThread beam_integration_benchmark(1/1) INFO Ran kubectl --kubeconfig=/home/jenkins/.kube/config create -f <https://builds.apache.org/job/beam_PerformanceTests_JDBC/ws/src/.test-infra/kubernetes/postgres/postgres.yml.> Got return code (1).
STDOUT:
STDERR: Error from server (Invalid): error when creating "<https://builds.apache.org/job/beam_PerformanceTests_JDBC/ws/src/.test-infra/kubernetes/postgres/postgres.yml">: Service "postgres" is invalid: spec.ports[0].nodePort: Invalid value: 31234: provided port is already allocated
Error from server (AlreadyExists): error when creating "<https://builds.apache.org/job/beam_PerformanceTests_JDBC/ws/src/.test-infra/kubernetes/postgres/postgres.yml">: replicationcontrollers "postgres" already exists
2018-02-05 16:21:02,694 0f96c487 MainThread beam_integration_benchmark(1/1) ERROR Error during benchmark beam_integration_benchmark
Traceback (most recent call last):
File "<https://builds.apache.org/job/beam_PerformanceTests_JDBC/ws/PerfKitBenchmarker/perfkitbenchmarker/pkb.py",> line 597, in RunBenchmark
DoPreparePhase(spec, detailed_timer)
File "<https://builds.apache.org/job/beam_PerformanceTests_JDBC/ws/PerfKitBenchmarker/perfkitbenchmarker/pkb.py",> line 481, in DoPreparePhase
spec.BenchmarkPrepare(spec)
File "<https://builds.apache.org/job/beam_PerformanceTests_JDBC/ws/PerfKitBenchmarker/perfkitbenchmarker/linux_benchmarks/beam_integration_benchmark.py",> line 109, in Prepare
kubernetes_helper.CreateAllFiles(getKubernetesScripts())
File "<https://builds.apache.org/job/beam_PerformanceTests_JDBC/ws/PerfKitBenchmarker/perfkitbenchmarker/kubernetes_helper.py",> line 54, in CreateAllFiles
CreateFromFile(file)
File "<https://builds.apache.org/job/beam_PerformanceTests_JDBC/ws/PerfKitBenchmarker/perfkitbenchmarker/kubernetes_helper.py",> line 37, in CreateFromFile
vm_util.IssueRetryableCommand(create_cmd)
File "<https://builds.apache.org/job/beam_PerformanceTests_JDBC/ws/PerfKitBenchmarker/perfkitbenchmarker/vm_util.py",> line 247, in WrappedFunction
return f(*args, **kwargs)
File "<https://builds.apache.org/job/beam_PerformanceTests_JDBC/ws/PerfKitBenchmarker/perfkitbenchmarker/vm_util.py",> line 364, in IssueRetryableCommand
'Command returned a non-zero exit code.\n')
CalledProcessException: Command returned a non-zero exit code.
2018-02-05 16:21:02,695 0f96c487 MainThread beam_integration_benchmark(1/1) INFO Cleaning up benchmark beam_integration_benchmark
2018-02-05 16:21:02,695 0f96c487 MainThread beam_integration_benchmark(1/1) INFO Running: kubectl --kubeconfig=/home/jenkins/.kube/config delete -f <https://builds.apache.org/job/beam_PerformanceTests_JDBC/ws/src/.test-infra/kubernetes/postgres/postgres.yml>
2018-02-05 16:21:03,174 0f96c487 MainThread beam_integration_benchmark(1/1) ERROR Benchmark 1/1 beam_integration_benchmark (UID: beam_integration_benchmark0) failed. Execution will continue.
2018-02-05 16:21:03,181 0f96c487 MainThread INFO Benchmark run statuses:
---------------------------------------------------------------
Name UID Status
---------------------------------------------------------------
beam_integration_benchmark beam_integration_benchmark0 FAILED
---------------------------------------------------------------
Success rate: 0.00% (0/1)
2018-02-05 16:21:03,182 0f96c487 MainThread INFO Complete logs can be found at: <https://builds.apache.org/job/beam_PerformanceTests_JDBC/ws/runs/0f96c487/pkb.log>
2018-02-05 16:21:03,182 0f96c487 MainThread INFO Completion statuses can be found at: <https://builds.apache.org/job/beam_PerformanceTests_JDBC/ws/runs/0f96c487/completion_statuses.json>
Build step 'Execute shell' marked build as failure
Build failed in Jenkins: beam_PerformanceTests_JDBC #235
Posted by Apache Jenkins Server <je...@builds.apache.org>.
See <https://builds.apache.org/job/beam_PerformanceTests_JDBC/235/display/redirect>
------------------------------------------
[...truncated 85.13 KB...]
2018-02-05 15:47:50,986 14bbe231 MainThread beam_integration_benchmark(1/1) INFO Retrying exception running IssueRetryableCommand: Command returned a non-zero exit code.
2018-02-05 15:48:06,720 14bbe231 MainThread beam_integration_benchmark(1/1) INFO Running: kubectl --kubeconfig=/home/jenkins/.kube/config delete -f <https://builds.apache.org/job/beam_PerformanceTests_JDBC/ws/.test-infra/kubernetes/postgres/postgres.yml>
2018-02-05 15:48:06,812 14bbe231 MainThread beam_integration_benchmark(1/1) INFO Ran kubectl --kubeconfig=/home/jenkins/.kube/config delete -f <https://builds.apache.org/job/beam_PerformanceTests_JDBC/ws/.test-infra/kubernetes/postgres/postgres.yml.> Got return code (1).
STDOUT:
STDERR: error: the path "<https://builds.apache.org/job/beam_PerformanceTests_JDBC/ws/.test-infra/kubernetes/postgres/postgres.yml"> does not exist
2018-02-05 15:48:06,812 14bbe231 MainThread beam_integration_benchmark(1/1) INFO Retrying exception running IssueRetryableCommand: Command returned a non-zero exit code.
2018-02-05 15:48:31,687 14bbe231 MainThread beam_integration_benchmark(1/1) INFO Running: kubectl --kubeconfig=/home/jenkins/.kube/config delete -f <https://builds.apache.org/job/beam_PerformanceTests_JDBC/ws/.test-infra/kubernetes/postgres/postgres.yml>
2018-02-05 15:48:31,779 14bbe231 MainThread beam_integration_benchmark(1/1) INFO Ran kubectl --kubeconfig=/home/jenkins/.kube/config delete -f <https://builds.apache.org/job/beam_PerformanceTests_JDBC/ws/.test-infra/kubernetes/postgres/postgres.yml.> Got return code (1).
STDOUT:
STDERR: error: the path "<https://builds.apache.org/job/beam_PerformanceTests_JDBC/ws/.test-infra/kubernetes/postgres/postgres.yml"> does not exist
2018-02-05 15:48:31,779 14bbe231 MainThread beam_integration_benchmark(1/1) INFO Retrying exception running IssueRetryableCommand: Command returned a non-zero exit code.
2018-02-05 15:48:58,236 14bbe231 MainThread beam_integration_benchmark(1/1) INFO Running: kubectl --kubeconfig=/home/jenkins/.kube/config delete -f <https://builds.apache.org/job/beam_PerformanceTests_JDBC/ws/.test-infra/kubernetes/postgres/postgres.yml>
2018-02-05 15:48:58,326 14bbe231 MainThread beam_integration_benchmark(1/1) INFO Ran kubectl --kubeconfig=/home/jenkins/.kube/config delete -f <https://builds.apache.org/job/beam_PerformanceTests_JDBC/ws/.test-infra/kubernetes/postgres/postgres.yml.> Got return code (1).
STDOUT:
STDERR: error: the path "<https://builds.apache.org/job/beam_PerformanceTests_JDBC/ws/.test-infra/kubernetes/postgres/postgres.yml"> does not exist
2018-02-05 15:48:58,326 14bbe231 MainThread beam_integration_benchmark(1/1) INFO Retrying exception running IssueRetryableCommand: Command returned a non-zero exit code.
2018-02-05 15:49:23,148 14bbe231 MainThread beam_integration_benchmark(1/1) INFO Running: kubectl --kubeconfig=/home/jenkins/.kube/config delete -f <https://builds.apache.org/job/beam_PerformanceTests_JDBC/ws/.test-infra/kubernetes/postgres/postgres.yml>
2018-02-05 15:49:23,244 14bbe231 MainThread beam_integration_benchmark(1/1) INFO Ran kubectl --kubeconfig=/home/jenkins/.kube/config delete -f <https://builds.apache.org/job/beam_PerformanceTests_JDBC/ws/.test-infra/kubernetes/postgres/postgres.yml.> Got return code (1).
STDOUT:
STDERR: error: the path "<https://builds.apache.org/job/beam_PerformanceTests_JDBC/ws/.test-infra/kubernetes/postgres/postgres.yml"> does not exist
2018-02-05 15:49:23,245 14bbe231 MainThread beam_integration_benchmark(1/1) INFO Retrying exception running IssueRetryableCommand: Command returned a non-zero exit code.
2018-02-05 15:49:47,616 14bbe231 MainThread beam_integration_benchmark(1/1) INFO Running: kubectl --kubeconfig=/home/jenkins/.kube/config delete -f <https://builds.apache.org/job/beam_PerformanceTests_JDBC/ws/.test-infra/kubernetes/postgres/postgres.yml>
2018-02-05 15:49:47,711 14bbe231 MainThread beam_integration_benchmark(1/1) INFO Ran kubectl --kubeconfig=/home/jenkins/.kube/config delete -f <https://builds.apache.org/job/beam_PerformanceTests_JDBC/ws/.test-infra/kubernetes/postgres/postgres.yml.> Got return code (1).
STDOUT:
STDERR: error: the path "<https://builds.apache.org/job/beam_PerformanceTests_JDBC/ws/.test-infra/kubernetes/postgres/postgres.yml"> does not exist
2018-02-05 15:49:47,712 14bbe231 MainThread beam_integration_benchmark(1/1) INFO Retrying exception running IssueRetryableCommand: Command returned a non-zero exit code.
2018-02-05 15:50:13,667 14bbe231 MainThread beam_integration_benchmark(1/1) INFO Running: kubectl --kubeconfig=/home/jenkins/.kube/config delete -f <https://builds.apache.org/job/beam_PerformanceTests_JDBC/ws/.test-infra/kubernetes/postgres/postgres.yml>
2018-02-05 15:50:13,761 14bbe231 MainThread beam_integration_benchmark(1/1) INFO Ran kubectl --kubeconfig=/home/jenkins/.kube/config delete -f <https://builds.apache.org/job/beam_PerformanceTests_JDBC/ws/.test-infra/kubernetes/postgres/postgres.yml.> Got return code (1).
STDOUT:
STDERR: error: the path "<https://builds.apache.org/job/beam_PerformanceTests_JDBC/ws/.test-infra/kubernetes/postgres/postgres.yml"> does not exist
2018-02-05 15:50:13,762 14bbe231 MainThread beam_integration_benchmark(1/1) INFO Retrying exception running IssueRetryableCommand: Command returned a non-zero exit code.
2018-02-05 15:50:34,431 14bbe231 MainThread beam_integration_benchmark(1/1) INFO Running: kubectl --kubeconfig=/home/jenkins/.kube/config delete -f <https://builds.apache.org/job/beam_PerformanceTests_JDBC/ws/.test-infra/kubernetes/postgres/postgres.yml>
2018-02-05 15:50:34,524 14bbe231 MainThread beam_integration_benchmark(1/1) INFO Ran kubectl --kubeconfig=/home/jenkins/.kube/config delete -f <https://builds.apache.org/job/beam_PerformanceTests_JDBC/ws/.test-infra/kubernetes/postgres/postgres.yml.> Got return code (1).
STDOUT:
STDERR: error: the path "<https://builds.apache.org/job/beam_PerformanceTests_JDBC/ws/.test-infra/kubernetes/postgres/postgres.yml"> does not exist
2018-02-05 15:50:34,524 14bbe231 MainThread beam_integration_benchmark(1/1) INFO Retrying exception running IssueRetryableCommand: Command returned a non-zero exit code.
2018-02-05 15:50:52,042 14bbe231 MainThread beam_integration_benchmark(1/1) INFO Running: kubectl --kubeconfig=/home/jenkins/.kube/config delete -f <https://builds.apache.org/job/beam_PerformanceTests_JDBC/ws/.test-infra/kubernetes/postgres/postgres.yml>
2018-02-05 15:50:52,136 14bbe231 MainThread beam_integration_benchmark(1/1) INFO Ran kubectl --kubeconfig=/home/jenkins/.kube/config delete -f <https://builds.apache.org/job/beam_PerformanceTests_JDBC/ws/.test-infra/kubernetes/postgres/postgres.yml.> Got return code (1).
STDOUT:
STDERR: error: the path "<https://builds.apache.org/job/beam_PerformanceTests_JDBC/ws/.test-infra/kubernetes/postgres/postgres.yml"> does not exist
2018-02-05 15:50:52,137 14bbe231 MainThread beam_integration_benchmark(1/1) INFO Retrying exception running IssueRetryableCommand: Command returned a non-zero exit code.
2018-02-05 15:51:19,190 14bbe231 MainThread beam_integration_benchmark(1/1) INFO Running: kubectl --kubeconfig=/home/jenkins/.kube/config delete -f <https://builds.apache.org/job/beam_PerformanceTests_JDBC/ws/.test-infra/kubernetes/postgres/postgres.yml>
2018-02-05 15:51:19,283 14bbe231 MainThread beam_integration_benchmark(1/1) INFO Ran kubectl --kubeconfig=/home/jenkins/.kube/config delete -f <https://builds.apache.org/job/beam_PerformanceTests_JDBC/ws/.test-infra/kubernetes/postgres/postgres.yml.> Got return code (1).
STDOUT:
STDERR: error: the path "<https://builds.apache.org/job/beam_PerformanceTests_JDBC/ws/.test-infra/kubernetes/postgres/postgres.yml"> does not exist
2018-02-05 15:51:19,283 14bbe231 MainThread beam_integration_benchmark(1/1) INFO Retrying exception running IssueRetryableCommand: Command returned a non-zero exit code.
2018-02-05 15:51:42,951 14bbe231 MainThread beam_integration_benchmark(1/1) INFO Running: kubectl --kubeconfig=/home/jenkins/.kube/config delete -f <https://builds.apache.org/job/beam_PerformanceTests_JDBC/ws/.test-infra/kubernetes/postgres/postgres.yml>
2018-02-05 15:51:43,045 14bbe231 MainThread beam_integration_benchmark(1/1) INFO Ran kubectl --kubeconfig=/home/jenkins/.kube/config delete -f <https://builds.apache.org/job/beam_PerformanceTests_JDBC/ws/.test-infra/kubernetes/postgres/postgres.yml.> Got return code (1).
STDOUT:
STDERR: error: the path "<https://builds.apache.org/job/beam_PerformanceTests_JDBC/ws/.test-infra/kubernetes/postgres/postgres.yml"> does not exist
2018-02-05 15:51:43,045 14bbe231 MainThread beam_integration_benchmark(1/1) INFO Retrying exception running IssueRetryableCommand: Command returned a non-zero exit code.
2018-02-05 15:51:58,806 14bbe231 MainThread beam_integration_benchmark(1/1) INFO Running: kubectl --kubeconfig=/home/jenkins/.kube/config delete -f <https://builds.apache.org/job/beam_PerformanceTests_JDBC/ws/.test-infra/kubernetes/postgres/postgres.yml>
2018-02-05 15:51:58,914 14bbe231 MainThread beam_integration_benchmark(1/1) INFO Ran kubectl --kubeconfig=/home/jenkins/.kube/config delete -f <https://builds.apache.org/job/beam_PerformanceTests_JDBC/ws/.test-infra/kubernetes/postgres/postgres.yml.> Got return code (1).
STDOUT:
STDERR: error: the path "<https://builds.apache.org/job/beam_PerformanceTests_JDBC/ws/.test-infra/kubernetes/postgres/postgres.yml"> does not exist
2018-02-05 15:51:58,914 14bbe231 MainThread beam_integration_benchmark(1/1) INFO Retrying exception running IssueRetryableCommand: Command returned a non-zero exit code.
2018-02-05 15:52:15,017 14bbe231 MainThread beam_integration_benchmark(1/1) INFO Running: kubectl --kubeconfig=/home/jenkins/.kube/config delete -f <https://builds.apache.org/job/beam_PerformanceTests_JDBC/ws/.test-infra/kubernetes/postgres/postgres.yml>
2018-02-05 15:52:15,109 14bbe231 MainThread beam_integration_benchmark(1/1) INFO Ran kubectl --kubeconfig=/home/jenkins/.kube/config delete -f <https://builds.apache.org/job/beam_PerformanceTests_JDBC/ws/.test-infra/kubernetes/postgres/postgres.yml.> Got return code (1).
STDOUT:
STDERR: error: the path "<https://builds.apache.org/job/beam_PerformanceTests_JDBC/ws/.test-infra/kubernetes/postgres/postgres.yml"> does not exist
2018-02-05 15:52:15,109 14bbe231 MainThread beam_integration_benchmark(1/1) INFO Retrying exception running IssueRetryableCommand: Command returned a non-zero exit code.
2018-02-05 15:52:35,859 14bbe231 MainThread beam_integration_benchmark(1/1) INFO Running: kubectl --kubeconfig=/home/jenkins/.kube/config delete -f <https://builds.apache.org/job/beam_PerformanceTests_JDBC/ws/.test-infra/kubernetes/postgres/postgres.yml>
2018-02-05 15:52:35,954 14bbe231 MainThread beam_integration_benchmark(1/1) INFO Ran kubectl --kubeconfig=/home/jenkins/.kube/config delete -f <https://builds.apache.org/job/beam_PerformanceTests_JDBC/ws/.test-infra/kubernetes/postgres/postgres.yml.> Got return code (1).
STDOUT:
STDERR: error: the path "<https://builds.apache.org/job/beam_PerformanceTests_JDBC/ws/.test-infra/kubernetes/postgres/postgres.yml"> does not exist
2018-02-05 15:52:35,954 14bbe231 MainThread beam_integration_benchmark(1/1) INFO Retrying exception running IssueRetryableCommand: Command returned a non-zero exit code.
2018-02-05 15:52:56,687 14bbe231 MainThread beam_integration_benchmark(1/1) INFO Running: kubectl --kubeconfig=/home/jenkins/.kube/config delete -f <https://builds.apache.org/job/beam_PerformanceTests_JDBC/ws/.test-infra/kubernetes/postgres/postgres.yml>
2018-02-05 15:52:56,783 14bbe231 MainThread beam_integration_benchmark(1/1) INFO Ran kubectl --kubeconfig=/home/jenkins/.kube/config delete -f <https://builds.apache.org/job/beam_PerformanceTests_JDBC/ws/.test-infra/kubernetes/postgres/postgres.yml.> Got return code (1).
STDOUT:
STDERR: error: the path "<https://builds.apache.org/job/beam_PerformanceTests_JDBC/ws/.test-infra/kubernetes/postgres/postgres.yml"> does not exist
2018-02-05 15:52:56,784 14bbe231 MainThread beam_integration_benchmark(1/1) INFO Retrying exception running IssueRetryableCommand: Command returned a non-zero exit code.
2018-02-05 15:53:18,755 14bbe231 MainThread beam_integration_benchmark(1/1) INFO Running: kubectl --kubeconfig=/home/jenkins/.kube/config delete -f <https://builds.apache.org/job/beam_PerformanceTests_JDBC/ws/.test-infra/kubernetes/postgres/postgres.yml>
2018-02-05 15:53:18,847 14bbe231 MainThread beam_integration_benchmark(1/1) INFO Ran kubectl --kubeconfig=/home/jenkins/.kube/config delete -f <https://builds.apache.org/job/beam_PerformanceTests_JDBC/ws/.test-infra/kubernetes/postgres/postgres.yml.> Got return code (1).
STDOUT:
STDERR: error: the path "<https://builds.apache.org/job/beam_PerformanceTests_JDBC/ws/.test-infra/kubernetes/postgres/postgres.yml"> does not exist
2018-02-05 15:53:18,847 14bbe231 MainThread beam_integration_benchmark(1/1) INFO Retrying exception running IssueRetryableCommand: Command returned a non-zero exit code.
2018-02-05 15:53:48,749 14bbe231 MainThread beam_integration_benchmark(1/1) INFO Running: kubectl --kubeconfig=/home/jenkins/.kube/config delete -f <https://builds.apache.org/job/beam_PerformanceTests_JDBC/ws/.test-infra/kubernetes/postgres/postgres.yml>
2018-02-05 15:53:48,843 14bbe231 MainThread beam_integration_benchmark(1/1) INFO Ran kubectl --kubeconfig=/home/jenkins/.kube/config delete -f <https://builds.apache.org/job/beam_PerformanceTests_JDBC/ws/.test-infra/kubernetes/postgres/postgres.yml.> Got return code (1).
STDOUT:
STDERR: error: the path "<https://builds.apache.org/job/beam_PerformanceTests_JDBC/ws/.test-infra/kubernetes/postgres/postgres.yml"> does not exist
2018-02-05 15:53:48,843 14bbe231 MainThread beam_integration_benchmark(1/1) INFO Retrying exception running IssueRetryableCommand: Command returned a non-zero exit code.
2018-02-05 15:54:15,127 14bbe231 MainThread beam_integration_benchmark(1/1) INFO Running: kubectl --kubeconfig=/home/jenkins/.kube/config delete -f <https://builds.apache.org/job/beam_PerformanceTests_JDBC/ws/.test-infra/kubernetes/postgres/postgres.yml>
2018-02-05 15:54:15,215 14bbe231 MainThread beam_integration_benchmark(1/1) INFO Ran kubectl --kubeconfig=/home/jenkins/.kube/config delete -f <https://builds.apache.org/job/beam_PerformanceTests_JDBC/ws/.test-infra/kubernetes/postgres/postgres.yml.> Got return code (1).
STDOUT:
STDERR: error: the path "<https://builds.apache.org/job/beam_PerformanceTests_JDBC/ws/.test-infra/kubernetes/postgres/postgres.yml"> does not exist
2018-02-05 15:54:15,215 14bbe231 MainThread beam_integration_benchmark(1/1) INFO Retrying exception running IssueRetryableCommand: Command returned a non-zero exit code.
2018-02-05 15:54:36,574 14bbe231 MainThread beam_integration_benchmark(1/1) INFO Running: kubectl --kubeconfig=/home/jenkins/.kube/config delete -f <https://builds.apache.org/job/beam_PerformanceTests_JDBC/ws/.test-infra/kubernetes/postgres/postgres.yml>
2018-02-05 15:54:36,668 14bbe231 MainThread beam_integration_benchmark(1/1) INFO Ran kubectl --kubeconfig=/home/jenkins/.kube/config delete -f <https://builds.apache.org/job/beam_PerformanceTests_JDBC/ws/.test-infra/kubernetes/postgres/postgres.yml.> Got return code (1).
STDOUT:
STDERR: error: the path "<https://builds.apache.org/job/beam_PerformanceTests_JDBC/ws/.test-infra/kubernetes/postgres/postgres.yml"> does not exist
2018-02-05 15:54:36,669 14bbe231 MainThread beam_integration_benchmark(1/1) INFO Retrying exception running IssueRetryableCommand: Command returned a non-zero exit code.
2018-02-05 15:55:02,876 14bbe231 MainThread beam_integration_benchmark(1/1) INFO Running: kubectl --kubeconfig=/home/jenkins/.kube/config delete -f <https://builds.apache.org/job/beam_PerformanceTests_JDBC/ws/.test-infra/kubernetes/postgres/postgres.yml>
2018-02-05 15:55:02,986 14bbe231 MainThread beam_integration_benchmark(1/1) INFO Ran kubectl --kubeconfig=/home/jenkins/.kube/config delete -f <https://builds.apache.org/job/beam_PerformanceTests_JDBC/ws/.test-infra/kubernetes/postgres/postgres.yml.> Got return code (1).
STDOUT:
STDERR: error: the path "<https://builds.apache.org/job/beam_PerformanceTests_JDBC/ws/.test-infra/kubernetes/postgres/postgres.yml"> does not exist
2018-02-05 15:55:02,986 14bbe231 MainThread beam_integration_benchmark(1/1) INFO Retrying exception running IssueRetryableCommand: Command returned a non-zero exit code.
2018-02-05 15:55:27,924 14bbe231 MainThread beam_integration_benchmark(1/1) INFO Running: kubectl --kubeconfig=/home/jenkins/.kube/config delete -f <https://builds.apache.org/job/beam_PerformanceTests_JDBC/ws/.test-infra/kubernetes/postgres/postgres.yml>
2018-02-05 15:55:28,016 14bbe231 MainThread beam_integration_benchmark(1/1) INFO Ran kubectl --kubeconfig=/home/jenkins/.kube/config delete -f <https://builds.apache.org/job/beam_PerformanceTests_JDBC/ws/.test-infra/kubernetes/postgres/postgres.yml.> Got return code (1).
STDOUT:
STDERR: error: the path "<https://builds.apache.org/job/beam_PerformanceTests_JDBC/ws/.test-infra/kubernetes/postgres/postgres.yml"> does not exist
2018-02-05 15:55:28,016 14bbe231 MainThread beam_integration_benchmark(1/1) INFO Retrying exception running IssueRetryableCommand: Command returned a non-zero exit code.
2018-02-05 15:55:47,003 14bbe231 MainThread beam_integration_benchmark(1/1) INFO Running: kubectl --kubeconfig=/home/jenkins/.kube/config delete -f <https://builds.apache.org/job/beam_PerformanceTests_JDBC/ws/.test-infra/kubernetes/postgres/postgres.yml>
2018-02-05 15:55:47,093 14bbe231 MainThread beam_integration_benchmark(1/1) INFO Ran kubectl --kubeconfig=/home/jenkins/.kube/config delete -f <https://builds.apache.org/job/beam_PerformanceTests_JDBC/ws/.test-infra/kubernetes/postgres/postgres.yml.> Got return code (1).
STDOUT:
STDERR: error: the path "<https://builds.apache.org/job/beam_PerformanceTests_JDBC/ws/.test-infra/kubernetes/postgres/postgres.yml"> does not exist
2018-02-05 15:55:47,093 14bbe231 MainThread beam_integration_benchmark(1/1) INFO Retrying exception running IssueRetryableCommand: Command returned a non-zero exit code.
2018-02-05 15:56:03,987 14bbe231 MainThread beam_integration_benchmark(1/1) INFO Running: kubectl --kubeconfig=/home/jenkins/.kube/config delete -f <https://builds.apache.org/job/beam_PerformanceTests_JDBC/ws/.test-infra/kubernetes/postgres/postgres.yml>
2018-02-05 15:56:04,080 14bbe231 MainThread beam_integration_benchmark(1/1) INFO Ran kubectl --kubeconfig=/home/jenkins/.kube/config delete -f <https://builds.apache.org/job/beam_PerformanceTests_JDBC/ws/.test-infra/kubernetes/postgres/postgres.yml.> Got return code (1).
STDOUT:
STDERR: error: the path "<https://builds.apache.org/job/beam_PerformanceTests_JDBC/ws/.test-infra/kubernetes/postgres/postgres.yml"> does not exist
2018-02-05 15:56:04,080 14bbe231 MainThread beam_integration_benchmark(1/1) INFO Retrying exception running IssueRetryableCommand: Command returned a non-zero exit code.
2018-02-05 15:56:21,088 14bbe231 MainThread beam_integration_benchmark(1/1) INFO Running: kubectl --kubeconfig=/home/jenkins/.kube/config delete -f <https://builds.apache.org/job/beam_PerformanceTests_JDBC/ws/.test-infra/kubernetes/postgres/postgres.yml>
2018-02-05 15:56:21,177 14bbe231 MainThread beam_integration_benchmark(1/1) INFO Ran kubectl --kubeconfig=/home/jenkins/.kube/config delete -f <https://builds.apache.org/job/beam_PerformanceTests_JDBC/ws/.test-infra/kubernetes/postgres/postgres.yml.> Got return code (1).
STDOUT:
STDERR: error: the path "<https://builds.apache.org/job/beam_PerformanceTests_JDBC/ws/.test-infra/kubernetes/postgres/postgres.yml"> does not exist
2018-02-05 15:56:21,178 14bbe231 MainThread beam_integration_benchmark(1/1) INFO Retrying exception running IssueRetryableCommand: Command returned a non-zero exit code.
2018-02-05 15:56:44,062 14bbe231 MainThread beam_integration_benchmark(1/1) INFO Running: kubectl --kubeconfig=/home/jenkins/.kube/config delete -f <https://builds.apache.org/job/beam_PerformanceTests_JDBC/ws/.test-infra/kubernetes/postgres/postgres.yml>
2018-02-05 15:56:44,153 14bbe231 MainThread beam_integration_benchmark(1/1) INFO Ran kubectl --kubeconfig=/home/jenkins/.kube/config delete -f <https://builds.apache.org/job/beam_PerformanceTests_JDBC/ws/.test-infra/kubernetes/postgres/postgres.yml.> Got return code (1).
STDOUT:
STDERR: error: the path "<https://builds.apache.org/job/beam_PerformanceTests_JDBC/ws/.test-infra/kubernetes/postgres/postgres.yml"> does not exist
2018-02-05 15:56:44,154 14bbe231 MainThread beam_integration_benchmark(1/1) INFO Retrying exception running IssueRetryableCommand: Command returned a non-zero exit code.
2018-02-05 15:57:11,345 14bbe231 MainThread beam_integration_benchmark(1/1) INFO Running: kubectl --kubeconfig=/home/jenkins/.kube/config delete -f <https://builds.apache.org/job/beam_PerformanceTests_JDBC/ws/.test-infra/kubernetes/postgres/postgres.yml>
2018-02-05 15:57:11,434 14bbe231 MainThread beam_integration_benchmark(1/1) INFO Ran kubectl --kubeconfig=/home/jenkins/.kube/config delete -f <https://builds.apache.org/job/beam_PerformanceTests_JDBC/ws/.test-infra/kubernetes/postgres/postgres.yml.> Got return code (1).
STDOUT:
STDERR: error: the path "<https://builds.apache.org/job/beam_PerformanceTests_JDBC/ws/.test-infra/kubernetes/postgres/postgres.yml"> does not exist
2018-02-05 15:57:11,434 14bbe231 MainThread beam_integration_benchmark(1/1) INFO Retrying exception running IssueRetryableCommand: Command returned a non-zero exit code.
2018-02-05 15:57:29,494 14bbe231 MainThread beam_integration_benchmark(1/1) INFO Running: kubectl --kubeconfig=/home/jenkins/.kube/config delete -f <https://builds.apache.org/job/beam_PerformanceTests_JDBC/ws/.test-infra/kubernetes/postgres/postgres.yml>
2018-02-05 15:57:29,588 14bbe231 MainThread beam_integration_benchmark(1/1) INFO Ran kubectl --kubeconfig=/home/jenkins/.kube/config delete -f <https://builds.apache.org/job/beam_PerformanceTests_JDBC/ws/.test-infra/kubernetes/postgres/postgres.yml.> Got return code (1).
STDOUT:
STDERR: error: the path "<https://builds.apache.org/job/beam_PerformanceTests_JDBC/ws/.test-infra/kubernetes/postgres/postgres.yml"> does not exist
2018-02-05 15:57:29,588 14bbe231 MainThread beam_integration_benchmark(1/1) INFO Retrying exception running IssueRetryableCommand: Command returned a non-zero exit code.
2018-02-05 15:57:57,124 14bbe231 MainThread beam_integration_benchmark(1/1) INFO Running: kubectl --kubeconfig=/home/jenkins/.kube/config delete -f <https://builds.apache.org/job/beam_PerformanceTests_JDBC/ws/.test-infra/kubernetes/postgres/postgres.yml>
2018-02-05 15:57:57,213 14bbe231 MainThread beam_integration_benchmark(1/1) INFO Ran kubectl --kubeconfig=/home/jenkins/.kube/config delete -f <https://builds.apache.org/job/beam_PerformanceTests_JDBC/ws/.test-infra/kubernetes/postgres/postgres.yml.> Got return code (1).
STDOUT:
STDERR: error: the path "<https://builds.apache.org/job/beam_PerformanceTests_JDBC/ws/.test-infra/kubernetes/postgres/postgres.yml"> does not exist
2018-02-05 15:57:57,214 14bbe231 MainThread beam_integration_benchmark(1/1) INFO Retrying exception running IssueRetryableCommand: Command returned a non-zero exit code.
2018-02-05 15:58:23,492 14bbe231 MainThread beam_integration_benchmark(1/1) INFO Running: kubectl --kubeconfig=/home/jenkins/.kube/config delete -f <https://builds.apache.org/job/beam_PerformanceTests_JDBC/ws/.test-infra/kubernetes/postgres/postgres.yml>
2018-02-05 15:58:23,588 14bbe231 MainThread beam_integration_benchmark(1/1) INFO Ran kubectl --kubeconfig=/home/jenkins/.kube/config delete -f <https://builds.apache.org/job/beam_PerformanceTests_JDBC/ws/.test-infra/kubernetes/postgres/postgres.yml.> Got return code (1).
STDOUT:
STDERR: error: the path "<https://builds.apache.org/job/beam_PerformanceTests_JDBC/ws/.test-infra/kubernetes/postgres/postgres.yml"> does not exist
2018-02-05 15:58:23,589 14bbe231 MainThread beam_integration_benchmark(1/1) INFO Retrying exception running IssueRetryableCommand: Command returned a non-zero exit code.
2018-02-05 15:58:45,185 14bbe231 MainThread beam_integration_benchmark(1/1) INFO Running: kubectl --kubeconfig=/home/jenkins/.kube/config delete -f <https://builds.apache.org/job/beam_PerformanceTests_JDBC/ws/.test-infra/kubernetes/postgres/postgres.yml>
2018-02-05 15:58:45,281 14bbe231 MainThread beam_integration_benchmark(1/1) INFO Ran kubectl --kubeconfig=/home/jenkins/.kube/config delete -f <https://builds.apache.org/job/beam_PerformanceTests_JDBC/ws/.test-infra/kubernetes/postgres/postgres.yml.> Got return code (1).
STDOUT:
STDERR: error: the path "<https://builds.apache.org/job/beam_PerformanceTests_JDBC/ws/.test-infra/kubernetes/postgres/postgres.yml"> does not exist
2018-02-05 15:58:45,281 14bbe231 MainThread beam_integration_benchmark(1/1) INFO Retrying exception running IssueRetryableCommand: Command returned a non-zero exit code.
2018-02-05 15:59:14,545 14bbe231 MainThread beam_integration_benchmark(1/1) INFO Running: kubectl --kubeconfig=/home/jenkins/.kube/config delete -f <https://builds.apache.org/job/beam_PerformanceTests_JDBC/ws/.test-infra/kubernetes/postgres/postgres.yml>
2018-02-05 15:59:14,636 14bbe231 MainThread beam_integration_benchmark(1/1) INFO Ran kubectl --kubeconfig=/home/jenkins/.kube/config delete -f <https://builds.apache.org/job/beam_PerformanceTests_JDBC/ws/.test-infra/kubernetes/postgres/postgres.yml.> Got return code (1).
STDOUT:
STDERR: error: the path "<https://builds.apache.org/job/beam_PerformanceTests_JDBC/ws/.test-infra/kubernetes/postgres/postgres.yml"> does not exist
2018-02-05 15:59:14,636 14bbe231 MainThread beam_integration_benchmark(1/1) INFO Retrying exception running IssueRetryableCommand: Command returned a non-zero exit code.
2018-02-05 15:59:31,969 14bbe231 MainThread beam_integration_benchmark(1/1) INFO Running: kubectl --kubeconfig=/home/jenkins/.kube/config delete -f <https://builds.apache.org/job/beam_PerformanceTests_JDBC/ws/.test-infra/kubernetes/postgres/postgres.yml>
2018-02-05 15:59:32,063 14bbe231 MainThread beam_integration_benchmark(1/1) INFO Ran kubectl --kubeconfig=/home/jenkins/.kube/config delete -f <https://builds.apache.org/job/beam_PerformanceTests_JDBC/ws/.test-infra/kubernetes/postgres/postgres.yml.> Got return code (1).
STDOUT:
STDERR: error: the path "<https://builds.apache.org/job/beam_PerformanceTests_JDBC/ws/.test-infra/kubernetes/postgres/postgres.yml"> does not exist
2018-02-05 15:59:32,063 14bbe231 MainThread beam_integration_benchmark(1/1) INFO Retrying exception running IssueRetryableCommand: Command returned a non-zero exit code.
2018-02-05 16:00:00,654 14bbe231 MainThread beam_integration_benchmark(1/1) INFO Running: kubectl --kubeconfig=/home/jenkins/.kube/config delete -f <https://builds.apache.org/job/beam_PerformanceTests_JDBC/ws/.test-infra/kubernetes/postgres/postgres.yml>
2018-02-05 16:00:00,745 14bbe231 MainThread beam_integration_benchmark(1/1) INFO Ran kubectl --kubeconfig=/home/jenkins/.kube/config delete -f <https://builds.apache.org/job/beam_PerformanceTests_JDBC/ws/.test-infra/kubernetes/postgres/postgres.yml.> Got return code (1).
STDOUT:
STDERR: error: the path "<https://builds.apache.org/job/beam_PerformanceTests_JDBC/ws/.test-infra/kubernetes/postgres/postgres.yml"> does not exist
2018-02-05 16:00:00,745 14bbe231 MainThread beam_integration_benchmark(1/1) INFO Retrying exception running IssueRetryableCommand: Command returned a non-zero exit code.
2018-02-05 16:00:18,298 14bbe231 MainThread beam_integration_benchmark(1/1) INFO Running: kubectl --kubeconfig=/home/jenkins/.kube/config delete -f <https://builds.apache.org/job/beam_PerformanceTests_JDBC/ws/.test-infra/kubernetes/postgres/postgres.yml>
2018-02-05 16:00:18,389 14bbe231 MainThread beam_integration_benchmark(1/1) INFO Ran kubectl --kubeconfig=/home/jenkins/.kube/config delete -f <https://builds.apache.org/job/beam_PerformanceTests_JDBC/ws/.test-infra/kubernetes/postgres/postgres.yml.> Got return code (1).
STDOUT:
STDERR: error: the path "<https://builds.apache.org/job/beam_PerformanceTests_JDBC/ws/.test-infra/kubernetes/postgres/postgres.yml"> does not exist
2018-02-05 16:00:18,389 14bbe231 MainThread beam_integration_benchmark(1/1) INFO Retrying exception running IssueRetryableCommand: Command returned a non-zero exit code.
2018-02-05 16:00:33,844 14bbe231 MainThread beam_integration_benchmark(1/1) INFO Running: kubectl --kubeconfig=/home/jenkins/.kube/config delete -f <https://builds.apache.org/job/beam_PerformanceTests_JDBC/ws/.test-infra/kubernetes/postgres/postgres.yml>
2018-02-05 16:00:33,934 14bbe231 MainThread beam_integration_benchmark(1/1) INFO Ran kubectl --kubeconfig=/home/jenkins/.kube/config delete -f <https://builds.apache.org/job/beam_PerformanceTests_JDBC/ws/.test-infra/kubernetes/postgres/postgres.yml.> Got return code (1).
STDOUT:
STDERR: error: the path "<https://builds.apache.org/job/beam_PerformanceTests_JDBC/ws/.test-infra/kubernetes/postgres/postgres.yml"> does not exist
2018-02-05 16:00:33,936 14bbe231 MainThread beam_integration_benchmark(1/1) ERROR Benchmark 1/1 beam_integration_benchmark (UID: beam_integration_benchmark0) failed. Execution will continue.
2018-02-05 16:00:33,944 14bbe231 MainThread INFO Benchmark run statuses:
---------------------------------------------------------------
Name UID Status
---------------------------------------------------------------
beam_integration_benchmark beam_integration_benchmark0 FAILED
---------------------------------------------------------------
Success rate: 0.00% (0/1)
2018-02-05 16:00:33,944 14bbe231 MainThread INFO Complete logs can be found at: <https://builds.apache.org/job/beam_PerformanceTests_JDBC/ws/runs/14bbe231/pkb.log>
2018-02-05 16:00:33,944 14bbe231 MainThread INFO Completion statuses can be found at: <https://builds.apache.org/job/beam_PerformanceTests_JDBC/ws/runs/14bbe231/completion_statuses.json>
Build step 'Execute shell' marked build as failure
Build failed in Jenkins: beam_PerformanceTests_JDBC #234
Posted by Apache Jenkins Server <je...@builds.apache.org>.
See <https://builds.apache.org/job/beam_PerformanceTests_JDBC/234/display/redirect>
------------------------------------------
GitHub pull request #4585 of commit 4d2fed623eddef9f3a8bb1981e1911bdcb2001b3, no merge conflicts.
Setting status of 4d2fed623eddef9f3a8bb1981e1911bdcb2001b3 to PENDING with url https://builds.apache.org/job/beam_PerformanceTests_JDBC/234/ and message: 'Build started sha1 is merged.'
Using context: Jenkins: Java JdbcIO Performance Test
[EnvInject] - Loading node environment variables.
Building remotely on beam1 (beam) in workspace <https://builds.apache.org/job/beam_PerformanceTests_JDBC/ws/>
> git rev-parse --is-inside-work-tree # timeout=10
Fetching changes from the remote Git repository
> git config remote.origin.url https://github.com/apache/beam.git # timeout=10
Fetching upstream changes from https://github.com/apache/beam.git
> git --version # timeout=10
> git fetch --tags --progress https://github.com/apache/beam.git +refs/heads/*:refs/remotes/origin/* +refs/pull/4585/*:refs/remotes/origin/pr/4585/*
> git rev-parse refs/remotes/origin/pr/4585/merge^{commit} # timeout=10
> git rev-parse refs/remotes/origin/origin/pr/4585/merge^{commit} # timeout=10
Checking out Revision 93c244a4c3f5ef4dc392b2edfb977f68811f4e56 (refs/remotes/origin/pr/4585/merge)
> git config core.sparsecheckout # timeout=10
> git checkout -f 93c244a4c3f5ef4dc392b2edfb977f68811f4e56
Commit message: "Merge 4d2fed623eddef9f3a8bb1981e1911bdcb2001b3 into 93818abf901dd996aa30445457153811b13ece43"
First time build. Skipping changelog.
Cleaning workspace
> git rev-parse --verify HEAD # timeout=10
Resetting working tree
> git reset --hard # timeout=10
> git clean -fdx # timeout=10
[EnvInject] - Executing scripts and injecting environment variables after the SCM step.
[EnvInject] - Injecting as environment variables the properties content
SPARK_LOCAL_IP=127.0.0.1
[EnvInject] - Variables injected successfully.
[beam_PerformanceTests_JDBC] $ /bin/bash -xe /tmp/jenkins5381400444467291400.sh
+ gcloud container clusters get-credentials io-datastores --zone=us-central1-a --verbosity=debug
DEBUG: Running gcloud.container.clusters.get-credentials with Namespace(__calliope_internal_deepest_parser=ArgumentParser(prog='gcloud.container.clusters.get-credentials', usage=None, description='See https://cloud.google.com/container-engine/docs/kubectl for\nkubectl documentation.', version=None, formatter_class=<class 'argparse.HelpFormatter'>, conflict_handler='error', add_help=False), account=None, api_version=None, authority_selector=None, authorization_token_file=None, cmd_func=<bound method Command.Run of <googlecloudsdk.calliope.backend.Command object at 0x7f9bd6d8d7d0>>, command_path=['gcloud', 'container', 'clusters', 'get-credentials'], configuration=None, credential_file_override=None, document=None, format=None, h=None, help=None, http_timeout=None, log_http=None, name='io-datastores', project=None, quiet=None, trace_email=None, trace_log=None, trace_token=None, user_output_enabled=None, verbosity='debug', version=None, zone='us-central1-a').
Fetching cluster endpoint and auth data.
DEBUG: unable to load default kubeconfig: [Errno 2] No such file or directory: '/home/jenkins/.kube/config'; recreating /home/jenkins/.kube/config
DEBUG: Saved kubeconfig to /home/jenkins/.kube/config
kubeconfig entry generated for io-datastores.
INFO: Display format "default".
DEBUG: Checking for updates...
[beam_PerformanceTests_JDBC] $ /bin/bash -xe /tmp/jenkins4589194026611297974.sh
+ rm -rf PerfKitBenchmarker
[beam_PerformanceTests_JDBC] $ /bin/bash -xe /tmp/jenkins4356914166225145917.sh
+ rm -rf .env
[beam_PerformanceTests_JDBC] $ /bin/bash -xe /tmp/jenkins8814813696663637891.sh
+ virtualenv .env --system-site-packages
New python executable in <https://builds.apache.org/job/beam_PerformanceTests_JDBC/ws/.env/bin/python>
Installing setuptools, pip, wheel...done.
[beam_PerformanceTests_JDBC] $ /bin/bash -xe /tmp/jenkins5246839393785401843.sh
+ .env/bin/pip install --upgrade setuptools pip
Requirement already up-to-date: setuptools in ./.env/lib/python2.7/site-packages
Requirement already up-to-date: pip in ./.env/lib/python2.7/site-packages
[beam_PerformanceTests_JDBC] $ /bin/bash -xe /tmp/jenkins5115933430353196731.sh
+ git clone https://github.com/GoogleCloudPlatform/PerfKitBenchmarker.git
Cloning into 'PerfKitBenchmarker'...
[beam_PerformanceTests_JDBC] $ /bin/bash -xe /tmp/jenkins4143112721671497997.sh
+ .env/bin/pip install -r PerfKitBenchmarker/requirements.txt
Requirement already satisfied: absl-py in /home/jenkins/.local/lib/python2.7/site-packages (from -r PerfKitBenchmarker/requirements.txt (line 14))
Requirement already satisfied: jinja2>=2.7 in /usr/local/lib/python2.7/dist-packages (from -r PerfKitBenchmarker/requirements.txt (line 15))
Requirement already satisfied: setuptools in ./.env/lib/python2.7/site-packages (from -r PerfKitBenchmarker/requirements.txt (line 16))
Requirement already satisfied: colorlog[windows]==2.6.0 in /home/jenkins/.local/lib/python2.7/site-packages (from -r PerfKitBenchmarker/requirements.txt (line 17))
Requirement already satisfied: blinker>=1.3 in /home/jenkins/.local/lib/python2.7/site-packages (from -r PerfKitBenchmarker/requirements.txt (line 18))
Requirement already satisfied: futures>=3.0.3 in /home/jenkins/.local/lib/python2.7/site-packages (from -r PerfKitBenchmarker/requirements.txt (line 19))
Requirement already satisfied: PyYAML==3.12 in /home/jenkins/.local/lib/python2.7/site-packages (from -r PerfKitBenchmarker/requirements.txt (line 20))
Requirement already satisfied: pint>=0.7 in /home/jenkins/.local/lib/python2.7/site-packages (from -r PerfKitBenchmarker/requirements.txt (line 21))
Collecting numpy==1.13.3 (from -r PerfKitBenchmarker/requirements.txt (line 22))
<https://builds.apache.org/job/beam_PerformanceTests_JDBC/ws/.env/local/lib/python2.7/site-packages/pip/_vendor/requests/packages/urllib3/util/ssl_.py>:318: SNIMissingWarning: An HTTPS request has been made, but the SNI (Subject Name Indication) extension to TLS is not available on this platform. This may cause the server to present an incorrect TLS certificate, which can cause validation failures. You can upgrade to a newer version of Python to solve this. For more information, see https://urllib3.readthedocs.io/en/latest/security.html#snimissingwarning.
SNIMissingWarning
<https://builds.apache.org/job/beam_PerformanceTests_JDBC/ws/.env/local/lib/python2.7/site-packages/pip/_vendor/requests/packages/urllib3/util/ssl_.py>:122: InsecurePlatformWarning: A true SSLContext object is not available. This prevents urllib3 from configuring SSL appropriately and may cause certain SSL connections to fail. You can upgrade to a newer version of Python to solve this. For more information, see https://urllib3.readthedocs.io/en/latest/security.html#insecureplatformwarning.
InsecurePlatformWarning
Using cached numpy-1.13.3-cp27-cp27mu-manylinux1_x86_64.whl
Requirement already satisfied: functools32 in /home/jenkins/.local/lib/python2.7/site-packages (from -r PerfKitBenchmarker/requirements.txt (line 23))
Requirement already satisfied: contextlib2>=0.5.1 in /home/jenkins/.local/lib/python2.7/site-packages (from -r PerfKitBenchmarker/requirements.txt (line 24))
Requirement already satisfied: pywinrm in /home/jenkins/.local/lib/python2.7/site-packages (from -r PerfKitBenchmarker/requirements.txt (line 25))
Requirement already satisfied: six in /home/jenkins/.local/lib/python2.7/site-packages (from absl-py->-r PerfKitBenchmarker/requirements.txt (line 14))
Requirement already satisfied: MarkupSafe in /usr/local/lib/python2.7/dist-packages (from jinja2>=2.7->-r PerfKitBenchmarker/requirements.txt (line 15))
Requirement already satisfied: colorama; extra == "windows" in /usr/lib/python2.7/dist-packages (from colorlog[windows]==2.6.0->-r PerfKitBenchmarker/requirements.txt (line 17))
Requirement already satisfied: xmltodict in /home/jenkins/.local/lib/python2.7/site-packages (from pywinrm->-r PerfKitBenchmarker/requirements.txt (line 25))
Requirement already satisfied: requests-ntlm>=0.3.0 in /home/jenkins/.local/lib/python2.7/site-packages (from pywinrm->-r PerfKitBenchmarker/requirements.txt (line 25))
Requirement already satisfied: requests>=2.9.1 in /home/jenkins/.local/lib/python2.7/site-packages (from pywinrm->-r PerfKitBenchmarker/requirements.txt (line 25))
Requirement already satisfied: ntlm-auth>=1.0.2 in /home/jenkins/.local/lib/python2.7/site-packages (from requests-ntlm>=0.3.0->pywinrm->-r PerfKitBenchmarker/requirements.txt (line 25))
Requirement already satisfied: cryptography>=1.3 in /home/jenkins/.local/lib/python2.7/site-packages (from requests-ntlm>=0.3.0->pywinrm->-r PerfKitBenchmarker/requirements.txt (line 25))
Requirement already satisfied: idna<2.6,>=2.5 in /home/jenkins/.local/lib/python2.7/site-packages (from requests>=2.9.1->pywinrm->-r PerfKitBenchmarker/requirements.txt (line 25))
Requirement already satisfied: urllib3<1.22,>=1.21.1 in /home/jenkins/.local/lib/python2.7/site-packages (from requests>=2.9.1->pywinrm->-r PerfKitBenchmarker/requirements.txt (line 25))
Requirement already satisfied: chardet<3.1.0,>=3.0.2 in /home/jenkins/.local/lib/python2.7/site-packages (from requests>=2.9.1->pywinrm->-r PerfKitBenchmarker/requirements.txt (line 25))
Requirement already satisfied: certifi>=2017.4.17 in /home/jenkins/.local/lib/python2.7/site-packages (from requests>=2.9.1->pywinrm->-r PerfKitBenchmarker/requirements.txt (line 25))
Requirement already satisfied: cffi>=1.7; platform_python_implementation != "PyPy" in /home/jenkins/.local/lib/python2.7/site-packages (from cryptography>=1.3->requests-ntlm>=0.3.0->pywinrm->-r PerfKitBenchmarker/requirements.txt (line 25))
Requirement already satisfied: enum34; python_version < "3" in /home/jenkins/.local/lib/python2.7/site-packages (from cryptography>=1.3->requests-ntlm>=0.3.0->pywinrm->-r PerfKitBenchmarker/requirements.txt (line 25))
Requirement already satisfied: asn1crypto>=0.21.0 in /home/jenkins/.local/lib/python2.7/site-packages (from cryptography>=1.3->requests-ntlm>=0.3.0->pywinrm->-r PerfKitBenchmarker/requirements.txt (line 25))
Requirement already satisfied: ipaddress; python_version < "3" in /usr/local/lib/python2.7/dist-packages (from cryptography>=1.3->requests-ntlm>=0.3.0->pywinrm->-r PerfKitBenchmarker/requirements.txt (line 25))
Requirement already satisfied: pycparser in /home/jenkins/.local/lib/python2.7/site-packages (from cffi>=1.7; platform_python_implementation != "PyPy"->cryptography>=1.3->requests-ntlm>=0.3.0->pywinrm->-r PerfKitBenchmarker/requirements.txt (line 25))
Installing collected packages: numpy
Found existing installation: numpy 1.11.3
Not uninstalling numpy at /home/jenkins/.local/lib/python2.7/site-packages, outside environment <https://builds.apache.org/job/beam_PerformanceTests_JDBC/ws/.env>
Successfully installed numpy-1.13.3
[beam_PerformanceTests_JDBC] $ /bin/bash -xe /tmp/jenkins7891088258642300438.sh
+ .env/bin/pip install -e 'src/sdks/python/[gcp,test]'
Obtaining file://<https://builds.apache.org/job/beam_PerformanceTests_JDBC/ws/src/sdks/python>
Requirement already satisfied: avro<2.0.0,>=1.8.1 in /home/jenkins/.local/lib/python2.7/site-packages (from apache-beam==2.4.0.dev0)
Requirement already satisfied: crcmod<2.0,>=1.7 in /home/jenkins/.local/lib/python2.7/site-packages (from apache-beam==2.4.0.dev0)
Requirement already satisfied: dill==0.2.6 in /home/jenkins/.local/lib/python2.7/site-packages (from apache-beam==2.4.0.dev0)
Requirement already satisfied: grpcio<2,>=1.0 in /home/jenkins/.local/lib/python2.7/site-packages (from apache-beam==2.4.0.dev0)
Requirement already satisfied: httplib2<0.10,>=0.8 in /home/jenkins/.local/lib/python2.7/site-packages (from apache-beam==2.4.0.dev0)
Requirement already satisfied: mock<3.0.0,>=1.0.1 in /home/jenkins/.local/lib/python2.7/site-packages (from apache-beam==2.4.0.dev0)
Requirement already satisfied: oauth2client<5,>=2.0.1 in /home/jenkins/.local/lib/python2.7/site-packages (from apache-beam==2.4.0.dev0)
Requirement already satisfied: protobuf<4,>=3.5.0.post1 in /home/jenkins/.local/lib/python2.7/site-packages (from apache-beam==2.4.0.dev0)
Requirement already satisfied: pyyaml<4.0.0,>=3.12 in /home/jenkins/.local/lib/python2.7/site-packages (from apache-beam==2.4.0.dev0)
Requirement already satisfied: pyvcf<0.7.0,>=0.6.8 in /home/jenkins/.local/lib/python2.7/site-packages (from apache-beam==2.4.0.dev0)
Requirement already satisfied: six<1.12,>=1.9 in /home/jenkins/.local/lib/python2.7/site-packages (from apache-beam==2.4.0.dev0)
Requirement already satisfied: typing<3.7.0,>=3.6.0 in /home/jenkins/.local/lib/python2.7/site-packages (from apache-beam==2.4.0.dev0)
Requirement already satisfied: futures<4.0.0,>=3.1.1 in /home/jenkins/.local/lib/python2.7/site-packages (from apache-beam==2.4.0.dev0)
Requirement already satisfied: hdfs3<0.4.0,>=0.3.0 in /home/jenkins/.local/lib/python2.7/site-packages (from apache-beam==2.4.0.dev0)
Requirement already satisfied: google-apitools<=0.5.20,>=0.5.18 in /home/jenkins/.local/lib/python2.7/site-packages (from apache-beam==2.4.0.dev0)
Requirement already satisfied: proto-google-cloud-datastore-v1<=0.90.4,>=0.90.0 in /home/jenkins/.local/lib/python2.7/site-packages (from apache-beam==2.4.0.dev0)
Requirement already satisfied: googledatastore==7.0.1 in /home/jenkins/.local/lib/python2.7/site-packages (from apache-beam==2.4.0.dev0)
Requirement already satisfied: google-cloud-pubsub==0.26.0 in /home/jenkins/.local/lib/python2.7/site-packages (from apache-beam==2.4.0.dev0)
Requirement already satisfied: google-cloud-bigquery==0.25.0 in /home/jenkins/.local/lib/python2.7/site-packages (from apache-beam==2.4.0.dev0)
Requirement already satisfied: pyhamcrest<2.0,>=1.9 in /home/jenkins/.local/lib/python2.7/site-packages (from apache-beam==2.4.0.dev0)
Requirement already satisfied: enum34>=1.0.4 in /home/jenkins/.local/lib/python2.7/site-packages (from grpcio<2,>=1.0->apache-beam==2.4.0.dev0)
Requirement already satisfied: funcsigs>=1; python_version < "3.3" in /home/jenkins/.local/lib/python2.7/site-packages (from mock<3.0.0,>=1.0.1->apache-beam==2.4.0.dev0)
Requirement already satisfied: pbr>=0.11 in /home/jenkins/.local/lib/python2.7/site-packages (from mock<3.0.0,>=1.0.1->apache-beam==2.4.0.dev0)
Requirement already satisfied: pyasn1>=0.1.7 in /home/jenkins/.local/lib/python2.7/site-packages (from oauth2client<5,>=2.0.1->apache-beam==2.4.0.dev0)
Requirement already satisfied: pyasn1-modules>=0.0.5 in /home/jenkins/.local/lib/python2.7/site-packages (from oauth2client<5,>=2.0.1->apache-beam==2.4.0.dev0)
Requirement already satisfied: rsa>=3.1.4 in /home/jenkins/.local/lib/python2.7/site-packages (from oauth2client<5,>=2.0.1->apache-beam==2.4.0.dev0)
Requirement already satisfied: setuptools in ./.env/lib/python2.7/site-packages (from protobuf<4,>=3.5.0.post1->apache-beam==2.4.0.dev0)
Requirement already satisfied: fasteners>=0.14 in /home/jenkins/.local/lib/python2.7/site-packages (from google-apitools<=0.5.20,>=0.5.18->apache-beam==2.4.0.dev0)
Requirement already satisfied: googleapis-common-protos<2.0dev,>=1.5.2 in /home/jenkins/.local/lib/python2.7/site-packages (from proto-google-cloud-datastore-v1<=0.90.4,>=0.90.0->apache-beam==2.4.0.dev0)
Requirement already satisfied: google-cloud-core<0.26dev,>=0.25.0 in /home/jenkins/.local/lib/python2.7/site-packages (from google-cloud-pubsub==0.26.0->apache-beam==2.4.0.dev0)
Requirement already satisfied: gapic-google-cloud-pubsub-v1<0.16dev,>=0.15.0 in /home/jenkins/.local/lib/python2.7/site-packages (from google-cloud-pubsub==0.26.0->apache-beam==2.4.0.dev0)
Requirement already satisfied: monotonic>=0.1 in /home/jenkins/.local/lib/python2.7/site-packages (from fasteners>=0.14->google-apitools<=0.5.20,>=0.5.18->apache-beam==2.4.0.dev0)
Requirement already satisfied: google-auth<2.0.0dev,>=0.4.0 in /home/jenkins/.local/lib/python2.7/site-packages (from google-cloud-core<0.26dev,>=0.25.0->google-cloud-pubsub==0.26.0->apache-beam==2.4.0.dev0)
Requirement already satisfied: google-auth-httplib2 in /home/jenkins/.local/lib/python2.7/site-packages (from google-cloud-core<0.26dev,>=0.25.0->google-cloud-pubsub==0.26.0->apache-beam==2.4.0.dev0)
Requirement already satisfied: google-gax<0.16dev,>=0.15.7 in /home/jenkins/.local/lib/python2.7/site-packages (from gapic-google-cloud-pubsub-v1<0.16dev,>=0.15.0->google-cloud-pubsub==0.26.0->apache-beam==2.4.0.dev0)
Requirement already satisfied: proto-google-cloud-pubsub-v1[grpc]<0.16dev,>=0.15.4 in /home/jenkins/.local/lib/python2.7/site-packages (from gapic-google-cloud-pubsub-v1<0.16dev,>=0.15.0->google-cloud-pubsub==0.26.0->apache-beam==2.4.0.dev0)
Requirement already satisfied: grpc-google-iam-v1<0.12dev,>=0.11.1 in /home/jenkins/.local/lib/python2.7/site-packages (from gapic-google-cloud-pubsub-v1<0.16dev,>=0.15.0->google-cloud-pubsub==0.26.0->apache-beam==2.4.0.dev0)
Requirement already satisfied: cachetools>=2.0.0 in /home/jenkins/.local/lib/python2.7/site-packages (from google-auth<2.0.0dev,>=0.4.0->google-cloud-core<0.26dev,>=0.25.0->google-cloud-pubsub==0.26.0->apache-beam==2.4.0.dev0)
Requirement already satisfied: future<0.17dev,>=0.16.0 in /home/jenkins/.local/lib/python2.7/site-packages (from google-gax<0.16dev,>=0.15.7->gapic-google-cloud-pubsub-v1<0.16dev,>=0.15.0->google-cloud-pubsub==0.26.0->apache-beam==2.4.0.dev0)
Requirement already satisfied: ply==3.8 in /home/jenkins/.local/lib/python2.7/site-packages (from google-gax<0.16dev,>=0.15.7->gapic-google-cloud-pubsub-v1<0.16dev,>=0.15.0->google-cloud-pubsub==0.26.0->apache-beam==2.4.0.dev0)
Requirement already satisfied: requests<3.0dev,>=2.13.0 in /home/jenkins/.local/lib/python2.7/site-packages (from google-gax<0.16dev,>=0.15.7->gapic-google-cloud-pubsub-v1<0.16dev,>=0.15.0->google-cloud-pubsub==0.26.0->apache-beam==2.4.0.dev0)
Requirement already satisfied: idna<2.6,>=2.5 in /home/jenkins/.local/lib/python2.7/site-packages (from requests<3.0dev,>=2.13.0->google-gax<0.16dev,>=0.15.7->gapic-google-cloud-pubsub-v1<0.16dev,>=0.15.0->google-cloud-pubsub==0.26.0->apache-beam==2.4.0.dev0)
Requirement already satisfied: urllib3<1.22,>=1.21.1 in /home/jenkins/.local/lib/python2.7/site-packages (from requests<3.0dev,>=2.13.0->google-gax<0.16dev,>=0.15.7->gapic-google-cloud-pubsub-v1<0.16dev,>=0.15.0->google-cloud-pubsub==0.26.0->apache-beam==2.4.0.dev0)
Requirement already satisfied: chardet<3.1.0,>=3.0.2 in /home/jenkins/.local/lib/python2.7/site-packages (from requests<3.0dev,>=2.13.0->google-gax<0.16dev,>=0.15.7->gapic-google-cloud-pubsub-v1<0.16dev,>=0.15.0->google-cloud-pubsub==0.26.0->apache-beam==2.4.0.dev0)
Requirement already satisfied: certifi>=2017.4.17 in /home/jenkins/.local/lib/python2.7/site-packages (from requests<3.0dev,>=2.13.0->google-gax<0.16dev,>=0.15.7->gapic-google-cloud-pubsub-v1<0.16dev,>=0.15.0->google-cloud-pubsub==0.26.0->apache-beam==2.4.0.dev0)
Installing collected packages: apache-beam
Found existing installation: apache-beam 2.4.0.dev0
Not uninstalling apache-beam at /home/jenkins/jenkins-slave/workspace/beam_PerformanceTests_TextIOIT/src/sdks/python, outside environment <https://builds.apache.org/job/beam_PerformanceTests_JDBC/ws/.env>
Running setup.py develop for apache-beam
Successfully installed apache-beam
[beam_PerformanceTests_JDBC] $ /bin/bash -xe /tmp/jenkins2535636852766120773.sh
+ .env/bin/python PerfKitBenchmarker/pkb.py --project=apache-beam-testing --dpb_log_level=INFO --maven_binary=/home/jenkins/tools/maven/latest/bin/mvn --bigquery_table=beam_performance.JdbcIOIT_pkb_results --temp_dir=<https://builds.apache.org/job/beam_PerformanceTests_JDBC/ws/> --official=true --kubeconfig=/home/jenkins/.kube/config --beam_it_timeout=1200 --benchmarks=beam_integration_benchmark --beam_it_profile=io-it --beam_prebuilt=true --beam_sdk=java --beam_it_module=sdks/java/io/jdbc --beam_it_class=org.apache.beam.sdk.io.jdbc.JdbcIOIT --beam_it_options=--tempRoot=gs://temp-storage-for-end-to-end-tests,--project=apache-beam-testing,--postgresServerName=10.36.0.11,--postgresUsername=postgres,--postgresDatabaseName=postgres,--postgresPassword=uuinkks,--postgresSsl=false --beam_kubernetes_scripts=<https://builds.apache.org/job/beam_PerformanceTests_JDBC/ws/.test-infra/kubernetes/postgres/postgres.yml> --beam_options_config_file=<https://builds.apache.org/job/beam_PerformanceTests_JDBC/ws/.test-infra/kubernetes/postgres/pkb-config.yml>
2018-02-05 14:59:53,804 d6e1792b MainThread INFO Verbose logging to: <https://builds.apache.org/job/beam_PerformanceTests_JDBC/ws/runs/d6e1792b/pkb.log>
2018-02-05 14:59:53,804 d6e1792b MainThread INFO PerfKitBenchmarker version: v1.12.0-260-ge324e61
2018-02-05 14:59:53,805 d6e1792b MainThread INFO Flag values:
--beam_it_class=org.apache.beam.sdk.io.jdbc.JdbcIOIT
--beam_it_timeout=1200
--beam_sdk=java
--temp_dir=<https://builds.apache.org/job/beam_PerformanceTests_JDBC/ws/>
--maven_binary=/home/jenkins/tools/maven/latest/bin/mvn
--beam_it_options=--tempRoot=gs://temp-storage-for-end-to-end-tests,--project=apache-beam-testing,--postgresServerName=10.36.0.11,--postgresUsername=postgres,--postgresDatabaseName=postgres,--postgresPassword=uuinkks,--postgresSsl=false
--beam_prebuilt
--kubeconfig=/home/jenkins/.kube/config
--project=apache-beam-testing
--beam_kubernetes_scripts=<https://builds.apache.org/job/beam_PerformanceTests_JDBC/ws/.test-infra/kubernetes/postgres/postgres.yml>
--bigquery_table=beam_performance.JdbcIOIT_pkb_results
--official
--beam_it_module=sdks/java/io/jdbc
--dpb_log_level=INFO
--beam_options_config_file=<https://builds.apache.org/job/beam_PerformanceTests_JDBC/ws/.test-infra/kubernetes/postgres/pkb-config.yml>
--beam_it_profile=io-it
--benchmarks=beam_integration_benchmark
2018-02-05 14:59:54,064 d6e1792b MainThread WARNING The key "flags" was not in the default config, but was in user overrides. This may indicate a typo.
2018-02-05 14:59:54,064 d6e1792b MainThread INFO Initializing the edw service decoder
2018-02-05 14:59:54,133 d6e1792b MainThread ERROR Prerequisite check failed for beam_integration_benchmark
Traceback (most recent call last):
File "<https://builds.apache.org/job/beam_PerformanceTests_JDBC/ws/PerfKitBenchmarker/perfkitbenchmarker/pkb.py",> line 403, in _CreateBenchmarkSpecs
check_prereqs(config)
File "<https://builds.apache.org/job/beam_PerformanceTests_JDBC/ws/PerfKitBenchmarker/perfkitbenchmarker/linux_benchmarks/beam_integration_benchmark.py",> line 102, in CheckPrerequisites
raise Exception("beam_it_options must be of form"
Exception: beam_it_options must be of form ["--option=value","--option2=val2"]
Traceback (most recent call last):
File "PerfKitBenchmarker/pkb.py", line 21, in <module>
sys.exit(Main())
File "<https://builds.apache.org/job/beam_PerformanceTests_JDBC/ws/PerfKitBenchmarker/perfkitbenchmarker/pkb.py",> line 870, in Main
return RunBenchmarks()
File "<https://builds.apache.org/job/beam_PerformanceTests_JDBC/ws/PerfKitBenchmarker/perfkitbenchmarker/pkb.py",> line 777, in RunBenchmarks
benchmark_specs = _CreateBenchmarkSpecs()
File "<https://builds.apache.org/job/beam_PerformanceTests_JDBC/ws/PerfKitBenchmarker/perfkitbenchmarker/pkb.py",> line 403, in _CreateBenchmarkSpecs
check_prereqs(config)
File "<https://builds.apache.org/job/beam_PerformanceTests_JDBC/ws/PerfKitBenchmarker/perfkitbenchmarker/linux_benchmarks/beam_integration_benchmark.py",> line 102, in CheckPrerequisites
raise Exception("beam_it_options must be of form"
Exception: beam_it_options must be of form ["--option=value","--option2=val2"]
Build step 'Execute shell' marked build as failure
Build failed in Jenkins: beam_PerformanceTests_JDBC #233
Posted by Apache Jenkins Server <je...@builds.apache.org>.
See <https://builds.apache.org/job/beam_PerformanceTests_JDBC/233/display/redirect>
------------------------------------------
[...truncated 282 B...]
[EnvInject] - Loading node environment variables.
Building remotely on beam2 (beam) in workspace <https://builds.apache.org/job/beam_PerformanceTests_JDBC/ws/>
> git rev-parse --is-inside-work-tree # timeout=10
Fetching changes from the remote Git repository
> git config remote.origin.url https://github.com/apache/beam.git # timeout=10
Fetching upstream changes from https://github.com/apache/beam.git
> git --version # timeout=10
> git fetch --tags --progress https://github.com/apache/beam.git +refs/heads/*:refs/remotes/origin/* +refs/pull/4585/*:refs/remotes/origin/pr/4585/*
> git rev-parse refs/remotes/origin/pr/4585/merge^{commit} # timeout=10
> git rev-parse refs/remotes/origin/origin/pr/4585/merge^{commit} # timeout=10
Checking out Revision cdd4ca35a9b4a8b415dab2c0df3b1f6f44c7492f (refs/remotes/origin/pr/4585/merge)
> git config core.sparsecheckout # timeout=10
> git checkout -f cdd4ca35a9b4a8b415dab2c0df3b1f6f44c7492f
Commit message: "Merge f521bcb07aa1097bc1cda7300a6e4a446e068a1c into 93818abf901dd996aa30445457153811b13ece43"
First time build. Skipping changelog.
Cleaning workspace
> git rev-parse --verify HEAD # timeout=10
Resetting working tree
> git reset --hard # timeout=10
> git clean -fdx # timeout=10
[EnvInject] - Executing scripts and injecting environment variables after the SCM step.
[EnvInject] - Injecting as environment variables the properties content
SPARK_LOCAL_IP=127.0.0.1
[EnvInject] - Variables injected successfully.
[beam_PerformanceTests_JDBC] $ /bin/bash -xe /tmp/jenkins1810647867324642778.sh
+ gcloud container clusters list
NAME ZONE MASTER_VERSION MASTER_IP MACHINE_TYPE NODE_VERSION NUM_NODES STATUS
io-datastores us-central1-a 1.7.11-gke.1 104.154.102.21 n1-standard-1 1.7.11-gke.1 1 RUNNING
[beam_PerformanceTests_JDBC] $ /bin/bash -xe /tmp/jenkins7476215323738956507.sh
+ gcloud container clusters get-credentials io-datastores --zone=us-central1-a --verbosity=debug
DEBUG: Running gcloud.container.clusters.get-credentials with Namespace(__calliope_internal_deepest_parser=ArgumentParser(prog='gcloud.container.clusters.get-credentials', usage=None, description='See https://cloud.google.com/container-engine/docs/kubectl for\nkubectl documentation.', version=None, formatter_class=<class 'argparse.HelpFormatter'>, conflict_handler='error', add_help=False), account=None, api_version=None, authority_selector=None, authorization_token_file=None, cmd_func=<bound method Command.Run of <googlecloudsdk.calliope.backend.Command object at 0x7f173661e790>>, command_path=['gcloud', 'container', 'clusters', 'get-credentials'], configuration=None, credential_file_override=None, document=None, format=None, h=None, help=None, http_timeout=None, log_http=None, name='io-datastores', project=None, quiet=None, trace_email=None, trace_log=None, trace_token=None, user_output_enabled=None, verbosity='debug', version=None, zone='us-central1-a').
WARNING: Accessing a Container Engine cluster requires the kubernetes commandline
client [kubectl]. To install, run
$ gcloud components install kubectl
Fetching cluster endpoint and auth data.
DEBUG: unable to load default kubeconfig: [Errno 2] No such file or directory: '/home/jenkins/.kube/config'; recreating /home/jenkins/.kube/config
DEBUG: Saved kubeconfig to /home/jenkins/.kube/config
kubeconfig entry generated for io-datastores.
INFO: Display format "default".
[beam_PerformanceTests_JDBC] $ /bin/bash -xe /tmp/jenkins7724032151790843545.sh
+ find / -regex '.*kube.*config.*'
/home/jenkins/jenkins-slave/workspace/beam_PostCommit_Java_MavenInstall/src/.test-infra/kubernetes/hadoop/SmallITCluster/pkb-config.yml
/home/jenkins/jenkins-slave/workspace/beam_PostCommit_Java_MavenInstall/src/.test-infra/kubernetes/hadoop/config-files
/home/jenkins/jenkins-slave/workspace/beam_PostCommit_Java_MavenInstall/src/.test-infra/kubernetes/hadoop/config-files/hdfs-site.xml
/home/jenkins/jenkins-slave/workspace/beam_PostCommit_Java_MavenInstall/src/.test-infra/kubernetes/hadoop/config-files/hdfs-envs
/home/jenkins/jenkins-slave/workspace/beam_PostCommit_Java_MavenInstall/src/.test-infra/kubernetes/hadoop/config-files/core-site.xml
/home/jenkins/jenkins-slave/workspace/beam_PostCommit_Java_MavenInstall/src/.test-infra/kubernetes/postgres/pkb-config-local.yml
/home/jenkins/jenkins-slave/workspace/beam_PostCommit_Java_MavenInstall/src/.test-infra/kubernetes/postgres/pkb-config.yml
/home/jenkins/jenkins-slave/workspace/beam_PerformanceTests_TFRecordIOIT/src/.test-infra/kubernetes/hadoop/config-files
/home/jenkins/jenkins-slave/workspace/beam_PerformanceTests_TFRecordIOIT/src/.test-infra/kubernetes/hadoop/config-files/hdfs-site.xml
/home/jenkins/jenkins-slave/workspace/beam_PerformanceTests_TFRecordIOIT/src/.test-infra/kubernetes/hadoop/config-files/hdfs-envs
/home/jenkins/jenkins-slave/workspace/beam_PerformanceTests_TFRecordIOIT/src/.test-infra/kubernetes/hadoop/config-files/core-site.xml
/home/jenkins/jenkins-slave/workspace/beam_PerformanceTests_TFRecordIOIT/src/.test-infra/kubernetes/postgres/pkb-config-local.yml
/home/jenkins/jenkins-slave/workspace/beam_PerformanceTests_TFRecordIOIT/src/.test-infra/kubernetes/postgres/pkb-config.yml
/home/jenkins/jenkins-slave/workspace/beam_PreCommit_Java_GradleBuild@2/src/.test-infra/kubernetes/hadoop/config-files
/home/jenkins/jenkins-slave/workspace/beam_PreCommit_Java_GradleBuild@2/src/.test-infra/kubernetes/hadoop/config-files/hdfs-site.xml
/home/jenkins/jenkins-slave/workspace/beam_PreCommit_Java_GradleBuild@2/src/.test-infra/kubernetes/hadoop/config-files/hdfs-envs
/home/jenkins/jenkins-slave/workspace/beam_PreCommit_Java_GradleBuild@2/src/.test-infra/kubernetes/hadoop/config-files/core-site.xml
/home/jenkins/jenkins-slave/workspace/beam_PreCommit_Java_GradleBuild@2/src/.test-infra/kubernetes/postgres/pkb-config-local.yml
/home/jenkins/jenkins-slave/workspace/beam_PreCommit_Java_GradleBuild@2/src/.test-infra/kubernetes/postgres/pkb-config.yml
/home/jenkins/jenkins-slave/workspace/beam_PerformanceTests_AvroIOIT/runs/b15ef976/beam/.test-infra/kubernetes/hadoop/SmallITCluster/pkb-config.yml
/home/jenkins/jenkins-slave/workspace/beam_PerformanceTests_AvroIOIT/runs/b15ef976/beam/.test-infra/kubernetes/hadoop/config-files
/home/jenkins/jenkins-slave/workspace/beam_PerformanceTests_AvroIOIT/runs/b15ef976/beam/.test-infra/kubernetes/hadoop/config-files/hdfs-site.xml
/home/jenkins/jenkins-slave/workspace/beam_PerformanceTests_AvroIOIT/runs/b15ef976/beam/.test-infra/kubernetes/hadoop/config-files/hdfs-envs
/home/jenkins/jenkins-slave/workspace/beam_PerformanceTests_AvroIOIT/runs/b15ef976/beam/.test-infra/kubernetes/hadoop/config-files/core-site.xml
/home/jenkins/jenkins-slave/workspace/beam_PerformanceTests_AvroIOIT/runs/b15ef976/beam/.test-infra/kubernetes/postgres/pkb-config-local.yml
/home/jenkins/jenkins-slave/workspace/beam_PerformanceTests_AvroIOIT/runs/b15ef976/beam/.test-infra/kubernetes/postgres/pkb-config.yml
/home/jenkins/jenkins-slave/workspace/beam_PerformanceTests_AvroIOIT/src/.test-infra/kubernetes/hadoop/SmallITCluster/pkb-config.yml
/home/jenkins/jenkins-slave/workspace/beam_PerformanceTests_AvroIOIT/src/.test-infra/kubernetes/hadoop/config-files
/home/jenkins/jenkins-slave/workspace/beam_PerformanceTests_AvroIOIT/src/.test-infra/kubernetes/hadoop/config-files/hdfs-site.xml
/home/jenkins/jenkins-slave/workspace/beam_PerformanceTests_AvroIOIT/src/.test-infra/kubernetes/hadoop/config-files/hdfs-envs
/home/jenkins/jenkins-slave/workspace/beam_PerformanceTests_AvroIOIT/src/.test-infra/kubernetes/hadoop/config-files/core-site.xml
/home/jenkins/jenkins-slave/workspace/beam_PerformanceTests_AvroIOIT/src/.test-infra/kubernetes/postgres/pkb-config-local.yml
/home/jenkins/jenkins-slave/workspace/beam_PerformanceTests_AvroIOIT/src/.test-infra/kubernetes/postgres/pkb-config.yml
/home/jenkins/jenkins-slave/workspace/beam_PreCommit_Python_MavenInstall/src/.test-infra/kubernetes/hadoop/SmallITCluster/pkb-config.yml
/home/jenkins/jenkins-slave/workspace/beam_PreCommit_Python_MavenInstall/src/.test-infra/kubernetes/hadoop/config-files
/home/jenkins/jenkins-slave/workspace/beam_PreCommit_Python_MavenInstall/src/.test-infra/kubernetes/hadoop/config-files/hdfs-site.xml
/home/jenkins/jenkins-slave/workspace/beam_PreCommit_Python_MavenInstall/src/.test-infra/kubernetes/hadoop/config-files/hdfs-envs
/home/jenkins/jenkins-slave/workspace/beam_PreCommit_Python_MavenInstall/src/.test-infra/kubernetes/hadoop/config-files/core-site.xml
/home/jenkins/jenkins-slave/workspace/beam_PreCommit_Python_MavenInstall/src/.test-infra/kubernetes/postgres/pkb-config-local.yml
/home/jenkins/jenkins-slave/workspace/beam_PreCommit_Python_MavenInstall/src/.test-infra/kubernetes/postgres/pkb-config.yml
/home/jenkins/jenkins-slave/workspace/beam_PostCommit_Java_JDK_Versions_Test/jdk/OpenJDK 8 (on Ubuntu only)/label/beam/src/.test-infra/kubernetes/hadoop/SmallITCluster/pkb-config.yml
/home/jenkins/jenkins-slave/workspace/beam_PostCommit_Java_JDK_Versions_Test/jdk/OpenJDK 8 (on Ubuntu only)/label/beam/src/.test-infra/kubernetes/hadoop/config-files
/home/jenkins/jenkins-slave/workspace/beam_PostCommit_Java_JDK_Versions_Test/jdk/OpenJDK 8 (on Ubuntu only)/label/beam/src/.test-infra/kubernetes/hadoop/config-files/hdfs-site.xml
/home/jenkins/jenkins-slave/workspace/beam_PostCommit_Java_JDK_Versions_Test/jdk/OpenJDK 8 (on Ubuntu only)/label/beam/src/.test-infra/kubernetes/hadoop/config-files/hdfs-envs
/home/jenkins/jenkins-slave/workspace/beam_PostCommit_Java_JDK_Versions_Test/jdk/OpenJDK 8 (on Ubuntu only)/label/beam/src/.test-infra/kubernetes/hadoop/config-files/core-site.xml
/home/jenkins/jenkins-slave/workspace/beam_PostCommit_Java_JDK_Versions_Test/jdk/OpenJDK 8 (on Ubuntu only)/label/beam/src/.test-infra/kubernetes/postgres/pkb-config-local.yml
/home/jenkins/jenkins-slave/workspace/beam_PostCommit_Java_JDK_Versions_Test/jdk/OpenJDK 8 (on Ubuntu only)/label/beam/src/.test-infra/kubernetes/postgres/pkb-config.yml
/home/jenkins/jenkins-slave/workspace/beam_PostCommit_Java_JDK_Versions_Test/jdk/JDK 1.7 (latest)/label/beam/src/.test-infra/kubernetes/hadoop/SmallITCluster/pkb-config.yml
/home/jenkins/jenkins-slave/workspace/beam_PostCommit_Java_JDK_Versions_Test/jdk/JDK 1.7 (latest)/label/beam/src/.test-infra/kubernetes/hadoop/config-files
/home/jenkins/jenkins-slave/workspace/beam_PostCommit_Java_JDK_Versions_Test/jdk/JDK 1.7 (latest)/label/beam/src/.test-infra/kubernetes/hadoop/config-files/hdfs-site.xml
/home/jenkins/jenkins-slave/workspace/beam_PostCommit_Java_JDK_Versions_Test/jdk/JDK 1.7 (latest)/label/beam/src/.test-infra/kubernetes/hadoop/config-files/hdfs-envs
/home/jenkins/jenkins-slave/workspace/beam_PostCommit_Java_JDK_Versions_Test/jdk/JDK 1.7 (latest)/label/beam/src/.test-infra/kubernetes/hadoop/config-files/core-site.xml
/home/jenkins/jenkins-slave/workspace/beam_PostCommit_Java_JDK_Versions_Test/jdk/JDK 1.7 (latest)/label/beam/src/.test-infra/kubernetes/postgres/pkb-config-local.yml
/home/jenkins/jenkins-slave/workspace/beam_PostCommit_Java_JDK_Versions_Test/jdk/JDK 1.7 (latest)/label/beam/src/.test-infra/kubernetes/postgres/pkb-config.yml
/home/jenkins/jenkins-slave/workspace/beam_PostCommit_Java_ValidatesRunner_Dataflow/src/.test-infra/kubernetes/hadoop/SmallITCluster/pkb-config.yml
/home/jenkins/jenkins-slave/workspace/beam_PostCommit_Java_ValidatesRunner_Dataflow/src/.test-infra/kubernetes/hadoop/config-files
/home/jenkins/jenkins-slave/workspace/beam_PostCommit_Java_ValidatesRunner_Dataflow/src/.test-infra/kubernetes/hadoop/config-files/hdfs-site.xml
/home/jenkins/jenkins-slave/workspace/beam_PostCommit_Java_ValidatesRunner_Dataflow/src/.test-infra/kubernetes/hadoop/config-files/hdfs-envs
/home/jenkins/jenkins-slave/workspace/beam_PostCommit_Java_ValidatesRunner_Dataflow/src/.test-infra/kubernetes/hadoop/config-files/core-site.xml
/home/jenkins/jenkins-slave/workspace/beam_PostCommit_Java_ValidatesRunner_Dataflow/src/.test-infra/kubernetes/postgres/pkb-config-local.yml
/home/jenkins/jenkins-slave/workspace/beam_PostCommit_Java_ValidatesRunner_Dataflow/src/.test-infra/kubernetes/postgres/pkb-config.yml
/home/jenkins/jenkins-slave/workspace/beam_PreCommit_Java_GradleBuild/src/.test-infra/kubernetes/hadoop/SmallITCluster/pkb-config.yml
/home/jenkins/jenkins-slave/workspace/beam_PreCommit_Java_GradleBuild/src/.test-infra/kubernetes/hadoop/config-files
/home/jenkins/jenkins-slave/workspace/beam_PreCommit_Java_GradleBuild/src/.test-infra/kubernetes/hadoop/config-files/hdfs-site.xml
/home/jenkins/jenkins-slave/workspace/beam_PreCommit_Java_GradleBuild/src/.test-infra/kubernetes/hadoop/config-files/hdfs-envs
/home/jenkins/jenkins-slave/workspace/beam_PreCommit_Java_GradleBuild/src/.test-infra/kubernetes/hadoop/config-files/core-site.xml
/home/jenkins/jenkins-slave/workspace/beam_PreCommit_Java_GradleBuild/src/.test-infra/kubernetes/postgres/pkb-config-local.yml
/home/jenkins/jenkins-slave/workspace/beam_PreCommit_Java_GradleBuild/src/.test-infra/kubernetes/postgres/pkb-config.yml
/home/jenkins/jenkins-slave/workspace/beam_PostCommit_Java_ValidatesRunner_Apex/src/.test-infra/kubernetes/hadoop/SmallITCluster/pkb-config.yml
/home/jenkins/jenkins-slave/workspace/beam_PostCommit_Java_ValidatesRunner_Apex/src/.test-infra/kubernetes/hadoop/config-files
/home/jenkins/jenkins-slave/workspace/beam_PostCommit_Java_ValidatesRunner_Apex/src/.test-infra/kubernetes/hadoop/config-files/hdfs-site.xml
/home/jenkins/jenkins-slave/workspace/beam_PostCommit_Java_ValidatesRunner_Apex/src/.test-infra/kubernetes/hadoop/config-files/hdfs-envs
/home/jenkins/jenkins-slave/workspace/beam_PostCommit_Java_ValidatesRunner_Apex/src/.test-infra/kubernetes/hadoop/config-files/core-site.xml
/home/jenkins/jenkins-slave/workspace/beam_PostCommit_Java_ValidatesRunner_Apex/src/.test-infra/kubernetes/postgres/pkb-config-local.yml
/home/jenkins/jenkins-slave/workspace/beam_PostCommit_Java_ValidatesRunner_Apex/src/.test-infra/kubernetes/postgres/pkb-config.yml
/home/jenkins/jenkins-slave/workspace/beam_Release_NightlySnapshot/src/.test-infra/kubernetes/hadoop/config-files
/home/jenkins/jenkins-slave/workspace/beam_Release_NightlySnapshot/src/.test-infra/kubernetes/hadoop/config-files/hdfs-site.xml
/home/jenkins/jenkins-slave/workspace/beam_Release_NightlySnapshot/src/.test-infra/kubernetes/hadoop/config-files/hdfs-envs
/home/jenkins/jenkins-slave/workspace/beam_Release_NightlySnapshot/src/.test-infra/kubernetes/hadoop/config-files/core-site.xml
/home/jenkins/jenkins-slave/workspace/beam_Release_NightlySnapshot/src/.test-infra/kubernetes/postgres/pkb-config-local.yml
/home/jenkins/jenkins-slave/workspace/beam_Release_NightlySnapshot/src/.test-infra/kubernetes/postgres/pkb-config.yml
<https://builds.apache.org/job/beam_PerformanceTests_JDBC/ws/src/.test-infra/kubernetes/hadoop/SmallITCluster/pkb-config.yml>
<https://builds.apache.org/job/beam_PerformanceTests_JDBC/ws/src/.test-infra/kubernetes/hadoop/config-files>
<https://builds.apache.org/job/beam_PerformanceTests_JDBC/ws/src/.test-infra/kubernetes/hadoop/config-files/hdfs-site.xml>
<https://builds.apache.org/job/beam_PerformanceTests_JDBC/ws/src/.test-infra/kubernetes/hadoop/config-files/hdfs-envs>
<https://builds.apache.org/job/beam_PerformanceTests_JDBC/ws/src/.test-infra/kubernetes/hadoop/config-files/core-site.xml>
<https://builds.apache.org/job/beam_PerformanceTests_JDBC/ws/src/.test-infra/kubernetes/postgres/pkb-config-local.yml>
<https://builds.apache.org/job/beam_PerformanceTests_JDBC/ws/src/.test-infra/kubernetes/postgres/pkb-config.yml>
/home/jenkins/jenkins-slave/workspace/beam_SeedJob/.test-infra/kubernetes/hadoop/SmallITCluster/pkb-config.yml
/home/jenkins/jenkins-slave/workspace/beam_SeedJob/.test-infra/kubernetes/hadoop/config-files
/home/jenkins/jenkins-slave/workspace/beam_SeedJob/.test-infra/kubernetes/hadoop/config-files/hdfs-site.xml
/home/jenkins/jenkins-slave/workspace/beam_SeedJob/.test-infra/kubernetes/hadoop/config-files/hdfs-envs
/home/jenkins/jenkins-slave/workspace/beam_SeedJob/.test-infra/kubernetes/hadoop/config-files/core-site.xml
/home/jenkins/jenkins-slave/workspace/beam_SeedJob/.test-infra/kubernetes/postgres/pkb-config-local.yml
/home/jenkins/jenkins-slave/workspace/beam_SeedJob/.test-infra/kubernetes/postgres/pkb-config.yml
/home/jenkins/jenkins-slave/workspace/beam_PreCommit_Go_MavenInstall/src/.test-infra/kubernetes/hadoop/SmallITCluster/pkb-config.yml
/home/jenkins/jenkins-slave/workspace/beam_PreCommit_Go_MavenInstall/src/.test-infra/kubernetes/hadoop/config-files
/home/jenkins/jenkins-slave/workspace/beam_PreCommit_Go_MavenInstall/src/.test-infra/kubernetes/hadoop/config-files/hdfs-site.xml
/home/jenkins/jenkins-slave/workspace/beam_PreCommit_Go_MavenInstall/src/.test-infra/kubernetes/hadoop/config-files/hdfs-envs
/home/jenkins/jenkins-slave/workspace/beam_PreCommit_Go_MavenInstall/src/.test-infra/kubernetes/hadoop/config-files/core-site.xml
/home/jenkins/jenkins-slave/workspace/beam_PreCommit_Go_MavenInstall/src/.test-infra/kubernetes/postgres/pkb-config-local.yml
/home/jenkins/jenkins-slave/workspace/beam_PreCommit_Go_MavenInstall/src/.test-infra/kubernetes/postgres/pkb-config.yml
/home/jenkins/jenkins-slave/workspace/beam_PreCommit_Python_MavenInstall@2/src/.test-infra/kubernetes/hadoop/SmallITCluster/pkb-config.yml
/home/jenkins/jenkins-slave/workspace/beam_PreCommit_Python_MavenInstall@2/src/.test-infra/kubernetes/hadoop/config-files
/home/jenkins/jenkins-slave/workspace/beam_PreCommit_Python_MavenInstall@2/src/.test-infra/kubernetes/hadoop/config-files/hdfs-site.xml
/home/jenkins/jenkins-slave/workspace/beam_PreCommit_Python_MavenInstall@2/src/.test-infra/kubernetes/hadoop/config-files/hdfs-envs
/home/jenkins/jenkins-slave/workspace/beam_PreCommit_Python_MavenInstall@2/src/.test-infra/kubernetes/hadoop/config-files/core-site.xml
/home/jenkins/jenkins-slave/workspace/beam_PreCommit_Python_MavenInstall@2/src/.test-infra/kubernetes/postgres/pkb-config-local.yml
/home/jenkins/jenkins-slave/workspace/beam_PreCommit_Python_MavenInstall@2/src/.test-infra/kubernetes/postgres/pkb-config.yml
/home/jenkins/jenkins-slave/workspace/beam_PreCommit_Java_MavenInstall@2/src/.test-infra/kubernetes/hadoop/SmallITCluster/pkb-config.yml
/home/jenkins/jenkins-slave/workspace/beam_PreCommit_Java_MavenInstall@2/src/.test-infra/kubernetes/hadoop/config-files
/home/jenkins/jenkins-slave/workspace/beam_PreCommit_Java_MavenInstall@2/src/.test-infra/kubernetes/hadoop/config-files/hdfs-site.xml
/home/jenkins/jenkins-slave/workspace/beam_PreCommit_Java_MavenInstall@2/src/.test-infra/kubernetes/hadoop/config-files/hdfs-envs
/home/jenkins/jenkins-slave/workspace/beam_PreCommit_Java_MavenInstall@2/src/.test-infra/kubernetes/hadoop/config-files/core-site.xml
/home/jenkins/jenkins-slave/workspace/beam_PreCommit_Java_MavenInstall@2/src/.test-infra/kubernetes/postgres/pkb-config-local.yml
/home/jenkins/jenkins-slave/workspace/beam_PreCommit_Java_MavenInstall@2/src/.test-infra/kubernetes/postgres/pkb-config.yml
/home/jenkins/jenkins-slave/workspace/beam_PostRelease_NightlySnapshot/src/.test-infra/kubernetes/hadoop/SmallITCluster/pkb-config.yml
/home/jenkins/jenkins-slave/workspace/beam_PostRelease_NightlySnapshot/src/.test-infra/kubernetes/hadoop/config-files
/home/jenkins/jenkins-slave/workspace/beam_PostRelease_NightlySnapshot/src/.test-infra/kubernetes/hadoop/config-files/hdfs-site.xml
/home/jenkins/jenkins-slave/workspace/beam_PostRelease_NightlySnapshot/src/.test-infra/kubernetes/hadoop/config-files/hdfs-envs
/home/jenkins/jenkins-slave/workspace/beam_PostRelease_NightlySnapshot/src/.test-infra/kubernetes/hadoop/config-files/core-site.xml
/home/jenkins/jenkins-slave/workspace/beam_PostRelease_NightlySnapshot/src/.test-infra/kubernetes/postgres/pkb-config-local.yml
/home/jenkins/jenkins-slave/workspace/beam_PostRelease_NightlySnapshot/src/.test-infra/kubernetes/postgres/pkb-config.yml
/home/jenkins/jenkins-slave/workspace/beam_SeedJob_Standalone/.test-infra/kubernetes/hadoop/SmallITCluster/pkb-config.yml
/home/jenkins/jenkins-slave/workspace/beam_SeedJob_Standalone/.test-infra/kubernetes/hadoop/config-files
/home/jenkins/jenkins-slave/workspace/beam_SeedJob_Standalone/.test-infra/kubernetes/hadoop/config-files/hdfs-site.xml
/home/jenkins/jenkins-slave/workspace/beam_SeedJob_Standalone/.test-infra/kubernetes/hadoop/config-files/hdfs-envs
/home/jenkins/jenkins-slave/workspace/beam_SeedJob_Standalone/.test-infra/kubernetes/hadoop/config-files/core-site.xml
/home/jenkins/jenkins-slave/workspace/beam_SeedJob_Standalone/.test-infra/kubernetes/postgres/pkb-config-local.yml
/home/jenkins/jenkins-slave/workspace/beam_SeedJob_Standalone/.test-infra/kubernetes/postgres/pkb-config.yml
/home/jenkins/jenkins-slave/workspace/beam_PreCommit_Java_MavenInstall/src/.test-infra/kubernetes/hadoop/SmallITCluster/pkb-config.yml
/home/jenkins/jenkins-slave/workspace/beam_PreCommit_Java_MavenInstall/src/.test-infra/kubernetes/hadoop/config-files
/home/jenkins/jenkins-slave/workspace/beam_PreCommit_Java_MavenInstall/src/.test-infra/kubernetes/hadoop/config-files/hdfs-site.xml
/home/jenkins/jenkins-slave/workspace/beam_PreCommit_Java_MavenInstall/src/.test-infra/kubernetes/hadoop/config-files/hdfs-envs
/home/jenkins/jenkins-slave/workspace/beam_PreCommit_Java_MavenInstall/src/.test-infra/kubernetes/hadoop/config-files/core-site.xml
/home/jenkins/jenkins-slave/workspace/beam_PreCommit_Java_MavenInstall/src/.test-infra/kubernetes/postgres/pkb-config-local.yml
/home/jenkins/jenkins-slave/workspace/beam_PreCommit_Java_MavenInstall/src/.test-infra/kubernetes/postgres/pkb-config.yml
/home/jenkins/jenkins-slave/workspace/beam_PerformanceTests_Spark/src/.test-infra/kubernetes/hadoop/SmallITCluster/pkb-config.yml
/home/jenkins/jenkins-slave/workspace/beam_PerformanceTests_Spark/src/.test-infra/kubernetes/hadoop/config-files
/home/jenkins/jenkins-slave/workspace/beam_PerformanceTests_Spark/src/.test-infra/kubernetes/hadoop/config-files/hdfs-site.xml
/home/jenkins/jenkins-slave/workspace/beam_PerformanceTests_Spark/src/.test-infra/kubernetes/hadoop/config-files/hdfs-envs
/home/jenkins/jenkins-slave/workspace/beam_PerformanceTests_Spark/src/.test-infra/kubernetes/hadoop/config-files/core-site.xml
/home/jenkins/jenkins-slave/workspace/beam_PerformanceTests_Spark/src/.test-infra/kubernetes/postgres/pkb-config-local.yml
/home/jenkins/jenkins-slave/workspace/beam_PerformanceTests_Spark/src/.test-infra/kubernetes/postgres/pkb-config.yml
/home/jenkins/jenkins-slave/workspace/beam_PerformanceTests_FileBasedIO_IT/src/.test-infra/kubernetes/postgres/pkb-config-local.yml
/home/jenkins/jenkins-slave/workspace/beam_PerformanceTests_FileBasedIO_IT/src/.test-infra/kubernetes/postgres/pkb-config.yml
/home/jenkins/jenkins-slave/workspace/beam_PerformanceTests_Python/runs/e45a6cf9/beam/.test-infra/kubernetes/hadoop/SmallITCluster/pkb-config.yml
/home/jenkins/jenkins-slave/workspace/beam_PerformanceTests_Python/runs/e45a6cf9/beam/.test-infra/kubernetes/hadoop/config-files
/home/jenkins/jenkins-slave/workspace/beam_PerformanceTests_Python/runs/e45a6cf9/beam/.test-infra/kubernetes/hadoop/config-files/hdfs-site.xml
/home/jenkins/jenkins-slave/workspace/beam_PerformanceTests_Python/runs/e45a6cf9/beam/.test-infra/kubernetes/hadoop/config-files/hdfs-envs
/home/jenkins/jenkins-slave/workspace/beam_PerformanceTests_Python/runs/e45a6cf9/beam/.test-infra/kubernetes/hadoop/config-files/core-site.xml
/home/jenkins/jenkins-slave/workspace/beam_PerformanceTests_Python/runs/e45a6cf9/beam/.test-infra/kubernetes/postgres/pkb-config-local.yml
/home/jenkins/jenkins-slave/workspace/beam_PerformanceTests_Python/runs/e45a6cf9/beam/.test-infra/kubernetes/postgres/pkb-config.yml
/home/jenkins/jenkins-slave/workspace/beam_PerformanceTests_Python/src/.test-infra/kubernetes/hadoop/SmallITCluster/pkb-config.yml
/home/jenkins/jenkins-slave/workspace/beam_PerformanceTests_Python/src/.test-infra/kubernetes/hadoop/config-files
/home/jenkins/jenkins-slave/workspace/beam_PerformanceTests_Python/src/.test-infra/kubernetes/hadoop/config-files/hdfs-site.xml
/home/jenkins/jenkins-slave/workspace/beam_PerformanceTests_Python/src/.test-infra/kubernetes/hadoop/config-files/hdfs-envs
/home/jenkins/jenkins-slave/workspace/beam_PerformanceTests_Python/src/.test-infra/kubernetes/hadoop/config-files/core-site.xml
/home/jenkins/jenkins-slave/workspace/beam_PerformanceTests_Python/src/.test-infra/kubernetes/postgres/pkb-config-local.yml
/home/jenkins/jenkins-slave/workspace/beam_PerformanceTests_Python/src/.test-infra/kubernetes/postgres/pkb-config.yml
/home/jenkins/jenkins-slave/workspace/beam_PerformanceTests_HadoopInputFormatIO_IT/src/.test-infra/kubernetes/postgres/pkb-config-local.yml
/home/jenkins/jenkins-slave/workspace/beam_PerformanceTests_HadoopInputFormatIO_IT/src/.test-infra/kubernetes/postgres/pkb-config.yml
/home/jenkins/jenkins-slave/workspace/beam_PreCommit_Go_GradleBuild/src/.test-infra/kubernetes/hadoop/SmallITCluster/pkb-config.yml
/home/jenkins/jenkins-slave/workspace/beam_PreCommit_Go_GradleBuild/src/.test-infra/kubernetes/hadoop/config-files
/home/jenkins/jenkins-slave/workspace/beam_PreCommit_Go_GradleBuild/src/.test-infra/kubernetes/hadoop/config-files/hdfs-site.xml
/home/jenkins/jenkins-slave/workspace/beam_PreCommit_Go_GradleBuild/src/.test-infra/kubernetes/hadoop/config-files/hdfs-envs
/home/jenkins/jenkins-slave/workspace/beam_PreCommit_Go_GradleBuild/src/.test-infra/kubernetes/hadoop/config-files/core-site.xml
/home/jenkins/jenkins-slave/workspace/beam_PreCommit_Go_GradleBuild/src/.test-infra/kubernetes/postgres/pkb-config-local.yml
/home/jenkins/jenkins-slave/workspace/beam_PreCommit_Go_GradleBuild/src/.test-infra/kubernetes/postgres/pkb-config.yml
/home/jenkins/jenkins-slave/workspace/beam_PerformanceTests_TFRecordIOIT_HDFS/src/.test-infra/kubernetes/hadoop/config-files
/home/jenkins/jenkins-slave/workspace/beam_PerformanceTests_TFRecordIOIT_HDFS/src/.test-infra/kubernetes/hadoop/config-files/hdfs-site.xml
/home/jenkins/jenkins-slave/workspace/beam_PerformanceTests_TFRecordIOIT_HDFS/src/.test-infra/kubernetes/hadoop/config-files/hdfs-envs
/home/jenkins/jenkins-slave/workspace/beam_PerformanceTests_TFRecordIOIT_HDFS/src/.test-infra/kubernetes/hadoop/config-files/core-site.xml
/home/jenkins/jenkins-slave/workspace/beam_PerformanceTests_TFRecordIOIT_HDFS/src/.test-infra/kubernetes/postgres/pkb-config-local.yml
/home/jenkins/jenkins-slave/workspace/beam_PerformanceTests_TFRecordIOIT_HDFS/src/.test-infra/kubernetes/postgres/pkb-config.yml
/home/jenkins/jenkins-slave/workspace/beam_PerformanceTests_Compressed_TextIOIT/src/.test-infra/kubernetes/hadoop/config-files
/home/jenkins/jenkins-slave/workspace/beam_PerformanceTests_Compressed_TextIOIT/src/.test-infra/kubernetes/hadoop/config-files/hdfs-site.xml
/home/jenkins/jenkins-slave/workspace/beam_PerformanceTests_Compressed_TextIOIT/src/.test-infra/kubernetes/hadoop/config-files/hdfs-envs
/home/jenkins/jenkins-slave/workspace/beam_PerformanceTests_Compressed_TextIOIT/src/.test-infra/kubernetes/hadoop/config-files/core-site.xml
/home/jenkins/jenkins-slave/workspace/beam_PerformanceTests_Compressed_TextIOIT/src/.test-infra/kubernetes/postgres/pkb-config-local.yml
/home/jenkins/jenkins-slave/workspace/beam_PerformanceTests_Compressed_TextIOIT/src/.test-infra/kubernetes/postgres/pkb-config.yml
/home/jenkins/jenkins-slave/workspace/beam_PerformanceTests_TextIOIT/runs/10e88a25/beam/.test-infra/kubernetes/hadoop/SmallITCluster/pkb-config.yml
/home/jenkins/jenkins-slave/workspace/beam_PerformanceTests_TextIOIT/runs/10e88a25/beam/.test-infra/kubernetes/hadoop/config-files
/home/jenkins/jenkins-slave/workspace/beam_PerformanceTests_TextIOIT/runs/10e88a25/beam/.test-infra/kubernetes/hadoop/config-files/hdfs-site.xml
/home/jenkins/jenkins-slave/workspace/beam_PerformanceTests_TextIOIT/runs/10e88a25/beam/.test-infra/kubernetes/hadoop/config-files/hdfs-envs
/home/jenkins/jenkins-slave/workspace/beam_PerformanceTests_TextIOIT/runs/10e88a25/beam/.test-infra/kubernetes/hadoop/config-files/core-site.xml
/home/jenkins/jenkins-slave/workspace/beam_PerformanceTests_TextIOIT/runs/10e88a25/beam/.test-infra/kubernetes/postgres/pkb-config-local.yml
/home/jenkins/jenkins-slave/workspace/beam_PerformanceTests_TextIOIT/runs/10e88a25/beam/.test-infra/kubernetes/postgres/pkb-config.yml
/home/jenkins/jenkins-slave/workspace/beam_PerformanceTests_TextIOIT/src/.test-infra/kubernetes/hadoop/SmallITCluster/pkb-config.yml
/home/jenkins/jenkins-slave/workspace/beam_PerformanceTests_TextIOIT/src/.test-infra/kubernetes/hadoop/config-files
/home/jenkins/jenkins-slave/workspace/beam_PerformanceTests_TextIOIT/src/.test-infra/kubernetes/hadoop/config-files/hdfs-site.xml
/home/jenkins/jenkins-slave/workspace/beam_PerformanceTests_TextIOIT/src/.test-infra/kubernetes/hadoop/config-files/hdfs-envs
/home/jenkins/jenkins-slave/workspace/beam_PerformanceTests_TextIOIT/src/.test-infra/kubernetes/hadoop/config-files/core-site.xml
/home/jenkins/jenkins-slave/workspace/beam_PerformanceTests_TextIOIT/src/.test-infra/kubernetes/postgres/pkb-config-local.yml
/home/jenkins/jenkins-slave/workspace/beam_PerformanceTests_TextIOIT/src/.test-infra/kubernetes/postgres/pkb-config.yml
/home/jenkins/jenkins-slave/workspace/beam_PostCommit_Java_MavenInstall@2/src/.test-infra/kubernetes/hadoop/SmallITCluster/pkb-config.yml
/home/jenkins/jenkins-slave/workspace/beam_PostCommit_Java_MavenInstall@2/src/.test-infra/kubernetes/hadoop/config-files
/home/jenkins/jenkins-slave/workspace/beam_PostCommit_Java_MavenInstall@2/src/.test-infra/kubernetes/hadoop/config-files/hdfs-site.xml
/home/jenkins/jenkins-slave/workspace/beam_PostCommit_Java_MavenInstall@2/src/.test-infra/kubernetes/hadoop/config-files/hdfs-envs
/home/jenkins/jenkins-slave/workspace/beam_PostCommit_Java_MavenInstall@2/src/.test-infra/kubernetes/hadoop/config-files/core-site.xml
/home/jenkins/jenkins-slave/workspace/beam_PostCommit_Java_MavenInstall@2/src/.test-infra/kubernetes/postgres/pkb-config-local.yml
/home/jenkins/jenkins-slave/workspace/beam_PostCommit_Java_MavenInstall@2/src/.test-infra/kubernetes/postgres/pkb-config.yml
/home/jenkins/.kube/config
/usr/lib/google-cloud-sdk/lib/googlecloudsdk/api_lib/container/kubeconfig.py
/usr/lib/google-cloud-sdk/lib/googlecloudsdk/api_lib/container/kubeconfig.pyc
Build step 'Execute shell' marked build as failure