You are viewing a plain text version of this content. The canonical link for it is here.
Posted to yarn-dev@hadoop.apache.org by Apache Jenkins Server <je...@builds.apache.org> on 2014/01/16 00:13:13 UTC

Failed: YARN-1573 PreCommit Build #2891

Jira: https://issues.apache.org/jira/browse/YARN-1573
Build: https://builds.apache.org/job/PreCommit-YARN-Build/2891/

###################################################################################
########################## LAST 60 LINES OF THE CONSOLE ###########################
[...truncated 3250 lines...]


{color:red}-1 overall{color}.  Here are the results of testing the latest attachment 
  http://issues.apache.org/jira/secure/attachment/12623242/yarn-1573-1.patch
  against trunk revision .

    {color:green}+1 @author{color}.  The patch does not contain any @author tags.

    {color:red}-1 tests included{color}.  The patch doesn't appear to include any new or modified tests.
                        Please justify why no new tests are needed for this patch.
                        Also please list what manual steps were performed to verify this patch.

    {color:green}+1 javac{color}.  The applied patch does not increase the total number of javac compiler warnings.

    {color:green}+1 javadoc{color}.  The javadoc tool did not generate any warning messages.

    {color:green}+1 eclipse:eclipse{color}.  The patch built with eclipse:eclipse.

    {color:red}-1 findbugs{color}.  The patch appears to introduce 1 new Findbugs (version 1.3.9) warnings.

    {color:green}+1 release audit{color}.  The applied patch does not increase the total number of release audit warnings.

    {color:red}-1 core tests{color}.  The patch failed these unit tests in hadoop-yarn-project/hadoop-yarn/hadoop-yarn-common hadoop-yarn-project/hadoop-yarn/hadoop-yarn-server/hadoop-yarn-server-resourcemanager:

                  org.apache.hadoop.yarn.server.resourcemanager.TestRMRestart

    {color:green}+1 contrib tests{color}.  The patch passed contrib unit tests.

Test results: https://builds.apache.org/job/PreCommit-YARN-Build/2891//testReport/
Findbugs warnings: https://builds.apache.org/job/PreCommit-YARN-Build/2891//artifact/trunk/patchprocess/newPatchFindbugsWarningshadoop-yarn-server-resourcemanager.html
Console output: https://builds.apache.org/job/PreCommit-YARN-Build/2891//console

This message is automatically generated.


======================================================================
======================================================================
    Adding comment to Jira.
======================================================================
======================================================================


Comment added.
c4de9c6d7653defa09f296504e38134c074895cd logged out


======================================================================
======================================================================
    Finished build.
======================================================================
======================================================================


Build step 'Execute shell' marked build as failure
Archiving artifacts
[description-setter] Could not determine description.
Recording test results
Email was triggered for: Failure
Sending email for trigger: Failure



###################################################################################
############################## FAILED TESTS (if any) ##############################
1 tests failed.
REGRESSION:  org.apache.hadoop.yarn.server.resourcemanager.TestRMRestart.testRMRestartSucceededApp

Error Message:
null

Stack Trace:
java.lang.AssertionError: null
	at org.junit.Assert.fail(Assert.java:92)
	at org.junit.Assert.assertTrue(Assert.java:43)
	at org.junit.Assert.assertTrue(Assert.java:54)
	at org.apache.hadoop.yarn.server.resourcemanager.TestRMRestart.verifyAppReportAfterRMRestart(TestRMRestart.java:900)
	at org.apache.hadoop.yarn.server.resourcemanager.TestRMRestart.testRMRestartSucceededApp(TestRMRestart.java:774)



Success: YARN-1504 PreCommit Build #2906

Posted by Apache Jenkins Server <je...@builds.apache.org>.
Jira: https://issues.apache.org/jira/browse/YARN-1504
Build: https://builds.apache.org/job/PreCommit-YARN-Build/2906/

###################################################################################
########################## LAST 60 LINES OF THE CONSOLE ###########################
[...truncated 3119 lines...]

/bin/kill -9 30392 
kill: No such process
NOP




{color:green}+1 overall{color}.  Here are the results of testing the latest attachment 
  http://issues.apache.org/jira/secure/attachment/12623616/YARN-1504.patch
  against trunk revision .

    {color:green}+1 @author{color}.  The patch does not contain any @author tags.

    {color:green}+1 tests included{color}.  The patch appears to include 2 new or modified test files.

    {color:green}+1 javac{color}.  The applied patch does not increase the total number of javac compiler warnings.

    {color:green}+1 javadoc{color}.  The javadoc tool did not generate any warning messages.

    {color:green}+1 eclipse:eclipse{color}.  The patch built with eclipse:eclipse.

    {color:green}+1 findbugs{color}.  The patch does not introduce any new Findbugs (version 1.3.9) warnings.

    {color:green}+1 release audit{color}.  The applied patch does not increase the total number of release audit warnings.

    {color:green}+1 core tests{color}.  The patch passed unit tests in hadoop-tools/hadoop-sls hadoop-yarn-project/hadoop-yarn/hadoop-yarn-server/hadoop-yarn-server-resourcemanager.

    {color:green}+1 contrib tests{color}.  The patch passed contrib unit tests.

Test results: https://builds.apache.org/job/PreCommit-YARN-Build/2906//testReport/
Console output: https://builds.apache.org/job/PreCommit-YARN-Build/2906//console

This message is automatically generated.


======================================================================
======================================================================
    Adding comment to Jira.
======================================================================
======================================================================


Comment added.
1cf9560e3e822242f25b1862b8d533192989ca0b logged out


======================================================================
======================================================================
    Finished build.
======================================================================
======================================================================


Archiving artifacts
Description set: YARN-1504
Recording test results
Email was triggered for: Success
Sending email for trigger: Success



###################################################################################
############################## FAILED TESTS (if any) ##############################
All tests passed

Failed: YARN-1498 PreCommit Build #2905

Posted by Apache Jenkins Server <je...@builds.apache.org>.
Jira: https://issues.apache.org/jira/browse/YARN-1498
Build: https://builds.apache.org/job/PreCommit-YARN-Build/2905/

###################################################################################
########################## LAST 60 LINES OF THE CONSOLE ###########################
Started by remote host 127.0.0.1
Building remotely on hadoop4 in workspace /home/jenkins/jenkins-slave/workspace/PreCommit-YARN-Build
Reverting /home/jenkins/jenkins-slave/workspace/PreCommit-YARN-Build/trunk to depth infinity with ignoreExternals: false
Updating http://svn.apache.org/repos/asf/hadoop/common/trunk at revision '2014-01-17T10:09:39.450 +0000'
U         hadoop-mapreduce-project/hadoop-mapreduce-client/hadoop-mapreduce-client-jobclient/src/test/java/org/apache/hadoop/mapred/TestClientRedirect.java
U         hadoop-yarn-project/hadoop-yarn/hadoop-yarn-server/hadoop-yarn-server-resourcemanager/src/main/java/org/apache/hadoop/yarn/server/resourcemanager/ClientRMService.java
U         hadoop-yarn-project/hadoop-yarn/hadoop-yarn-common/src/main/java/org/apache/hadoop/yarn/api/impl/pb/client/ApplicationClientProtocolPBClientImpl.java
U         hadoop-yarn-project/hadoop-yarn/hadoop-yarn-common/src/main/java/org/apache/hadoop/yarn/api/impl/pb/service/ApplicationClientProtocolPBServiceImpl.java
A         hadoop-yarn-project/hadoop-yarn/hadoop-yarn-common/src/main/java/org/apache/hadoop/yarn/api/protocolrecords/impl/pb/MoveApplicationAcrossQueuesResponsePBImpl.java
A         hadoop-yarn-project/hadoop-yarn/hadoop-yarn-common/src/main/java/org/apache/hadoop/yarn/api/protocolrecords/impl/pb/MoveApplicationAcrossQueuesRequestPBImpl.java
A         hadoop-yarn-project/hadoop-yarn/hadoop-yarn-api/src/main/java/org/apache/hadoop/yarn/api/protocolrecords/MoveApplicationAcrossQueuesResponse.java
A         hadoop-yarn-project/hadoop-yarn/hadoop-yarn-api/src/main/java/org/apache/hadoop/yarn/api/protocolrecords/MoveApplicationAcrossQueuesRequest.java
U         hadoop-yarn-project/hadoop-yarn/hadoop-yarn-api/src/main/java/org/apache/hadoop/yarn/api/ApplicationClientProtocol.java
U         hadoop-yarn-project/hadoop-yarn/hadoop-yarn-api/src/main/proto/yarn_service_protos.proto
U         hadoop-yarn-project/hadoop-yarn/hadoop-yarn-api/src/main/proto/applicationclient_protocol.proto
U         hadoop-yarn-project/CHANGES.txt
At revision 1559058
Reverting /home/jenkins/jenkins-slave/workspace/PreCommit-YARN-Build/nightly to depth infinity with ignoreExternals: false
Updating http://svn.apache.org/repos/asf/hadoop/nightly at revision '2014-01-17T10:09:39.450 +0000'
At revision 1559058
no change for http://svn.apache.org/repos/asf/hadoop/nightly since the previous build
No emails were triggered.
[PreCommit-YARN-Build] $ /bin/bash /tmp/hudson983147207899861722.sh
32768
Running in Jenkins mode


======================================================================
======================================================================
    Testing patch for YARN-1498.
======================================================================
======================================================================


svn: OPTIONS of 'http://svn.apache.org/repos/asf/hadoop/common/trunk': could not connect to server (http://svn.apache.org)
Build step 'Execute shell' marked build as failure
Archiving artifacts
[description-setter] Could not determine description.
Recording test results
Email was triggered for: Failure
Sending email for trigger: Failure



###################################################################################
############################## FAILED TESTS (if any) ##############################
No tests ran.

Failed: YARN-1587 PreCommit Build #2904

Posted by Apache Jenkins Server <je...@builds.apache.org>.
Jira: https://issues.apache.org/jira/browse/YARN-1587
Build: https://builds.apache.org/job/PreCommit-YARN-Build/2904/

###################################################################################
########################## LAST 60 LINES OF THE CONSOLE ###########################
[...truncated 4269 lines...]
{color:red}-1 overall{color}.  Here are the results of testing the latest attachment 
  http://issues.apache.org/jira/secure/attachment/12623578/YARN-1587-20140116.1.txt
  against trunk revision .

    {color:green}+1 @author{color}.  The patch does not contain any @author tags.

    {color:green}+1 tests included{color}.  The patch appears to include 27 new or modified test files.

    {color:green}+1 javac{color}.  The applied patch does not increase the total number of javac compiler warnings.

    {color:green}+1 javadoc{color}.  The javadoc tool did not generate any warning messages.

    {color:green}+1 eclipse:eclipse{color}.  The patch built with eclipse:eclipse.

    {color:green}+1 findbugs{color}.  The patch does not introduce any new Findbugs (version 1.3.9) warnings.

    {color:green}+1 release audit{color}.  The applied patch does not increase the total number of release audit warnings.

    {color:red}-1 core tests{color}.  The patch failed these unit tests in hadoop-assemblies hadoop-mapreduce-project/hadoop-mapreduce-client/hadoop-mapreduce-client-jobclient hadoop-yarn-project/hadoop-yarn/hadoop-yarn-api hadoop-yarn-project/hadoop-yarn/hadoop-yarn-client hadoop-yarn-project/hadoop-yarn/hadoop-yarn-common hadoop-yarn-project/hadoop-yarn/hadoop-yarn-server/hadoop-yarn-server-applicationhistoryservice hadoop-yarn-project/hadoop-yarn/hadoop-yarn-server/hadoop-yarn-server-common hadoop-yarn-project/hadoop-yarn/hadoop-yarn-server/hadoop-yarn-server-resourcemanager:

                  org.apache.hadoop.yarn.server.applicationhistoryservice.TestApplicationHistoryServer
                  org.apache.hadoop.yarn.server.applicationhistoryservice.TestApplicationHistoryClientService

                                      The following test timeouts occurred in hadoop-assemblies hadoop-mapreduce-project/hadoop-mapreduce-client/hadoop-mapreduce-client-jobclient hadoop-yarn-project/hadoop-yarn/hadoop-yarn-api hadoop-yarn-project/hadoop-yarn/hadoop-yarn-client hadoop-yarn-project/hadoop-yarn/hadoop-yarn-common hadoop-yarn-project/hadoop-yarn/hadoop-yarn-server/hadoop-yarn-server-applicationhistoryservice hadoop-yarn-project/hadoop-yarn/hadoop-yarn-server/hadoop-yarn-server-common hadoop-yarn-project/hadoop-yarn/hadoop-yarn-server/hadoop-yarn-server-resourcemanager:

org.apache.hadoop.mapred.TestMultiFileInputFormat

    {color:green}+1 contrib tests{color}.  The patch passed contrib unit tests.

Test results: https://builds.apache.org/job/PreCommit-YARN-Build/2904//testReport/
Console output: https://builds.apache.org/job/PreCommit-YARN-Build/2904//console

This message is automatically generated.


======================================================================
======================================================================
    Adding comment to Jira.
======================================================================
======================================================================


Comment added.
f03cf644e04312aec3610fdf00158735ec4b1a00 logged out


======================================================================
======================================================================
    Finished build.
======================================================================
======================================================================


Build step 'Execute shell' marked build as failure
Archiving artifacts
[description-setter] Could not determine description.
Recording test results
Email was triggered for: Failure
Sending email for trigger: Failure



###################################################################################
############################## FAILED TESTS (if any) ##############################
8 tests failed.
FAILED:  org.apache.hadoop.yarn.server.applicationhistoryservice.TestApplicationHistoryClientService.testApplicationReport

Error Message:
AHSWebApp failed to start.

Stack Trace:
org.apache.hadoop.yarn.exceptions.YarnRuntimeException: AHSWebApp failed to start.
	at org.apache.hadoop.http.HttpServer.getWebAppsPath(HttpServer.java:846)
	at org.apache.hadoop.http.HttpServer.<init>(HttpServer.java:465)
	at org.apache.hadoop.http.HttpServer.<init>(HttpServer.java:101)
	at org.apache.hadoop.http.HttpServer$Builder.build(HttpServer.java:321)
	at org.apache.hadoop.yarn.webapp.WebApps$Builder.start(WebApps.java:232)
	at org.apache.hadoop.yarn.server.applicationhistoryservice.ApplicationHistoryServer.startWebApp(ApplicationHistoryServer.java:142)
	at org.apache.hadoop.yarn.server.applicationhistoryservice.ApplicationHistoryServer.serviceStart(ApplicationHistoryServer.java:74)
	at org.apache.hadoop.service.AbstractService.start(AbstractService.java:193)
	at org.apache.hadoop.yarn.server.applicationhistoryservice.TestApplicationHistoryClientService.setup(TestApplicationHistoryClientService.java:63)


FAILED:  org.apache.hadoop.yarn.server.applicationhistoryservice.TestApplicationHistoryClientService.testApplications

Error Message:
AHSWebApp failed to start.

Stack Trace:
org.apache.hadoop.yarn.exceptions.YarnRuntimeException: AHSWebApp failed to start.
	at org.apache.hadoop.http.HttpServer.getWebAppsPath(HttpServer.java:846)
	at org.apache.hadoop.http.HttpServer.<init>(HttpServer.java:465)
	at org.apache.hadoop.http.HttpServer.<init>(HttpServer.java:101)
	at org.apache.hadoop.http.HttpServer$Builder.build(HttpServer.java:321)
	at org.apache.hadoop.yarn.webapp.WebApps$Builder.start(WebApps.java:232)
	at org.apache.hadoop.yarn.server.applicationhistoryservice.ApplicationHistoryServer.startWebApp(ApplicationHistoryServer.java:142)
	at org.apache.hadoop.yarn.server.applicationhistoryservice.ApplicationHistoryServer.serviceStart(ApplicationHistoryServer.java:74)
	at org.apache.hadoop.service.AbstractService.start(AbstractService.java:193)
	at org.apache.hadoop.yarn.server.applicationhistoryservice.TestApplicationHistoryClientService.setup(TestApplicationHistoryClientService.java:63)


FAILED:  org.apache.hadoop.yarn.server.applicationhistoryservice.TestApplicationHistoryClientService.testApplicationAttemptReport

Error Message:
AHSWebApp failed to start.

Stack Trace:
org.apache.hadoop.yarn.exceptions.YarnRuntimeException: AHSWebApp failed to start.
	at org.apache.hadoop.http.HttpServer.getWebAppsPath(HttpServer.java:846)
	at org.apache.hadoop.http.HttpServer.<init>(HttpServer.java:465)
	at org.apache.hadoop.http.HttpServer.<init>(HttpServer.java:101)
	at org.apache.hadoop.http.HttpServer$Builder.build(HttpServer.java:321)
	at org.apache.hadoop.yarn.webapp.WebApps$Builder.start(WebApps.java:232)
	at org.apache.hadoop.yarn.server.applicationhistoryservice.ApplicationHistoryServer.startWebApp(ApplicationHistoryServer.java:142)
	at org.apache.hadoop.yarn.server.applicationhistoryservice.ApplicationHistoryServer.serviceStart(ApplicationHistoryServer.java:74)
	at org.apache.hadoop.service.AbstractService.start(AbstractService.java:193)
	at org.apache.hadoop.yarn.server.applicationhistoryservice.TestApplicationHistoryClientService.setup(TestApplicationHistoryClientService.java:63)


FAILED:  org.apache.hadoop.yarn.server.applicationhistoryservice.TestApplicationHistoryClientService.testApplicationAttempts

Error Message:
AHSWebApp failed to start.

Stack Trace:
org.apache.hadoop.yarn.exceptions.YarnRuntimeException: AHSWebApp failed to start.
	at org.apache.hadoop.http.HttpServer.getWebAppsPath(HttpServer.java:846)
	at org.apache.hadoop.http.HttpServer.<init>(HttpServer.java:465)
	at org.apache.hadoop.http.HttpServer.<init>(HttpServer.java:101)
	at org.apache.hadoop.http.HttpServer$Builder.build(HttpServer.java:321)
	at org.apache.hadoop.yarn.webapp.WebApps$Builder.start(WebApps.java:232)
	at org.apache.hadoop.yarn.server.applicationhistoryservice.ApplicationHistoryServer.startWebApp(ApplicationHistoryServer.java:142)
	at org.apache.hadoop.yarn.server.applicationhistoryservice.ApplicationHistoryServer.serviceStart(ApplicationHistoryServer.java:74)
	at org.apache.hadoop.service.AbstractService.start(AbstractService.java:193)
	at org.apache.hadoop.yarn.server.applicationhistoryservice.TestApplicationHistoryClientService.setup(TestApplicationHistoryClientService.java:63)


FAILED:  org.apache.hadoop.yarn.server.applicationhistoryservice.TestApplicationHistoryClientService.testContainerReport

Error Message:
AHSWebApp failed to start.

Stack Trace:
org.apache.hadoop.yarn.exceptions.YarnRuntimeException: AHSWebApp failed to start.
	at org.apache.hadoop.http.HttpServer.getWebAppsPath(HttpServer.java:846)
	at org.apache.hadoop.http.HttpServer.<init>(HttpServer.java:465)
	at org.apache.hadoop.http.HttpServer.<init>(HttpServer.java:101)
	at org.apache.hadoop.http.HttpServer$Builder.build(HttpServer.java:321)
	at org.apache.hadoop.yarn.webapp.WebApps$Builder.start(WebApps.java:232)
	at org.apache.hadoop.yarn.server.applicationhistoryservice.ApplicationHistoryServer.startWebApp(ApplicationHistoryServer.java:142)
	at org.apache.hadoop.yarn.server.applicationhistoryservice.ApplicationHistoryServer.serviceStart(ApplicationHistoryServer.java:74)
	at org.apache.hadoop.service.AbstractService.start(AbstractService.java:193)
	at org.apache.hadoop.yarn.server.applicationhistoryservice.TestApplicationHistoryClientService.setup(TestApplicationHistoryClientService.java:63)


FAILED:  org.apache.hadoop.yarn.server.applicationhistoryservice.TestApplicationHistoryClientService.testContainers

Error Message:
AHSWebApp failed to start.

Stack Trace:
org.apache.hadoop.yarn.exceptions.YarnRuntimeException: AHSWebApp failed to start.
	at org.apache.hadoop.http.HttpServer.getWebAppsPath(HttpServer.java:846)
	at org.apache.hadoop.http.HttpServer.<init>(HttpServer.java:465)
	at org.apache.hadoop.http.HttpServer.<init>(HttpServer.java:101)
	at org.apache.hadoop.http.HttpServer$Builder.build(HttpServer.java:321)
	at org.apache.hadoop.yarn.webapp.WebApps$Builder.start(WebApps.java:232)
	at org.apache.hadoop.yarn.server.applicationhistoryservice.ApplicationHistoryServer.startWebApp(ApplicationHistoryServer.java:142)
	at org.apache.hadoop.yarn.server.applicationhistoryservice.ApplicationHistoryServer.serviceStart(ApplicationHistoryServer.java:74)
	at org.apache.hadoop.service.AbstractService.start(AbstractService.java:193)
	at org.apache.hadoop.yarn.server.applicationhistoryservice.TestApplicationHistoryClientService.setup(TestApplicationHistoryClientService.java:63)


FAILED:  org.apache.hadoop.yarn.server.applicationhistoryservice.TestApplicationHistoryServer.testStartStopServer

Error Message:
AHSWebApp failed to start.

Stack Trace:
org.apache.hadoop.yarn.exceptions.YarnRuntimeException: AHSWebApp failed to start.
	at org.apache.hadoop.http.HttpServer.getWebAppsPath(HttpServer.java:846)
	at org.apache.hadoop.http.HttpServer.<init>(HttpServer.java:465)
	at org.apache.hadoop.http.HttpServer.<init>(HttpServer.java:101)
	at org.apache.hadoop.http.HttpServer$Builder.build(HttpServer.java:321)
	at org.apache.hadoop.yarn.webapp.WebApps$Builder.start(WebApps.java:232)
	at org.apache.hadoop.yarn.server.applicationhistoryservice.ApplicationHistoryServer.startWebApp(ApplicationHistoryServer.java:142)
	at org.apache.hadoop.yarn.server.applicationhistoryservice.ApplicationHistoryServer.serviceStart(ApplicationHistoryServer.java:74)
	at org.apache.hadoop.service.AbstractService.start(AbstractService.java:193)
	at org.apache.hadoop.yarn.server.applicationhistoryservice.TestApplicationHistoryServer.testStartStopServer(TestApplicationHistoryServer.java:49)


FAILED:  org.apache.hadoop.yarn.server.applicationhistoryservice.TestApplicationHistoryServer.testLaunch

Error Message:
expected:<0> but was:<-1>

Stack Trace:
java.lang.AssertionError: expected:<0> but was:<-1>
	at org.junit.Assert.fail(Assert.java:93)
	at org.junit.Assert.failNotEquals(Assert.java:647)
	at org.junit.Assert.assertEquals(Assert.java:128)
	at org.junit.Assert.assertEquals(Assert.java:472)
	at org.junit.Assert.assertEquals(Assert.java:456)
	at org.apache.hadoop.yarn.server.applicationhistoryservice.TestApplicationHistoryServer.testLaunch(TestApplicationHistoryServer.java:65)



Failed: YARN-1599 PreCommit Build #2903

Posted by Apache Jenkins Server <je...@builds.apache.org>.
Jira: https://issues.apache.org/jira/browse/YARN-1599
Build: https://builds.apache.org/job/PreCommit-YARN-Build/2903/

###################################################################################
########################## LAST 60 LINES OF THE CONSOLE ###########################
[...truncated 3009 lines...]
NOP




{color:red}-1 overall{color}.  Here are the results of testing the latest attachment 
  http://issues.apache.org/jira/secure/attachment/12623571/YARN-1599.v03.patch
  against trunk revision .

    {color:green}+1 @author{color}.  The patch does not contain any @author tags.

    {color:red}-1 tests included{color}.  The patch doesn't appear to include any new or modified tests.
                        Please justify why no new tests are needed for this patch.
                        Also please list what manual steps were performed to verify this patch.

    {color:green}+1 javac{color}.  The applied patch does not increase the total number of javac compiler warnings.

    {color:green}+1 javadoc{color}.  The javadoc tool did not generate any warning messages.

    {color:green}+1 eclipse:eclipse{color}.  The patch built with eclipse:eclipse.

    {color:green}+1 findbugs{color}.  The patch does not introduce any new Findbugs (version 1.3.9) warnings.

    {color:green}+1 release audit{color}.  The applied patch does not increase the total number of release audit warnings.

    {color:green}+1 core tests{color}.  The patch passed unit tests in hadoop-yarn-project/hadoop-yarn/hadoop-yarn-server/hadoop-yarn-server-resourcemanager.

    {color:green}+1 contrib tests{color}.  The patch passed contrib unit tests.

Test results: https://builds.apache.org/job/PreCommit-YARN-Build/2903//testReport/
Console output: https://builds.apache.org/job/PreCommit-YARN-Build/2903//console

This message is automatically generated.


======================================================================
======================================================================
    Adding comment to Jira.
======================================================================
======================================================================


Comment added.
f01d5797e49552b99cfc6319dacb6b6e3bf4c985 logged out


======================================================================
======================================================================
    Finished build.
======================================================================
======================================================================


Build step 'Execute shell' marked build as failure
Archiving artifacts
[description-setter] Could not determine description.
Recording test results
Email was triggered for: Failure
Sending email for trigger: Failure



###################################################################################
############################## FAILED TESTS (if any) ##############################
All tests passed

Failed: YARN-1599 PreCommit Build #2902

Posted by Apache Jenkins Server <je...@builds.apache.org>.
Jira: https://issues.apache.org/jira/browse/YARN-1599
Build: https://builds.apache.org/job/PreCommit-YARN-Build/2902/

###################################################################################
########################## LAST 60 LINES OF THE CONSOLE ###########################
[...truncated 2996 lines...]
NOP




{color:red}-1 overall{color}.  Here are the results of testing the latest attachment 
  http://issues.apache.org/jira/secure/attachment/12623517/YARN-1599.v02.patch
  against trunk revision .

    {color:green}+1 @author{color}.  The patch does not contain any @author tags.

    {color:red}-1 tests included{color}.  The patch doesn't appear to include any new or modified tests.
                        Please justify why no new tests are needed for this patch.
                        Also please list what manual steps were performed to verify this patch.

    {color:green}+1 javac{color}.  The applied patch does not increase the total number of javac compiler warnings.

    {color:green}+1 javadoc{color}.  The javadoc tool did not generate any warning messages.

    {color:green}+1 eclipse:eclipse{color}.  The patch built with eclipse:eclipse.

    {color:green}+1 findbugs{color}.  The patch does not introduce any new Findbugs (version 1.3.9) warnings.

    {color:green}+1 release audit{color}.  The applied patch does not increase the total number of release audit warnings.

    {color:green}+1 core tests{color}.  The patch passed unit tests in hadoop-yarn-project/hadoop-yarn/hadoop-yarn-server/hadoop-yarn-server-resourcemanager.

    {color:green}+1 contrib tests{color}.  The patch passed contrib unit tests.

Test results: https://builds.apache.org/job/PreCommit-YARN-Build/2902//testReport/
Console output: https://builds.apache.org/job/PreCommit-YARN-Build/2902//console

This message is automatically generated.


======================================================================
======================================================================
    Adding comment to Jira.
======================================================================
======================================================================


Comment added.
36bd90538ba1e17a8a528019061edd9f2a7085f2 logged out


======================================================================
======================================================================
    Finished build.
======================================================================
======================================================================


Build step 'Execute shell' marked build as failure
Archiving artifacts
[description-setter] Could not determine description.
Recording test results
Email was triggered for: Failure
Sending email for trigger: Failure



###################################################################################
############################## FAILED TESTS (if any) ##############################
All tests passed

Failed: YARN-1595 PreCommit Build #2901

Posted by Apache Jenkins Server <je...@builds.apache.org>.
Jira: https://issues.apache.org/jira/browse/YARN-1595
Build: https://builds.apache.org/job/PreCommit-YARN-Build/2901/

###################################################################################
########################## LAST 60 LINES OF THE CONSOLE ###########################
[...truncated 9 lines...]
no change for http://svn.apache.org/repos/asf/hadoop/nightly since the previous build
No emails were triggered.
[PreCommit-YARN-Build] $ /bin/bash /tmp/hudson4118514761523694039.sh
32768
Running in Jenkins mode


======================================================================
======================================================================
    Testing patch for YARN-1595.
======================================================================
======================================================================


At revision 1558938.
YARN-1595 patch is being downloaded at Thu Jan 16 22:30:53 UTC 2014 from
http://issues.apache.org/jira/secure/attachment/12623499/YARN-1595-20140116.1.txt
cp: cannot stat `/home/jenkins/buildSupport/lib/*': No such file or directory
The patch does not appear to apply with p0 to p2
PATCH APPLICATION FAILED




{color:red}-1 overall{color}.  Here are the results of testing the latest attachment 
  http://issues.apache.org/jira/secure/attachment/12623499/YARN-1595-20140116.1.txt
  against trunk revision .

    {color:red}-1 patch{color}.  The patch command could not apply the patch.

Console output: https://builds.apache.org/job/PreCommit-YARN-Build/2901//console

This message is automatically generated.


======================================================================
======================================================================
    Adding comment to Jira.
======================================================================
======================================================================


Comment added.
4cc93874afb69f9792c9fb57bfa0b80120e7a1b5 logged out


======================================================================
======================================================================
    Finished build.
======================================================================
======================================================================


Build step 'Execute shell' marked build as failure
Archiving artifacts
[description-setter] Could not determine description.
Recording test results
Email was triggered for: Failure
Sending email for trigger: Failure



###################################################################################
############################## FAILED TESTS (if any) ##############################
No tests ran.

Failed: YARN-1605 PreCommit Build #2900

Posted by Apache Jenkins Server <je...@builds.apache.org>.
Jira: https://issues.apache.org/jira/browse/YARN-1605
Build: https://builds.apache.org/job/PreCommit-YARN-Build/2900/

###################################################################################
########################## LAST 60 LINES OF THE CONSOLE ###########################
[...truncated 26 lines...]
No emails were triggered.
[PreCommit-YARN-Build] $ /bin/bash /tmp/hudson4623177074988024120.sh
32768
Running in Jenkins mode


======================================================================
======================================================================
    Testing patch for YARN-1605.
======================================================================
======================================================================


At revision 1558899.
YARN-1605 patch is being downloaded at Thu Jan 16 20:10:57 UTC 2014 from
http://issues.apache.org/jira/secure/attachment/12623453/YARN-1605-20140116.txt
cp: cannot stat `/home/jenkins/buildSupport/lib/*': No such file or directory
The patch does not appear to apply with p0 to p2
PATCH APPLICATION FAILED




{color:red}-1 overall{color}.  Here are the results of testing the latest attachment 
  http://issues.apache.org/jira/secure/attachment/12623453/YARN-1605-20140116.txt
  against trunk revision .

    {color:red}-1 patch{color}.  The patch command could not apply the patch.

Console output: https://builds.apache.org/job/PreCommit-YARN-Build/2900//console

This message is automatically generated.


======================================================================
======================================================================
    Adding comment to Jira.
======================================================================
======================================================================


Comment added.
07869b3108cfd989d18c33e8fd38d600ef51e452 logged out


======================================================================
======================================================================
    Finished build.
======================================================================
======================================================================


Build step 'Execute shell' marked build as failure
Archiving artifacts
[description-setter] Could not determine description.
Recording test results
Editable Email Notification is waiting for a checkpoint on PreCommit-YARN-Build #2899
Email was triggered for: Failure
Sending email for trigger: Failure



###################################################################################
############################## FAILED TESTS (if any) ##############################
No tests ran.

Failed: YARN-1587 PreCommit Build #2899

Posted by Apache Jenkins Server <je...@builds.apache.org>.
Jira: https://issues.apache.org/jira/browse/YARN-1587
Build: https://builds.apache.org/job/PreCommit-YARN-Build/2899/

###################################################################################
########################## LAST 60 LINES OF THE CONSOLE ###########################
[...truncated 4262 lines...]
  http://issues.apache.org/jira/secure/attachment/12623445/YARN-1587-20140116.txt
  against trunk revision .

    {color:green}+1 @author{color}.  The patch does not contain any @author tags.

    {color:green}+1 tests included{color}.  The patch appears to include 27 new or modified test files.

    {color:green}+1 javac{color}.  The applied patch does not increase the total number of javac compiler warnings.

    {color:green}+1 javadoc{color}.  The javadoc tool did not generate any warning messages.

    {color:green}+1 eclipse:eclipse{color}.  The patch built with eclipse:eclipse.

    {color:red}-1 findbugs{color}.  The patch appears to introduce 1 new Findbugs (version 1.3.9) warnings.

    {color:green}+1 release audit{color}.  The applied patch does not increase the total number of release audit warnings.

    {color:red}-1 core tests{color}.  The patch failed these unit tests in hadoop-assemblies hadoop-mapreduce-project/hadoop-mapreduce-client/hadoop-mapreduce-client-jobclient hadoop-yarn-project/hadoop-yarn/hadoop-yarn-api hadoop-yarn-project/hadoop-yarn/hadoop-yarn-client hadoop-yarn-project/hadoop-yarn/hadoop-yarn-common hadoop-yarn-project/hadoop-yarn/hadoop-yarn-server/hadoop-yarn-server-applicationhistoryservice hadoop-yarn-project/hadoop-yarn/hadoop-yarn-server/hadoop-yarn-server-common hadoop-yarn-project/hadoop-yarn/hadoop-yarn-server/hadoop-yarn-server-resourcemanager:

                  org.apache.hadoop.yarn.server.applicationhistoryservice.TestApplicationHistoryServer
                  org.apache.hadoop.yarn.server.applicationhistoryservice.TestApplicationHistoryClientService

                                      The following test timeouts occurred in hadoop-assemblies hadoop-mapreduce-project/hadoop-mapreduce-client/hadoop-mapreduce-client-jobclient hadoop-yarn-project/hadoop-yarn/hadoop-yarn-api hadoop-yarn-project/hadoop-yarn/hadoop-yarn-client hadoop-yarn-project/hadoop-yarn/hadoop-yarn-common hadoop-yarn-project/hadoop-yarn/hadoop-yarn-server/hadoop-yarn-server-applicationhistoryservice hadoop-yarn-project/hadoop-yarn/hadoop-yarn-server/hadoop-yarn-server-common hadoop-yarn-project/hadoop-yarn/hadoop-yarn-server/hadoop-yarn-server-resourcemanager:

org.apache.hadoop.yarn.server.resourcemanager.TestResourceTrackerService

    {color:green}+1 contrib tests{color}.  The patch passed contrib unit tests.

Test results: https://builds.apache.org/job/PreCommit-YARN-Build/2899//testReport/
Findbugs warnings: https://builds.apache.org/job/PreCommit-YARN-Build/2899//artifact/trunk/patchprocess/newPatchFindbugsWarningshadoop-yarn-client.html
Console output: https://builds.apache.org/job/PreCommit-YARN-Build/2899//console

This message is automatically generated.


======================================================================
======================================================================
    Adding comment to Jira.
======================================================================
======================================================================


Comment added.
21ceb8bcb895c220238f35068f9818b3d5f3ce1b logged out


======================================================================
======================================================================
    Finished build.
======================================================================
======================================================================


Build step 'Execute shell' marked build as failure
Archiving artifacts
[description-setter] Could not determine description.
Recording test results
Email was triggered for: Failure
Sending email for trigger: Failure



###################################################################################
############################## FAILED TESTS (if any) ##############################
8 tests failed.
FAILED:  org.apache.hadoop.yarn.server.applicationhistoryservice.TestApplicationHistoryClientService.testApplicationReport

Error Message:
AHSWebApp failed to start.

Stack Trace:
org.apache.hadoop.yarn.exceptions.YarnRuntimeException: AHSWebApp failed to start.
	at org.apache.hadoop.http.HttpServer.getWebAppsPath(HttpServer.java:846)
	at org.apache.hadoop.http.HttpServer.<init>(HttpServer.java:465)
	at org.apache.hadoop.http.HttpServer.<init>(HttpServer.java:101)
	at org.apache.hadoop.http.HttpServer$Builder.build(HttpServer.java:321)
	at org.apache.hadoop.yarn.webapp.WebApps$Builder.start(WebApps.java:232)
	at org.apache.hadoop.yarn.server.applicationhistoryservice.ApplicationHistoryServer.startWebApp(ApplicationHistoryServer.java:141)
	at org.apache.hadoop.yarn.server.applicationhistoryservice.ApplicationHistoryServer.serviceStart(ApplicationHistoryServer.java:74)
	at org.apache.hadoop.service.AbstractService.start(AbstractService.java:193)
	at org.apache.hadoop.yarn.server.applicationhistoryservice.TestApplicationHistoryClientService.setup(TestApplicationHistoryClientService.java:63)


FAILED:  org.apache.hadoop.yarn.server.applicationhistoryservice.TestApplicationHistoryClientService.testApplications

Error Message:
AHSWebApp failed to start.

Stack Trace:
org.apache.hadoop.yarn.exceptions.YarnRuntimeException: AHSWebApp failed to start.
	at org.apache.hadoop.http.HttpServer.getWebAppsPath(HttpServer.java:846)
	at org.apache.hadoop.http.HttpServer.<init>(HttpServer.java:465)
	at org.apache.hadoop.http.HttpServer.<init>(HttpServer.java:101)
	at org.apache.hadoop.http.HttpServer$Builder.build(HttpServer.java:321)
	at org.apache.hadoop.yarn.webapp.WebApps$Builder.start(WebApps.java:232)
	at org.apache.hadoop.yarn.server.applicationhistoryservice.ApplicationHistoryServer.startWebApp(ApplicationHistoryServer.java:141)
	at org.apache.hadoop.yarn.server.applicationhistoryservice.ApplicationHistoryServer.serviceStart(ApplicationHistoryServer.java:74)
	at org.apache.hadoop.service.AbstractService.start(AbstractService.java:193)
	at org.apache.hadoop.yarn.server.applicationhistoryservice.TestApplicationHistoryClientService.setup(TestApplicationHistoryClientService.java:63)


FAILED:  org.apache.hadoop.yarn.server.applicationhistoryservice.TestApplicationHistoryClientService.testApplicationAttemptReport

Error Message:
AHSWebApp failed to start.

Stack Trace:
org.apache.hadoop.yarn.exceptions.YarnRuntimeException: AHSWebApp failed to start.
	at org.apache.hadoop.http.HttpServer.getWebAppsPath(HttpServer.java:846)
	at org.apache.hadoop.http.HttpServer.<init>(HttpServer.java:465)
	at org.apache.hadoop.http.HttpServer.<init>(HttpServer.java:101)
	at org.apache.hadoop.http.HttpServer$Builder.build(HttpServer.java:321)
	at org.apache.hadoop.yarn.webapp.WebApps$Builder.start(WebApps.java:232)
	at org.apache.hadoop.yarn.server.applicationhistoryservice.ApplicationHistoryServer.startWebApp(ApplicationHistoryServer.java:141)
	at org.apache.hadoop.yarn.server.applicationhistoryservice.ApplicationHistoryServer.serviceStart(ApplicationHistoryServer.java:74)
	at org.apache.hadoop.service.AbstractService.start(AbstractService.java:193)
	at org.apache.hadoop.yarn.server.applicationhistoryservice.TestApplicationHistoryClientService.setup(TestApplicationHistoryClientService.java:63)


FAILED:  org.apache.hadoop.yarn.server.applicationhistoryservice.TestApplicationHistoryClientService.testApplicationAttempts

Error Message:
AHSWebApp failed to start.

Stack Trace:
org.apache.hadoop.yarn.exceptions.YarnRuntimeException: AHSWebApp failed to start.
	at org.apache.hadoop.http.HttpServer.getWebAppsPath(HttpServer.java:846)
	at org.apache.hadoop.http.HttpServer.<init>(HttpServer.java:465)
	at org.apache.hadoop.http.HttpServer.<init>(HttpServer.java:101)
	at org.apache.hadoop.http.HttpServer$Builder.build(HttpServer.java:321)
	at org.apache.hadoop.yarn.webapp.WebApps$Builder.start(WebApps.java:232)
	at org.apache.hadoop.yarn.server.applicationhistoryservice.ApplicationHistoryServer.startWebApp(ApplicationHistoryServer.java:141)
	at org.apache.hadoop.yarn.server.applicationhistoryservice.ApplicationHistoryServer.serviceStart(ApplicationHistoryServer.java:74)
	at org.apache.hadoop.service.AbstractService.start(AbstractService.java:193)
	at org.apache.hadoop.yarn.server.applicationhistoryservice.TestApplicationHistoryClientService.setup(TestApplicationHistoryClientService.java:63)


FAILED:  org.apache.hadoop.yarn.server.applicationhistoryservice.TestApplicationHistoryClientService.testContainerReport

Error Message:
AHSWebApp failed to start.

Stack Trace:
org.apache.hadoop.yarn.exceptions.YarnRuntimeException: AHSWebApp failed to start.
	at org.apache.hadoop.http.HttpServer.getWebAppsPath(HttpServer.java:846)
	at org.apache.hadoop.http.HttpServer.<init>(HttpServer.java:465)
	at org.apache.hadoop.http.HttpServer.<init>(HttpServer.java:101)
	at org.apache.hadoop.http.HttpServer$Builder.build(HttpServer.java:321)
	at org.apache.hadoop.yarn.webapp.WebApps$Builder.start(WebApps.java:232)
	at org.apache.hadoop.yarn.server.applicationhistoryservice.ApplicationHistoryServer.startWebApp(ApplicationHistoryServer.java:141)
	at org.apache.hadoop.yarn.server.applicationhistoryservice.ApplicationHistoryServer.serviceStart(ApplicationHistoryServer.java:74)
	at org.apache.hadoop.service.AbstractService.start(AbstractService.java:193)
	at org.apache.hadoop.yarn.server.applicationhistoryservice.TestApplicationHistoryClientService.setup(TestApplicationHistoryClientService.java:63)


FAILED:  org.apache.hadoop.yarn.server.applicationhistoryservice.TestApplicationHistoryClientService.testContainers

Error Message:
AHSWebApp failed to start.

Stack Trace:
org.apache.hadoop.yarn.exceptions.YarnRuntimeException: AHSWebApp failed to start.
	at org.apache.hadoop.http.HttpServer.getWebAppsPath(HttpServer.java:846)
	at org.apache.hadoop.http.HttpServer.<init>(HttpServer.java:465)
	at org.apache.hadoop.http.HttpServer.<init>(HttpServer.java:101)
	at org.apache.hadoop.http.HttpServer$Builder.build(HttpServer.java:321)
	at org.apache.hadoop.yarn.webapp.WebApps$Builder.start(WebApps.java:232)
	at org.apache.hadoop.yarn.server.applicationhistoryservice.ApplicationHistoryServer.startWebApp(ApplicationHistoryServer.java:141)
	at org.apache.hadoop.yarn.server.applicationhistoryservice.ApplicationHistoryServer.serviceStart(ApplicationHistoryServer.java:74)
	at org.apache.hadoop.service.AbstractService.start(AbstractService.java:193)
	at org.apache.hadoop.yarn.server.applicationhistoryservice.TestApplicationHistoryClientService.setup(TestApplicationHistoryClientService.java:63)


FAILED:  org.apache.hadoop.yarn.server.applicationhistoryservice.TestApplicationHistoryServer.testStartStopServer

Error Message:
AHSWebApp failed to start.

Stack Trace:
org.apache.hadoop.yarn.exceptions.YarnRuntimeException: AHSWebApp failed to start.
	at org.apache.hadoop.http.HttpServer.getWebAppsPath(HttpServer.java:846)
	at org.apache.hadoop.http.HttpServer.<init>(HttpServer.java:465)
	at org.apache.hadoop.http.HttpServer.<init>(HttpServer.java:101)
	at org.apache.hadoop.http.HttpServer$Builder.build(HttpServer.java:321)
	at org.apache.hadoop.yarn.webapp.WebApps$Builder.start(WebApps.java:232)
	at org.apache.hadoop.yarn.server.applicationhistoryservice.ApplicationHistoryServer.startWebApp(ApplicationHistoryServer.java:141)
	at org.apache.hadoop.yarn.server.applicationhistoryservice.ApplicationHistoryServer.serviceStart(ApplicationHistoryServer.java:74)
	at org.apache.hadoop.service.AbstractService.start(AbstractService.java:193)
	at org.apache.hadoop.yarn.server.applicationhistoryservice.TestApplicationHistoryServer.testStartStopServer(TestApplicationHistoryServer.java:49)


FAILED:  org.apache.hadoop.yarn.server.applicationhistoryservice.TestApplicationHistoryServer.testLaunch

Error Message:
expected:<0> but was:<-1>

Stack Trace:
java.lang.AssertionError: expected:<0> but was:<-1>
	at org.junit.Assert.fail(Assert.java:93)
	at org.junit.Assert.failNotEquals(Assert.java:647)
	at org.junit.Assert.assertEquals(Assert.java:128)
	at org.junit.Assert.assertEquals(Assert.java:472)
	at org.junit.Assert.assertEquals(Assert.java:456)
	at org.apache.hadoop.yarn.server.applicationhistoryservice.TestApplicationHistoryServer.testLaunch(TestApplicationHistoryServer.java:65)



Failed: YARN-1595 PreCommit Build #2898

Posted by Apache Jenkins Server <je...@builds.apache.org>.
Jira: https://issues.apache.org/jira/browse/YARN-1595
Build: https://builds.apache.org/job/PreCommit-YARN-Build/2898/

###################################################################################
########################## LAST 60 LINES OF THE CONSOLE ###########################
[...truncated 22 lines...]
no change for http://svn.apache.org/repos/asf/hadoop/nightly since the previous build
No emails were triggered.
[PreCommit-YARN-Build] $ /bin/bash /tmp/hudson9032394390440273958.sh
32768
Running in Jenkins mode


======================================================================
======================================================================
    Testing patch for YARN-1595.
======================================================================
======================================================================


At revision 1558880.
YARN-1595 patch is being downloaded at Thu Jan 16 18:50:54 UTC 2014 from
http://issues.apache.org/jira/secure/attachment/12623437/YARN-1595-20140116.txt
cp: cannot stat `/home/jenkins/buildSupport/lib/*': No such file or directory
The patch does not appear to apply with p0 to p2
PATCH APPLICATION FAILED




{color:red}-1 overall{color}.  Here are the results of testing the latest attachment 
  http://issues.apache.org/jira/secure/attachment/12623437/YARN-1595-20140116.txt
  against trunk revision .

    {color:red}-1 patch{color}.  The patch command could not apply the patch.

Console output: https://builds.apache.org/job/PreCommit-YARN-Build/2898//console

This message is automatically generated.


======================================================================
======================================================================
    Adding comment to Jira.
======================================================================
======================================================================


Comment added.
ba9306cb43ae28cc061794e7ca83ffbc363ffd2a logged out


======================================================================
======================================================================
    Finished build.
======================================================================
======================================================================


Build step 'Execute shell' marked build as failure
Archiving artifacts
[description-setter] Could not determine description.
Recording test results
Email was triggered for: Failure
Sending email for trigger: Failure



###################################################################################
############################## FAILED TESTS (if any) ##############################
No tests ran.

Failed: YARN-1474 PreCommit Build #2897

Posted by Apache Jenkins Server <je...@builds.apache.org>.
Jira: https://issues.apache.org/jira/browse/YARN-1474
Build: https://builds.apache.org/job/PreCommit-YARN-Build/2897/

###################################################################################
########################## LAST 60 LINES OF THE CONSOLE ###########################
[...truncated 3260 lines...]




{color:red}-1 overall{color}.  Here are the results of testing the latest attachment 
  http://issues.apache.org/jira/secure/attachment/12623406/YARN-1474.5.patch
  against trunk revision .

    {color:green}+1 @author{color}.  The patch does not contain any @author tags.

    {color:green}+1 tests included{color}.  The patch appears to include 10 new or modified test files.

    {color:green}+1 javac{color}.  The applied patch does not increase the total number of javac compiler warnings.

    {color:green}+1 javadoc{color}.  The javadoc tool did not generate any warning messages.

    {color:green}+1 eclipse:eclipse{color}.  The patch built with eclipse:eclipse.

    {color:red}-1 findbugs{color}.  The patch appears to introduce 10 new Findbugs (version 1.3.9) warnings.

    {color:green}+1 release audit{color}.  The applied patch does not increase the total number of release audit warnings.

    {color:red}-1 core tests{color}.  The patch failed these unit tests in hadoop-mapreduce-project/hadoop-mapreduce-client/hadoop-mapreduce-client-app hadoop-tools/hadoop-sls hadoop-yarn-project/hadoop-yarn/hadoop-yarn-server/hadoop-yarn-server-resourcemanager:

                  org.apache.hadoop.mapreduce.v2.app.TestRMContainerAllocator

    {color:green}+1 contrib tests{color}.  The patch passed contrib unit tests.

Test results: https://builds.apache.org/job/PreCommit-YARN-Build/2897//testReport/
Findbugs warnings: https://builds.apache.org/job/PreCommit-YARN-Build/2897//artifact/trunk/patchprocess/newPatchFindbugsWarningshadoop-yarn-server-resourcemanager.html
Console output: https://builds.apache.org/job/PreCommit-YARN-Build/2897//console

This message is automatically generated.


======================================================================
======================================================================
    Adding comment to Jira.
======================================================================
======================================================================


Comment added.
8dfb668bb55d9343a13587eebd25280bc3ca90dd logged out


======================================================================
======================================================================
    Finished build.
======================================================================
======================================================================


Build step 'Execute shell' marked build as failure
Archiving artifacts
[description-setter] Could not determine description.
Recording test results
Email was triggered for: Failure
Sending email for trigger: Failure



###################################################################################
############################## FAILED TESTS (if any) ##############################
1 tests failed.
FAILED:  org.apache.hadoop.mapreduce.v2.app.TestRMContainerAllocator.testCompletedTasksRecalculateSchedule

Error Message:
java.lang.NullPointerException

Stack Trace:
org.apache.hadoop.yarn.exceptions.YarnRuntimeException: java.lang.NullPointerException
	at org.apache.hadoop.yarn.server.resourcemanager.scheduler.AbstractYarnScheduler.getTransferredContainers(AbstractYarnScheduler.java:60)
	at org.apache.hadoop.yarn.server.resourcemanager.ApplicationMasterService.registerApplicationMaster(ApplicationMasterService.java:277)
	at org.apache.hadoop.mapreduce.v2.app.rm.RMCommunicator.register(RMCommunicator.java:154)
	at org.apache.hadoop.mapreduce.v2.app.TestRMContainerAllocator$MyContainerAllocator.register(TestRMContainerAllocator.java:1477)
	at org.apache.hadoop.mapreduce.v2.app.rm.RMCommunicator.serviceStart(RMCommunicator.java:112)
	at org.apache.hadoop.mapreduce.v2.app.rm.RMContainerAllocator.serviceStart(RMContainerAllocator.java:219)
	at org.apache.hadoop.service.AbstractService.start(AbstractService.java:193)
	at org.apache.hadoop.mapreduce.v2.app.TestRMContainerAllocator$MyContainerAllocator.<init>(TestRMContainerAllocator.java:1445)
	at org.apache.hadoop.mapreduce.v2.app.TestRMContainerAllocator$RecalculateContainerAllocator.<init>(TestRMContainerAllocator.java:1630)
	at org.apache.hadoop.mapreduce.v2.app.TestRMContainerAllocator.testCompletedTasksRecalculateSchedule(TestRMContainerAllocator.java:1666)



Failed: YARN-1474 PreCommit Build #2896

Posted by Apache Jenkins Server <je...@builds.apache.org>.
Jira: https://issues.apache.org/jira/browse/YARN-1474
Build: https://builds.apache.org/job/PreCommit-YARN-Build/2896/

###################################################################################
########################## LAST 60 LINES OF THE CONSOLE ###########################
[...truncated 3444 lines...]

{color:red}-1 overall{color}.  Here are the results of testing the latest attachment 
  http://issues.apache.org/jira/secure/attachment/12623342/YARN-1474.4.patch
  against trunk revision .

    {color:green}+1 @author{color}.  The patch does not contain any @author tags.

    {color:green}+1 tests included{color}.  The patch appears to include 10 new or modified test files.

    {color:green}+1 javac{color}.  The applied patch does not increase the total number of javac compiler warnings.

    {color:green}+1 javadoc{color}.  The javadoc tool did not generate any warning messages.

    {color:green}+1 eclipse:eclipse{color}.  The patch built with eclipse:eclipse.

    {color:red}-1 findbugs{color}.  The patch appears to introduce 10 new Findbugs (version 1.3.9) warnings.

    {color:green}+1 release audit{color}.  The applied patch does not increase the total number of release audit warnings.

    {color:red}-1 core tests{color}.  The patch failed these unit tests in hadoop-mapreduce-project/hadoop-mapreduce-client/hadoop-mapreduce-client-app hadoop-tools/hadoop-sls hadoop-yarn-project/hadoop-yarn/hadoop-yarn-server/hadoop-yarn-server-resourcemanager:

                  org.apache.hadoop.mapreduce.v2.app.TestRMContainerAllocator
                  org.apache.hadoop.yarn.server.resourcemanager.scheduler.capacity.TestCapacityScheduler
                  org.apache.hadoop.yarn.server.resourcemanager.scheduler.capacity.TestLeafQueue
                  org.apache.hadoop.yarn.server.resourcemanager.security.TestRMDelegationTokens

    {color:green}+1 contrib tests{color}.  The patch passed contrib unit tests.

Test results: https://builds.apache.org/job/PreCommit-YARN-Build/2896//testReport/
Findbugs warnings: https://builds.apache.org/job/PreCommit-YARN-Build/2896//artifact/trunk/patchprocess/newPatchFindbugsWarningshadoop-yarn-server-resourcemanager.html
Console output: https://builds.apache.org/job/PreCommit-YARN-Build/2896//console

This message is automatically generated.


======================================================================
======================================================================
    Adding comment to Jira.
======================================================================
======================================================================


Comment added.
2feb143317d16a1b506b9ae4854cadc152f8c58c logged out


======================================================================
======================================================================
    Finished build.
======================================================================
======================================================================


Build step 'Execute shell' marked build as failure
Archiving artifacts
[description-setter] Could not determine description.
Recording test results
Email was triggered for: Failure
Sending email for trigger: Failure



###################################################################################
############################## FAILED TESTS (if any) ##############################
26 tests failed.
REGRESSION:  org.apache.hadoop.yarn.server.resourcemanager.security.TestRMDelegationTokens.testRMDTMasterKeyStateOnRollingMasterKey

Error Message:
null

Stack Trace:
java.lang.NullPointerException: null
	at org.apache.hadoop.yarn.server.resourcemanager.scheduler.fair.AllocationFileLoaderService.stop(AllocationFileLoaderService.java:149)
	at org.apache.hadoop.yarn.server.resourcemanager.scheduler.fair.FairScheduler.serviceStopInternal(FairScheduler.java:1308)
	at org.apache.hadoop.yarn.server.resourcemanager.scheduler.fair.FairScheduler.serviceStop(FairScheduler.java:1313)
	at org.apache.hadoop.service.AbstractService.stop(AbstractService.java:221)
	at org.apache.hadoop.service.ServiceOperations.stop(ServiceOperations.java:52)
	at org.apache.hadoop.service.ServiceOperations.stopQuietly(ServiceOperations.java:80)
	at org.apache.hadoop.service.CompositeService.stop(CompositeService.java:159)
	at org.apache.hadoop.service.CompositeService.serviceStop(CompositeService.java:132)
	at org.apache.hadoop.yarn.server.resourcemanager.ResourceManager$RMActiveServices.serviceStop(ResourceManager.java:458)
	at org.apache.hadoop.service.AbstractService.stop(AbstractService.java:221)
	at org.apache.hadoop.yarn.server.resourcemanager.ResourceManager.stopActiveServices(ResourceManager.java:791)
	at org.apache.hadoop.yarn.server.resourcemanager.ResourceManager.transitionToStandby(ResourceManager.java:828)
	at org.apache.hadoop.yarn.server.resourcemanager.ResourceManager.serviceStop(ResourceManager.java:874)
	at org.apache.hadoop.service.AbstractService.stop(AbstractService.java:221)
	at org.apache.hadoop.yarn.server.resourcemanager.security.TestRMDelegationTokens.testRMDTMasterKeyStateOnRollingMasterKey(TestRMDelegationTokens.java:128)


FAILED:  org.apache.hadoop.mapreduce.v2.app.TestRMContainerAllocator.testCompletedTasksRecalculateSchedule

Error Message:
java.lang.NullPointerException

Stack Trace:
org.apache.hadoop.yarn.exceptions.YarnRuntimeException: java.lang.NullPointerException
	at org.apache.hadoop.yarn.server.resourcemanager.scheduler.AbstractYarnScheduler.getTransferredContainers(AbstractYarnScheduler.java:60)
	at org.apache.hadoop.yarn.server.resourcemanager.ApplicationMasterService.registerApplicationMaster(ApplicationMasterService.java:277)
	at org.apache.hadoop.mapreduce.v2.app.rm.RMCommunicator.register(RMCommunicator.java:154)
	at org.apache.hadoop.mapreduce.v2.app.TestRMContainerAllocator$MyContainerAllocator.register(TestRMContainerAllocator.java:1477)
	at org.apache.hadoop.mapreduce.v2.app.rm.RMCommunicator.serviceStart(RMCommunicator.java:112)
	at org.apache.hadoop.mapreduce.v2.app.rm.RMContainerAllocator.serviceStart(RMContainerAllocator.java:219)
	at org.apache.hadoop.service.AbstractService.start(AbstractService.java:193)
	at org.apache.hadoop.mapreduce.v2.app.TestRMContainerAllocator$MyContainerAllocator.<init>(TestRMContainerAllocator.java:1445)
	at org.apache.hadoop.mapreduce.v2.app.TestRMContainerAllocator$RecalculateContainerAllocator.<init>(TestRMContainerAllocator.java:1630)
	at org.apache.hadoop.mapreduce.v2.app.TestRMContainerAllocator.testCompletedTasksRecalculateSchedule(TestRMContainerAllocator.java:1666)


FAILED:  org.apache.hadoop.yarn.server.resourcemanager.scheduler.capacity.TestCapacityScheduler.testRefreshQueues

Error Message:
null

Stack Trace:
java.lang.NullPointerException: null
	at org.apache.hadoop.yarn.server.resourcemanager.scheduler.capacity.TestCapacityScheduler.findQueue(TestCapacityScheduler.java:395)
	at org.apache.hadoop.yarn.server.resourcemanager.scheduler.capacity.TestCapacityScheduler.checkQueueCapacities(TestCapacityScheduler.java:356)
	at org.apache.hadoop.yarn.server.resourcemanager.scheduler.capacity.TestCapacityScheduler.testRefreshQueues(TestCapacityScheduler.java:345)


FAILED:  org.apache.hadoop.yarn.server.resourcemanager.scheduler.capacity.TestCapacityScheduler.testReconnectedNode

Error Message:
Failed to re-init queues

Stack Trace:
java.io.IOException: Failed to re-init queues
	at org.apache.hadoop.yarn.util.resource.Resources.greaterThan(Resources.java:225)
	at org.apache.hadoop.yarn.server.resourcemanager.scheduler.capacity.CSQueueUtils.updateQueueStatistics(CSQueueUtils.java:90)
	at org.apache.hadoop.yarn.server.resourcemanager.scheduler.capacity.ParentQueue.setupQueueConfigs(ParentQueue.java:188)
	at org.apache.hadoop.yarn.server.resourcemanager.scheduler.capacity.ParentQueue.<init>(ParentQueue.java:146)
	at org.apache.hadoop.yarn.server.resourcemanager.scheduler.capacity.CapacityScheduler.parseQueue(CapacityScheduler.java:411)
	at org.apache.hadoop.yarn.server.resourcemanager.scheduler.capacity.CapacityScheduler.reinitializeQueues(CapacityScheduler.java:340)
	at org.apache.hadoop.yarn.server.resourcemanager.scheduler.capacity.CapacityScheduler.reinitialize(CapacityScheduler.java:302)
	at org.apache.hadoop.yarn.server.resourcemanager.scheduler.capacity.TestCapacityScheduler.testReconnectedNode(TestCapacityScheduler.java:458)


FAILED:  org.apache.hadoop.yarn.server.resourcemanager.scheduler.capacity.TestCapacityScheduler.testRefreshQueuesWithNewQueue

Error Message:
Failed to re-init queues

Stack Trace:
java.io.IOException: Failed to re-init queues
	at org.apache.hadoop.yarn.util.resource.Resources.greaterThan(Resources.java:225)
	at org.apache.hadoop.yarn.server.resourcemanager.scheduler.capacity.CSQueueUtils.updateQueueStatistics(CSQueueUtils.java:90)
	at org.apache.hadoop.yarn.server.resourcemanager.scheduler.capacity.ParentQueue.setupQueueConfigs(ParentQueue.java:188)
	at org.apache.hadoop.yarn.server.resourcemanager.scheduler.capacity.ParentQueue.<init>(ParentQueue.java:146)
	at org.apache.hadoop.yarn.server.resourcemanager.scheduler.capacity.CapacityScheduler.parseQueue(CapacityScheduler.java:411)
	at org.apache.hadoop.yarn.server.resourcemanager.scheduler.capacity.CapacityScheduler.reinitializeQueues(CapacityScheduler.java:340)
	at org.apache.hadoop.yarn.server.resourcemanager.scheduler.capacity.CapacityScheduler.reinitialize(CapacityScheduler.java:302)
	at org.apache.hadoop.yarn.server.resourcemanager.scheduler.capacity.TestCapacityScheduler.testRefreshQueuesWithNewQueue(TestCapacityScheduler.java:486)


FAILED:  org.apache.hadoop.yarn.server.resourcemanager.scheduler.capacity.TestCapacityScheduler.testAddAndRemoveAppFromCapacityScheduler

Error Message:
Failed to re-init queues

Stack Trace:
java.io.IOException: Failed to re-init queues
	at org.apache.hadoop.yarn.util.resource.Resources.greaterThan(Resources.java:225)
	at org.apache.hadoop.yarn.server.resourcemanager.scheduler.capacity.CSQueueUtils.updateQueueStatistics(CSQueueUtils.java:90)
	at org.apache.hadoop.yarn.server.resourcemanager.scheduler.capacity.ParentQueue.setupQueueConfigs(ParentQueue.java:188)
	at org.apache.hadoop.yarn.server.resourcemanager.scheduler.capacity.ParentQueue.<init>(ParentQueue.java:146)
	at org.apache.hadoop.yarn.server.resourcemanager.scheduler.capacity.CapacityScheduler.parseQueue(CapacityScheduler.java:411)
	at org.apache.hadoop.yarn.server.resourcemanager.scheduler.capacity.CapacityScheduler.reinitializeQueues(CapacityScheduler.java:340)
	at org.apache.hadoop.yarn.server.resourcemanager.scheduler.capacity.CapacityScheduler.reinitialize(CapacityScheduler.java:302)
	at org.apache.hadoop.yarn.server.resourcemanager.scheduler.capacity.TestCapacityScheduler.testAddAndRemoveAppFromCapacityScheduler(TestCapacityScheduler.java:638)


FAILED:  org.apache.hadoop.yarn.server.resourcemanager.scheduler.capacity.TestLeafQueue.testInitializeQueue

Error Message:
null

Stack Trace:
java.lang.NullPointerException: null
	at org.apache.hadoop.yarn.server.resourcemanager.scheduler.capacity.CapacityScheduler.getContainerTokenSecretManager(CapacityScheduler.java:217)
	at org.apache.hadoop.yarn.server.resourcemanager.scheduler.capacity.TestLeafQueue.setUp(TestLeafQueue.java:142)


FAILED:  org.apache.hadoop.yarn.server.resourcemanager.scheduler.capacity.TestLeafQueue.testSingleQueueOneUserMetrics

Error Message:
null

Stack Trace:
java.lang.NullPointerException: null
	at org.apache.hadoop.yarn.server.resourcemanager.scheduler.capacity.CapacityScheduler.getContainerTokenSecretManager(CapacityScheduler.java:217)
	at org.apache.hadoop.yarn.server.resourcemanager.scheduler.capacity.TestLeafQueue.setUp(TestLeafQueue.java:142)


FAILED:  org.apache.hadoop.yarn.server.resourcemanager.scheduler.capacity.TestLeafQueue.testUserQueueAcl

Error Message:
null

Stack Trace:
java.lang.NullPointerException: null
	at org.apache.hadoop.yarn.server.resourcemanager.scheduler.capacity.CapacityScheduler.getContainerTokenSecretManager(CapacityScheduler.java:217)
	at org.apache.hadoop.yarn.server.resourcemanager.scheduler.capacity.TestLeafQueue.setUp(TestLeafQueue.java:142)


FAILED:  org.apache.hadoop.yarn.server.resourcemanager.scheduler.capacity.TestLeafQueue.testAppAttemptMetrics

Error Message:
null

Stack Trace:
java.lang.NullPointerException: null
	at org.apache.hadoop.yarn.server.resourcemanager.scheduler.capacity.CapacityScheduler.getContainerTokenSecretManager(CapacityScheduler.java:217)
	at org.apache.hadoop.yarn.server.resourcemanager.scheduler.capacity.TestLeafQueue.setUp(TestLeafQueue.java:142)


FAILED:  org.apache.hadoop.yarn.server.resourcemanager.scheduler.capacity.TestLeafQueue.testSingleQueueWithOneUser

Error Message:
null

Stack Trace:
java.lang.NullPointerException: null
	at org.apache.hadoop.yarn.server.resourcemanager.scheduler.capacity.CapacityScheduler.getContainerTokenSecretManager(CapacityScheduler.java:217)
	at org.apache.hadoop.yarn.server.resourcemanager.scheduler.capacity.TestLeafQueue.setUp(TestLeafQueue.java:142)


FAILED:  org.apache.hadoop.yarn.server.resourcemanager.scheduler.capacity.TestLeafQueue.testUserLimits

Error Message:
null

Stack Trace:
java.lang.NullPointerException: null
	at org.apache.hadoop.yarn.server.resourcemanager.scheduler.capacity.CapacityScheduler.getContainerTokenSecretManager(CapacityScheduler.java:217)
	at org.apache.hadoop.yarn.server.resourcemanager.scheduler.capacity.TestLeafQueue.setUp(TestLeafQueue.java:142)


FAILED:  org.apache.hadoop.yarn.server.resourcemanager.scheduler.capacity.TestLeafQueue.testHeadroomWithMaxCap

Error Message:
null

Stack Trace:
java.lang.NullPointerException: null
	at org.apache.hadoop.yarn.server.resourcemanager.scheduler.capacity.CapacityScheduler.getContainerTokenSecretManager(CapacityScheduler.java:217)
	at org.apache.hadoop.yarn.server.resourcemanager.scheduler.capacity.TestLeafQueue.setUp(TestLeafQueue.java:142)


FAILED:  org.apache.hadoop.yarn.server.resourcemanager.scheduler.capacity.TestLeafQueue.testSingleQueueWithMultipleUsers

Error Message:
null

Stack Trace:
java.lang.NullPointerException: null
	at org.apache.hadoop.yarn.server.resourcemanager.scheduler.capacity.CapacityScheduler.getContainerTokenSecretManager(CapacityScheduler.java:217)
	at org.apache.hadoop.yarn.server.resourcemanager.scheduler.capacity.TestLeafQueue.setUp(TestLeafQueue.java:142)


FAILED:  org.apache.hadoop.yarn.server.resourcemanager.scheduler.capacity.TestLeafQueue.testReservation

Error Message:
null

Stack Trace:
java.lang.NullPointerException: null
	at org.apache.hadoop.yarn.server.resourcemanager.scheduler.capacity.CapacityScheduler.getContainerTokenSecretManager(CapacityScheduler.java:217)
	at org.apache.hadoop.yarn.server.resourcemanager.scheduler.capacity.TestLeafQueue.setUp(TestLeafQueue.java:142)


FAILED:  org.apache.hadoop.yarn.server.resourcemanager.scheduler.capacity.TestLeafQueue.testStolenReservedContainer

Error Message:
null

Stack Trace:
java.lang.NullPointerException: null
	at org.apache.hadoop.yarn.server.resourcemanager.scheduler.capacity.CapacityScheduler.getContainerTokenSecretManager(CapacityScheduler.java:217)
	at org.apache.hadoop.yarn.server.resourcemanager.scheduler.capacity.TestLeafQueue.setUp(TestLeafQueue.java:142)


FAILED:  org.apache.hadoop.yarn.server.resourcemanager.scheduler.capacity.TestLeafQueue.testReservationExchange

Error Message:
null

Stack Trace:
java.lang.NullPointerException: null
	at org.apache.hadoop.yarn.server.resourcemanager.scheduler.capacity.CapacityScheduler.getContainerTokenSecretManager(CapacityScheduler.java:217)
	at org.apache.hadoop.yarn.server.resourcemanager.scheduler.capacity.TestLeafQueue.setUp(TestLeafQueue.java:142)


FAILED:  org.apache.hadoop.yarn.server.resourcemanager.scheduler.capacity.TestLeafQueue.testLocalityScheduling

Error Message:
null

Stack Trace:
java.lang.NullPointerException: null
	at org.apache.hadoop.yarn.server.resourcemanager.scheduler.capacity.CapacityScheduler.getContainerTokenSecretManager(CapacityScheduler.java:217)
	at org.apache.hadoop.yarn.server.resourcemanager.scheduler.capacity.TestLeafQueue.setUp(TestLeafQueue.java:142)


FAILED:  org.apache.hadoop.yarn.server.resourcemanager.scheduler.capacity.TestLeafQueue.testApplicationPriorityScheduling

Error Message:
null

Stack Trace:
java.lang.NullPointerException: null
	at org.apache.hadoop.yarn.server.resourcemanager.scheduler.capacity.CapacityScheduler.getContainerTokenSecretManager(CapacityScheduler.java:217)
	at org.apache.hadoop.yarn.server.resourcemanager.scheduler.capacity.TestLeafQueue.setUp(TestLeafQueue.java:142)


FAILED:  org.apache.hadoop.yarn.server.resourcemanager.scheduler.capacity.TestLeafQueue.testSchedulingConstraints

Error Message:
null

Stack Trace:
java.lang.NullPointerException: null
	at org.apache.hadoop.yarn.server.resourcemanager.scheduler.capacity.CapacityScheduler.getContainerTokenSecretManager(CapacityScheduler.java:217)
	at org.apache.hadoop.yarn.server.resourcemanager.scheduler.capacity.TestLeafQueue.setUp(TestLeafQueue.java:142)


FAILED:  org.apache.hadoop.yarn.server.resourcemanager.scheduler.capacity.TestLeafQueue.testActivateApplicationAfterQueueRefresh

Error Message:
null

Stack Trace:
java.lang.NullPointerException: null
	at org.apache.hadoop.yarn.server.resourcemanager.scheduler.capacity.CapacityScheduler.getContainerTokenSecretManager(CapacityScheduler.java:217)
	at org.apache.hadoop.yarn.server.resourcemanager.scheduler.capacity.TestLeafQueue.setUp(TestLeafQueue.java:142)


FAILED:  org.apache.hadoop.yarn.server.resourcemanager.scheduler.capacity.TestLeafQueue.testNodeLocalityAfterQueueRefresh

Error Message:
null

Stack Trace:
java.lang.NullPointerException: null
	at org.apache.hadoop.yarn.server.resourcemanager.scheduler.capacity.CapacityScheduler.getContainerTokenSecretManager(CapacityScheduler.java:217)
	at org.apache.hadoop.yarn.server.resourcemanager.scheduler.capacity.TestLeafQueue.setUp(TestLeafQueue.java:142)


FAILED:  org.apache.hadoop.yarn.server.resourcemanager.scheduler.capacity.TestLeafQueue.testActivateApplicationByUpdatingClusterResource

Error Message:
null

Stack Trace:
java.lang.NullPointerException: null
	at org.apache.hadoop.yarn.server.resourcemanager.scheduler.capacity.CapacityScheduler.getContainerTokenSecretManager(CapacityScheduler.java:217)
	at org.apache.hadoop.yarn.server.resourcemanager.scheduler.capacity.TestLeafQueue.setUp(TestLeafQueue.java:142)


FAILED:  org.apache.hadoop.yarn.server.resourcemanager.scheduler.capacity.TestLeafQueue.testInheritedQueueAcls

Error Message:
null

Stack Trace:
java.lang.NullPointerException: null
	at org.apache.hadoop.yarn.server.resourcemanager.scheduler.capacity.CapacityScheduler.getContainerTokenSecretManager(CapacityScheduler.java:217)
	at org.apache.hadoop.yarn.server.resourcemanager.scheduler.capacity.TestLeafQueue.setUp(TestLeafQueue.java:142)


FAILED:  org.apache.hadoop.yarn.server.resourcemanager.scheduler.capacity.TestLeafQueue.testLocalityConstraints

Error Message:
null

Stack Trace:
java.lang.NullPointerException: null
	at org.apache.hadoop.yarn.server.resourcemanager.scheduler.capacity.CapacityScheduler.getContainerTokenSecretManager(CapacityScheduler.java:217)
	at org.apache.hadoop.yarn.server.resourcemanager.scheduler.capacity.TestLeafQueue.setUp(TestLeafQueue.java:142)


FAILED:  org.apache.hadoop.yarn.server.resourcemanager.scheduler.capacity.TestLeafQueue.testMaxAMResourcePerQueuePercentAfterQueueRefresh

Error Message:
null

Stack Trace:
java.lang.NullPointerException: null
	at org.apache.hadoop.yarn.server.resourcemanager.scheduler.capacity.CapacityScheduler.getContainerTokenSecretManager(CapacityScheduler.java:217)
	at org.apache.hadoop.yarn.server.resourcemanager.scheduler.capacity.TestLeafQueue.setUp(TestLeafQueue.java:142)



Failed: YARN-1474 PreCommit Build #2895

Posted by Apache Jenkins Server <je...@builds.apache.org>.
Jira: https://issues.apache.org/jira/browse/YARN-1474
Build: https://builds.apache.org/job/PreCommit-YARN-Build/2895/

###################################################################################
########################## LAST 60 LINES OF THE CONSOLE ###########################
[...truncated 3436 lines...]


{color:red}-1 overall{color}.  Here are the results of testing the latest attachment 
  http://issues.apache.org/jira/secure/attachment/12623335/YARN-1474.3.patch
  against trunk revision .

    {color:green}+1 @author{color}.  The patch does not contain any @author tags.

    {color:green}+1 tests included{color}.  The patch appears to include 10 new or modified test files.

    {color:green}+1 javac{color}.  The applied patch does not increase the total number of javac compiler warnings.

    {color:green}+1 javadoc{color}.  The javadoc tool did not generate any warning messages.

    {color:green}+1 eclipse:eclipse{color}.  The patch built with eclipse:eclipse.

    {color:red}-1 findbugs{color}.  The patch appears to introduce 10 new Findbugs (version 1.3.9) warnings.

    {color:green}+1 release audit{color}.  The applied patch does not increase the total number of release audit warnings.

    {color:red}-1 core tests{color}.  The patch failed these unit tests in hadoop-mapreduce-project/hadoop-mapreduce-client/hadoop-mapreduce-client-app hadoop-tools/hadoop-sls hadoop-yarn-project/hadoop-yarn/hadoop-yarn-server/hadoop-yarn-server-resourcemanager:

                  org.apache.hadoop.mapreduce.v2.app.TestRMContainerAllocator
                  org.apache.hadoop.yarn.server.resourcemanager.scheduler.capacity.TestCapacityScheduler
                  org.apache.hadoop.yarn.server.resourcemanager.scheduler.capacity.TestLeafQueue

    {color:green}+1 contrib tests{color}.  The patch passed contrib unit tests.

Test results: https://builds.apache.org/job/PreCommit-YARN-Build/2895//testReport/
Findbugs warnings: https://builds.apache.org/job/PreCommit-YARN-Build/2895//artifact/trunk/patchprocess/newPatchFindbugsWarningshadoop-yarn-server-resourcemanager.html
Console output: https://builds.apache.org/job/PreCommit-YARN-Build/2895//console

This message is automatically generated.


======================================================================
======================================================================
    Adding comment to Jira.
======================================================================
======================================================================


Comment added.
f9f197b8cf080248818bde793cdcd72ea90d1aab logged out


======================================================================
======================================================================
    Finished build.
======================================================================
======================================================================


Build step 'Execute shell' marked build as failure
Archiving artifacts
[description-setter] Could not determine description.
Recording test results
Email was triggered for: Failure
Sending email for trigger: Failure



###################################################################################
############################## FAILED TESTS (if any) ##############################
25 tests failed.
FAILED:  org.apache.hadoop.mapreduce.v2.app.TestRMContainerAllocator.testCompletedTasksRecalculateSchedule

Error Message:
java.lang.NullPointerException

Stack Trace:
org.apache.hadoop.yarn.exceptions.YarnRuntimeException: java.lang.NullPointerException
	at org.apache.hadoop.yarn.server.resourcemanager.scheduler.AbstractYarnScheduler.getTransferredContainers(AbstractYarnScheduler.java:60)
	at org.apache.hadoop.yarn.server.resourcemanager.ApplicationMasterService.registerApplicationMaster(ApplicationMasterService.java:277)
	at org.apache.hadoop.mapreduce.v2.app.rm.RMCommunicator.register(RMCommunicator.java:154)
	at org.apache.hadoop.mapreduce.v2.app.TestRMContainerAllocator$MyContainerAllocator.register(TestRMContainerAllocator.java:1477)
	at org.apache.hadoop.mapreduce.v2.app.rm.RMCommunicator.serviceStart(RMCommunicator.java:112)
	at org.apache.hadoop.mapreduce.v2.app.rm.RMContainerAllocator.serviceStart(RMContainerAllocator.java:219)
	at org.apache.hadoop.service.AbstractService.start(AbstractService.java:193)
	at org.apache.hadoop.mapreduce.v2.app.TestRMContainerAllocator$MyContainerAllocator.<init>(TestRMContainerAllocator.java:1445)
	at org.apache.hadoop.mapreduce.v2.app.TestRMContainerAllocator$RecalculateContainerAllocator.<init>(TestRMContainerAllocator.java:1630)
	at org.apache.hadoop.mapreduce.v2.app.TestRMContainerAllocator.testCompletedTasksRecalculateSchedule(TestRMContainerAllocator.java:1666)


FAILED:  org.apache.hadoop.yarn.server.resourcemanager.scheduler.capacity.TestCapacityScheduler.testRefreshQueues

Error Message:
null

Stack Trace:
java.lang.NullPointerException: null
	at org.apache.hadoop.yarn.server.resourcemanager.scheduler.capacity.TestCapacityScheduler.findQueue(TestCapacityScheduler.java:395)
	at org.apache.hadoop.yarn.server.resourcemanager.scheduler.capacity.TestCapacityScheduler.checkQueueCapacities(TestCapacityScheduler.java:356)
	at org.apache.hadoop.yarn.server.resourcemanager.scheduler.capacity.TestCapacityScheduler.testRefreshQueues(TestCapacityScheduler.java:345)


FAILED:  org.apache.hadoop.yarn.server.resourcemanager.scheduler.capacity.TestCapacityScheduler.testReconnectedNode

Error Message:
Failed to re-init queues

Stack Trace:
java.io.IOException: Failed to re-init queues
	at org.apache.hadoop.yarn.util.resource.Resources.greaterThan(Resources.java:225)
	at org.apache.hadoop.yarn.server.resourcemanager.scheduler.capacity.CSQueueUtils.updateQueueStatistics(CSQueueUtils.java:90)
	at org.apache.hadoop.yarn.server.resourcemanager.scheduler.capacity.ParentQueue.setupQueueConfigs(ParentQueue.java:188)
	at org.apache.hadoop.yarn.server.resourcemanager.scheduler.capacity.ParentQueue.<init>(ParentQueue.java:146)
	at org.apache.hadoop.yarn.server.resourcemanager.scheduler.capacity.CapacityScheduler.parseQueue(CapacityScheduler.java:411)
	at org.apache.hadoop.yarn.server.resourcemanager.scheduler.capacity.CapacityScheduler.reinitializeQueues(CapacityScheduler.java:340)
	at org.apache.hadoop.yarn.server.resourcemanager.scheduler.capacity.CapacityScheduler.reinitialize(CapacityScheduler.java:302)
	at org.apache.hadoop.yarn.server.resourcemanager.scheduler.capacity.TestCapacityScheduler.testReconnectedNode(TestCapacityScheduler.java:458)


FAILED:  org.apache.hadoop.yarn.server.resourcemanager.scheduler.capacity.TestCapacityScheduler.testRefreshQueuesWithNewQueue

Error Message:
Failed to re-init queues

Stack Trace:
java.io.IOException: Failed to re-init queues
	at org.apache.hadoop.yarn.util.resource.Resources.greaterThan(Resources.java:225)
	at org.apache.hadoop.yarn.server.resourcemanager.scheduler.capacity.CSQueueUtils.updateQueueStatistics(CSQueueUtils.java:90)
	at org.apache.hadoop.yarn.server.resourcemanager.scheduler.capacity.ParentQueue.setupQueueConfigs(ParentQueue.java:188)
	at org.apache.hadoop.yarn.server.resourcemanager.scheduler.capacity.ParentQueue.<init>(ParentQueue.java:146)
	at org.apache.hadoop.yarn.server.resourcemanager.scheduler.capacity.CapacityScheduler.parseQueue(CapacityScheduler.java:411)
	at org.apache.hadoop.yarn.server.resourcemanager.scheduler.capacity.CapacityScheduler.reinitializeQueues(CapacityScheduler.java:340)
	at org.apache.hadoop.yarn.server.resourcemanager.scheduler.capacity.CapacityScheduler.reinitialize(CapacityScheduler.java:302)
	at org.apache.hadoop.yarn.server.resourcemanager.scheduler.capacity.TestCapacityScheduler.testRefreshQueuesWithNewQueue(TestCapacityScheduler.java:486)


FAILED:  org.apache.hadoop.yarn.server.resourcemanager.scheduler.capacity.TestCapacityScheduler.testAddAndRemoveAppFromCapacityScheduler

Error Message:
Failed to re-init queues

Stack Trace:
java.io.IOException: Failed to re-init queues
	at org.apache.hadoop.yarn.util.resource.Resources.greaterThan(Resources.java:225)
	at org.apache.hadoop.yarn.server.resourcemanager.scheduler.capacity.CSQueueUtils.updateQueueStatistics(CSQueueUtils.java:90)
	at org.apache.hadoop.yarn.server.resourcemanager.scheduler.capacity.ParentQueue.setupQueueConfigs(ParentQueue.java:188)
	at org.apache.hadoop.yarn.server.resourcemanager.scheduler.capacity.ParentQueue.<init>(ParentQueue.java:146)
	at org.apache.hadoop.yarn.server.resourcemanager.scheduler.capacity.CapacityScheduler.parseQueue(CapacityScheduler.java:411)
	at org.apache.hadoop.yarn.server.resourcemanager.scheduler.capacity.CapacityScheduler.reinitializeQueues(CapacityScheduler.java:340)
	at org.apache.hadoop.yarn.server.resourcemanager.scheduler.capacity.CapacityScheduler.reinitialize(CapacityScheduler.java:302)
	at org.apache.hadoop.yarn.server.resourcemanager.scheduler.capacity.TestCapacityScheduler.testAddAndRemoveAppFromCapacityScheduler(TestCapacityScheduler.java:638)


FAILED:  org.apache.hadoop.yarn.server.resourcemanager.scheduler.capacity.TestLeafQueue.testInitializeQueue

Error Message:
null

Stack Trace:
java.lang.NullPointerException: null
	at org.apache.hadoop.yarn.server.resourcemanager.scheduler.capacity.CapacityScheduler.getContainerTokenSecretManager(CapacityScheduler.java:217)
	at org.apache.hadoop.yarn.server.resourcemanager.scheduler.capacity.TestLeafQueue.setUp(TestLeafQueue.java:142)


FAILED:  org.apache.hadoop.yarn.server.resourcemanager.scheduler.capacity.TestLeafQueue.testSingleQueueOneUserMetrics

Error Message:
null

Stack Trace:
java.lang.NullPointerException: null
	at org.apache.hadoop.yarn.server.resourcemanager.scheduler.capacity.CapacityScheduler.getContainerTokenSecretManager(CapacityScheduler.java:217)
	at org.apache.hadoop.yarn.server.resourcemanager.scheduler.capacity.TestLeafQueue.setUp(TestLeafQueue.java:142)


FAILED:  org.apache.hadoop.yarn.server.resourcemanager.scheduler.capacity.TestLeafQueue.testUserQueueAcl

Error Message:
null

Stack Trace:
java.lang.NullPointerException: null
	at org.apache.hadoop.yarn.server.resourcemanager.scheduler.capacity.CapacityScheduler.getContainerTokenSecretManager(CapacityScheduler.java:217)
	at org.apache.hadoop.yarn.server.resourcemanager.scheduler.capacity.TestLeafQueue.setUp(TestLeafQueue.java:142)


FAILED:  org.apache.hadoop.yarn.server.resourcemanager.scheduler.capacity.TestLeafQueue.testAppAttemptMetrics

Error Message:
null

Stack Trace:
java.lang.NullPointerException: null
	at org.apache.hadoop.yarn.server.resourcemanager.scheduler.capacity.CapacityScheduler.getContainerTokenSecretManager(CapacityScheduler.java:217)
	at org.apache.hadoop.yarn.server.resourcemanager.scheduler.capacity.TestLeafQueue.setUp(TestLeafQueue.java:142)


FAILED:  org.apache.hadoop.yarn.server.resourcemanager.scheduler.capacity.TestLeafQueue.testSingleQueueWithOneUser

Error Message:
null

Stack Trace:
java.lang.NullPointerException: null
	at org.apache.hadoop.yarn.server.resourcemanager.scheduler.capacity.CapacityScheduler.getContainerTokenSecretManager(CapacityScheduler.java:217)
	at org.apache.hadoop.yarn.server.resourcemanager.scheduler.capacity.TestLeafQueue.setUp(TestLeafQueue.java:142)


FAILED:  org.apache.hadoop.yarn.server.resourcemanager.scheduler.capacity.TestLeafQueue.testUserLimits

Error Message:
null

Stack Trace:
java.lang.NullPointerException: null
	at org.apache.hadoop.yarn.server.resourcemanager.scheduler.capacity.CapacityScheduler.getContainerTokenSecretManager(CapacityScheduler.java:217)
	at org.apache.hadoop.yarn.server.resourcemanager.scheduler.capacity.TestLeafQueue.setUp(TestLeafQueue.java:142)


FAILED:  org.apache.hadoop.yarn.server.resourcemanager.scheduler.capacity.TestLeafQueue.testHeadroomWithMaxCap

Error Message:
null

Stack Trace:
java.lang.NullPointerException: null
	at org.apache.hadoop.yarn.server.resourcemanager.scheduler.capacity.CapacityScheduler.getContainerTokenSecretManager(CapacityScheduler.java:217)
	at org.apache.hadoop.yarn.server.resourcemanager.scheduler.capacity.TestLeafQueue.setUp(TestLeafQueue.java:142)


FAILED:  org.apache.hadoop.yarn.server.resourcemanager.scheduler.capacity.TestLeafQueue.testSingleQueueWithMultipleUsers

Error Message:
null

Stack Trace:
java.lang.NullPointerException: null
	at org.apache.hadoop.yarn.server.resourcemanager.scheduler.capacity.CapacityScheduler.getContainerTokenSecretManager(CapacityScheduler.java:217)
	at org.apache.hadoop.yarn.server.resourcemanager.scheduler.capacity.TestLeafQueue.setUp(TestLeafQueue.java:142)


FAILED:  org.apache.hadoop.yarn.server.resourcemanager.scheduler.capacity.TestLeafQueue.testReservation

Error Message:
null

Stack Trace:
java.lang.NullPointerException: null
	at org.apache.hadoop.yarn.server.resourcemanager.scheduler.capacity.CapacityScheduler.getContainerTokenSecretManager(CapacityScheduler.java:217)
	at org.apache.hadoop.yarn.server.resourcemanager.scheduler.capacity.TestLeafQueue.setUp(TestLeafQueue.java:142)


FAILED:  org.apache.hadoop.yarn.server.resourcemanager.scheduler.capacity.TestLeafQueue.testStolenReservedContainer

Error Message:
null

Stack Trace:
java.lang.NullPointerException: null
	at org.apache.hadoop.yarn.server.resourcemanager.scheduler.capacity.CapacityScheduler.getContainerTokenSecretManager(CapacityScheduler.java:217)
	at org.apache.hadoop.yarn.server.resourcemanager.scheduler.capacity.TestLeafQueue.setUp(TestLeafQueue.java:142)


FAILED:  org.apache.hadoop.yarn.server.resourcemanager.scheduler.capacity.TestLeafQueue.testReservationExchange

Error Message:
null

Stack Trace:
java.lang.NullPointerException: null
	at org.apache.hadoop.yarn.server.resourcemanager.scheduler.capacity.CapacityScheduler.getContainerTokenSecretManager(CapacityScheduler.java:217)
	at org.apache.hadoop.yarn.server.resourcemanager.scheduler.capacity.TestLeafQueue.setUp(TestLeafQueue.java:142)


FAILED:  org.apache.hadoop.yarn.server.resourcemanager.scheduler.capacity.TestLeafQueue.testLocalityScheduling

Error Message:
null

Stack Trace:
java.lang.NullPointerException: null
	at org.apache.hadoop.yarn.server.resourcemanager.scheduler.capacity.CapacityScheduler.getContainerTokenSecretManager(CapacityScheduler.java:217)
	at org.apache.hadoop.yarn.server.resourcemanager.scheduler.capacity.TestLeafQueue.setUp(TestLeafQueue.java:142)


FAILED:  org.apache.hadoop.yarn.server.resourcemanager.scheduler.capacity.TestLeafQueue.testApplicationPriorityScheduling

Error Message:
null

Stack Trace:
java.lang.NullPointerException: null
	at org.apache.hadoop.yarn.server.resourcemanager.scheduler.capacity.CapacityScheduler.getContainerTokenSecretManager(CapacityScheduler.java:217)
	at org.apache.hadoop.yarn.server.resourcemanager.scheduler.capacity.TestLeafQueue.setUp(TestLeafQueue.java:142)


FAILED:  org.apache.hadoop.yarn.server.resourcemanager.scheduler.capacity.TestLeafQueue.testSchedulingConstraints

Error Message:
null

Stack Trace:
java.lang.NullPointerException: null
	at org.apache.hadoop.yarn.server.resourcemanager.scheduler.capacity.CapacityScheduler.getContainerTokenSecretManager(CapacityScheduler.java:217)
	at org.apache.hadoop.yarn.server.resourcemanager.scheduler.capacity.TestLeafQueue.setUp(TestLeafQueue.java:142)


FAILED:  org.apache.hadoop.yarn.server.resourcemanager.scheduler.capacity.TestLeafQueue.testActivateApplicationAfterQueueRefresh

Error Message:
null

Stack Trace:
java.lang.NullPointerException: null
	at org.apache.hadoop.yarn.server.resourcemanager.scheduler.capacity.CapacityScheduler.getContainerTokenSecretManager(CapacityScheduler.java:217)
	at org.apache.hadoop.yarn.server.resourcemanager.scheduler.capacity.TestLeafQueue.setUp(TestLeafQueue.java:142)


FAILED:  org.apache.hadoop.yarn.server.resourcemanager.scheduler.capacity.TestLeafQueue.testNodeLocalityAfterQueueRefresh

Error Message:
null

Stack Trace:
java.lang.NullPointerException: null
	at org.apache.hadoop.yarn.server.resourcemanager.scheduler.capacity.CapacityScheduler.getContainerTokenSecretManager(CapacityScheduler.java:217)
	at org.apache.hadoop.yarn.server.resourcemanager.scheduler.capacity.TestLeafQueue.setUp(TestLeafQueue.java:142)


FAILED:  org.apache.hadoop.yarn.server.resourcemanager.scheduler.capacity.TestLeafQueue.testActivateApplicationByUpdatingClusterResource

Error Message:
null

Stack Trace:
java.lang.NullPointerException: null
	at org.apache.hadoop.yarn.server.resourcemanager.scheduler.capacity.CapacityScheduler.getContainerTokenSecretManager(CapacityScheduler.java:217)
	at org.apache.hadoop.yarn.server.resourcemanager.scheduler.capacity.TestLeafQueue.setUp(TestLeafQueue.java:142)


FAILED:  org.apache.hadoop.yarn.server.resourcemanager.scheduler.capacity.TestLeafQueue.testInheritedQueueAcls

Error Message:
null

Stack Trace:
java.lang.NullPointerException: null
	at org.apache.hadoop.yarn.server.resourcemanager.scheduler.capacity.CapacityScheduler.getContainerTokenSecretManager(CapacityScheduler.java:217)
	at org.apache.hadoop.yarn.server.resourcemanager.scheduler.capacity.TestLeafQueue.setUp(TestLeafQueue.java:142)


FAILED:  org.apache.hadoop.yarn.server.resourcemanager.scheduler.capacity.TestLeafQueue.testLocalityConstraints

Error Message:
null

Stack Trace:
java.lang.NullPointerException: null
	at org.apache.hadoop.yarn.server.resourcemanager.scheduler.capacity.CapacityScheduler.getContainerTokenSecretManager(CapacityScheduler.java:217)
	at org.apache.hadoop.yarn.server.resourcemanager.scheduler.capacity.TestLeafQueue.setUp(TestLeafQueue.java:142)


FAILED:  org.apache.hadoop.yarn.server.resourcemanager.scheduler.capacity.TestLeafQueue.testMaxAMResourcePerQueuePercentAfterQueueRefresh

Error Message:
null

Stack Trace:
java.lang.NullPointerException: null
	at org.apache.hadoop.yarn.server.resourcemanager.scheduler.capacity.CapacityScheduler.getContainerTokenSecretManager(CapacityScheduler.java:217)
	at org.apache.hadoop.yarn.server.resourcemanager.scheduler.capacity.TestLeafQueue.setUp(TestLeafQueue.java:142)



Failed: YARN-1474 PreCommit Build #2894

Posted by Apache Jenkins Server <je...@builds.apache.org>.
Jira: https://issues.apache.org/jira/browse/YARN-1474
Build: https://builds.apache.org/job/PreCommit-YARN-Build/2894/

###################################################################################
########################## LAST 60 LINES OF THE CONSOLE ###########################
[...truncated 86 lines...]
patching file hadoop-yarn-project/hadoop-yarn/hadoop-yarn-server/hadoop-yarn-server-resourcemanager/src/test/java/org/apache/hadoop/yarn/server/resourcemanager/scheduler/capacity/TestQueueParsing.java
patching file hadoop-yarn-project/hadoop-yarn/hadoop-yarn-server/hadoop-yarn-server-resourcemanager/src/test/java/org/apache/hadoop/yarn/server/resourcemanager/scheduler/fair/TestFSLeafQueue.java
patching file hadoop-yarn-project/hadoop-yarn/hadoop-yarn-server/hadoop-yarn-server-resourcemanager/src/test/java/org/apache/hadoop/yarn/server/resourcemanager/scheduler/fair/TestFairScheduler.java
patching file hadoop-yarn-project/hadoop-yarn/hadoop-yarn-server/hadoop-yarn-server-resourcemanager/src/test/java/org/apache/hadoop/yarn/server/resourcemanager/scheduler/fair/TestFairSchedulerEventLog.java
patching file hadoop-yarn-project/hadoop-yarn/hadoop-yarn-server/hadoop-yarn-server-resourcemanager/src/test/java/org/apache/hadoop/yarn/server/resourcemanager/scheduler/fifo/TestFifoScheduler.java
patching file hadoop-yarn-project/hadoop-yarn/hadoop-yarn-server/hadoop-yarn-server-resourcemanager/src/test/java/org/apache/hadoop/yarn/server/resourcemanager/webapp/TestRMWebApp.java


======================================================================
======================================================================
    Determining number of patched javac warnings.
======================================================================
======================================================================


/home/jenkins/tools/maven/latest/bin/mvn clean test -DskipTests -DHadoopPatchProcess -Pnative -Ptest-patch > /home/jenkins/jenkins-slave/workspace/PreCommit-YARN-Build/patchprocess/patchJavacWarnings.txt 2>&1




{color:red}-1 overall{color}.  Here are the results of testing the latest attachment 
  http://issues.apache.org/jira/secure/attachment/12623327/YARN-1474.2.patch
  against trunk revision .

    {color:green}+1 @author{color}.  The patch does not contain any @author tags.

    {color:green}+1 tests included{color}.  The patch appears to include 10 new or modified test files.

    {color:red}-1 javac{color:red}.  The patch appears to cause the build to fail.

Console output: https://builds.apache.org/job/PreCommit-YARN-Build/2894//console

This message is automatically generated.


======================================================================
======================================================================
    Adding comment to Jira.
======================================================================
======================================================================


Comment added.
26b694b3b36a76f19d8aa5305a6475a6196b6c5d logged out


======================================================================
======================================================================
    Finished build.
======================================================================
======================================================================


Build step 'Execute shell' marked build as failure
Archiving artifacts
[description-setter] Could not determine description.
Recording test results
Email was triggered for: Failure
Sending email for trigger: Failure



###################################################################################
############################## FAILED TESTS (if any) ##############################
No tests ran.

Failed: YARN-1608 PreCommit Build #2893

Posted by Apache Jenkins Server <je...@builds.apache.org>.
Jira: https://issues.apache.org/jira/browse/YARN-1608
Build: https://builds.apache.org/job/PreCommit-YARN-Build/2893/

###################################################################################
########################## LAST 60 LINES OF THE CONSOLE ###########################
[...truncated 3034 lines...]
NOP




{color:red}-1 overall{color}.  Here are the results of testing the latest attachment 
  http://issues.apache.org/jira/secure/attachment/12623287/yarn-1608-1.patch
  against trunk revision .

    {color:green}+1 @author{color}.  The patch does not contain any @author tags.

    {color:red}-1 tests included{color}.  The patch doesn't appear to include any new or modified tests.
                        Please justify why no new tests are needed for this patch.
                        Also please list what manual steps were performed to verify this patch.

    {color:green}+1 javac{color}.  The applied patch does not increase the total number of javac compiler warnings.

    {color:green}+1 javadoc{color}.  The javadoc tool did not generate any warning messages.

    {color:green}+1 eclipse:eclipse{color}.  The patch built with eclipse:eclipse.

    {color:green}+1 findbugs{color}.  The patch does not introduce any new Findbugs (version 1.3.9) warnings.

    {color:green}+1 release audit{color}.  The applied patch does not increase the total number of release audit warnings.

    {color:green}+1 core tests{color}.  The patch passed unit tests in hadoop-yarn-project/hadoop-yarn/hadoop-yarn-server/hadoop-yarn-server-nodemanager.

    {color:green}+1 contrib tests{color}.  The patch passed contrib unit tests.

Test results: https://builds.apache.org/job/PreCommit-YARN-Build/2893//testReport/
Console output: https://builds.apache.org/job/PreCommit-YARN-Build/2893//console

This message is automatically generated.


======================================================================
======================================================================
    Adding comment to Jira.
======================================================================
======================================================================


Comment added.
5e977ae685809408c4971383c87c48e832131052 logged out


======================================================================
======================================================================
    Finished build.
======================================================================
======================================================================


Build step 'Execute shell' marked build as failure
Archiving artifacts
[description-setter] Could not determine description.
Recording test results
Email was triggered for: Failure
Sending email for trigger: Failure



###################################################################################
############################## FAILED TESTS (if any) ##############################
All tests passed

Failed: YARN-1606 PreCommit Build #2892

Posted by Apache Jenkins Server <je...@builds.apache.org>.
Jira: https://issues.apache.org/jira/browse/YARN-1606
Build: https://builds.apache.org/job/PreCommit-YARN-Build/2892/

###################################################################################
########################## LAST 60 LINES OF THE CONSOLE ###########################
[...truncated 2951 lines...]



{color:red}-1 overall{color}.  Here are the results of testing the latest attachment 
  http://issues.apache.org/jira/secure/attachment/12623244/yarn-1606-1.patch
  against trunk revision .

    {color:green}+1 @author{color}.  The patch does not contain any @author tags.

    {color:red}-1 tests included{color}.  The patch doesn't appear to include any new or modified tests.
                        Please justify why no new tests are needed for this patch.
                        Also please list what manual steps were performed to verify this patch.

    {color:green}+1 javac{color}.  The applied patch does not increase the total number of javac compiler warnings.

    {color:green}+1 javadoc{color}.  The javadoc tool did not generate any warning messages.

    {color:green}+1 eclipse:eclipse{color}.  The patch built with eclipse:eclipse.

    {color:green}+1 findbugs{color}.  The patch does not introduce any new Findbugs (version 1.3.9) warnings.

    {color:green}+1 release audit{color}.  The applied patch does not increase the total number of release audit warnings.

    {color:green}+1 core tests{color}.  The patch passed unit tests in hadoop-yarn-project/hadoop-yarn/hadoop-yarn-common.

    {color:green}+1 contrib tests{color}.  The patch passed contrib unit tests.

Test results: https://builds.apache.org/job/PreCommit-YARN-Build/2892//testReport/
Console output: https://builds.apache.org/job/PreCommit-YARN-Build/2892//console

This message is automatically generated.


======================================================================
======================================================================
    Adding comment to Jira.
======================================================================
======================================================================


Comment added.
14676a3f566728fa2e052ad4ca6359e36e320e5f logged out


======================================================================
======================================================================
    Finished build.
======================================================================
======================================================================


Build step 'Execute shell' marked build as failure
Archiving artifacts
[description-setter] Could not determine description.
Recording test results
Publish JUnit test result report is waiting for a checkpoint on PreCommit-YARN-Build #2891
Editable Email Notification is waiting for a checkpoint on PreCommit-YARN-Build #2891
Email was triggered for: Failure
Sending email for trigger: Failure



###################################################################################
############################## FAILED TESTS (if any) ##############################
All tests passed