You are viewing a plain text version of this content. The canonical link for it is here.
Posted to dev@atlas.apache.org by "Nigel Jones (JIRA)" <ji...@apache.org> on 2016/04/05 12:46:25 UTC

[jira] [Created] (ATLAS-637) Build fails (jenkins, local)

Nigel Jones created ATLAS-637:
---------------------------------

             Summary: Build fails (jenkins, local)
                 Key: ATLAS-637
                 URL: https://issues.apache.org/jira/browse/ATLAS-637
             Project: Atlas
          Issue Type: Bug
    Affects Versions: trunk
            Reporter: Nigel Jones


I am seeing the Atlas build fail when building the Web UI on 2 local (linux) systems of mine. Whilst about to debug I noticed that Apache jenkins is also reporting a build failure on the mailing list as reported at 

news://news.gmane.org:119/579606293.2657.1459820983173.JavaMail.jenkins@crius

The jenkins report seems very similar to mine, so I paste that below, and will add further info from my local install attempt:



See <https://builds.apache.org/job/apache-atlas-nightly/232/changes>

Changes:

[sumasai.shivaprasad] ATLAS-571 Modify Atlas client for necessary changes in context of HA

[sumasai.shivaprasad] ATLAS-607 Add Support for delete entity through a qualifiedName (sumasai

------------------------------------------
[...truncated 5060 lines...]
[ERROR] npm http 200 https://registry.npmjs.org/serve-static
[ERROR] npm http 200 https://registry.npmjs.org/merge-descriptors/-/merge-descriptors-1.0.0.tgz
[ERROR] npm http 200 https://registry.npmjs.org/finalhandler/0.3.6
[ERROR] npm http 304 https://registry.npmjs.org/escape-html/1.0.1
[ERROR] npm http 304 https://registry.npmjs.org/etag
[ERROR] npm http 200 https://registry.npmjs.org/content-disposition/0.5.0
[ERROR] npm http GET https://registry.npmjs.org/ansi-regex
[ERROR] npm http GET https://registry.npmjs.org/ansi-regex
[ERROR] npm http GET https://registry.npmjs.org/get-stdin
[ERROR] npm http 304 https://registry.npmjs.org/on-finished
[ERROR] npm http GET https://registry.npmjs.org/finalhandler/-/finalhandler-0.3.6.tgz
[ERROR] npm http GET https://registry.npmjs.org/serve-static/-/serve-static-1.9.3.tgz
[ERROR] npm http GET https://registry.npmjs.org/content-disposition/-/content-disposition-0.5.0.tgz
[ERROR] npm http 304 https://registry.npmjs.org/parseurl
[ERROR] npm http GET https://registry.npmjs.org/etag/-/etag-1.6.0.tgz
[ERROR] npm http 200 https://registry.npmjs.org/qs/-/qs-2.4.2.tgz
[ERROR] npm http 304 https://registry.npmjs.org/type-is
[ERROR] npm http 304 https://registry.npmjs.org/vary
[ERROR] npm http GET https://registry.npmjs.org/on-finished/-/on-finished-2.2.1.tgz
[ERROR] npm http 200 https://registry.npmjs.org/send/0.12.3
[ERROR] npm http 304 https://registry.npmjs.org/utils-merge/1.0.0
[ERROR] npm http 200 https://registry.npmjs.org/path-to-regexp/-/path-to-regexp-0.1.3.tgz
[ERROR] npm http 304 https://registry.npmjs.org/accepts
[ERROR] npm http 200 https://registry.npmjs.org/depd/-/depd-1.0.1.tgz
[ERROR] npm http GET https://registry.npmjs.org/send/-/send-0.12.3.tgz
[ERROR] npm http 200 https://registry.npmjs.org/content-disposition/-/content-disposition-0.5.0.tgz
[ERROR] npm http 304 https://registry.npmjs.org/ansi-regex
[ERROR] npm http 304 https://registry.npmjs.org/ansi-regex
[ERROR] npm http 304 https://registry.npmjs.org/get-stdin
[ERROR] npm http 200 https://registry.npmjs.org/etag/-/etag-1.6.0.tgz
[ERROR] npm http 200 https://registry.npmjs.org/on-finished/-/on-finished-2.2.1.tgz
[ERROR] npm http 200 https://registry.npmjs.org/send/-/send-0.12.3.tgz
[ERROR] npm http 200 https://registry.npmjs.org/finalhandler/-/finalhandler-0.3.6.tgz
[ERROR] npm http 200 https://registry.npmjs.org/serve-static/-/serve-static-1.9.3.tgz
[ERROR] npm http GET https://registry.npmjs.org/crc32-stream
[ERROR] npm http GET https://registry.npmjs.org/node-int64
[ERROR] npm http 200 https://registry.npmjs.org/node-int64
[ERROR] npm http 200 https://registry.npmjs.org/crc32-stream
[ERROR] npm http GET https://registry.npmjs.org/node-int64/-/node-int64-0.3.3.tgz
[ERROR] npm http GET https://registry.npmjs.org/crc32-stream/-/crc32-stream-0.3.4.tgz
[ERROR] npm http 200 https://registry.npmjs.org/crc32-stream/-/crc32-stream-0.3.4.tgz
[ERROR] npm http 200 https://registry.npmjs.org/node-int64/-/node-int64-0.3.3.tgz
[ERROR] npm http GET https://registry.npmjs.org/crc/3.2.1
[ERROR] npm http GET https://registry.npmjs.org/ee-first/1.1.0
[ERROR] npm http GET https://registry.npmjs.org/forwarded
[ERROR] npm http GET https://registry.npmjs.org/ipaddr.js/1.0.5
[ERROR] npm http GET https://registry.npmjs.org/negotiator/0.5.3
[ERROR] npm http GET https://registry.npmjs.org/media-typer/0.3.0
[ERROR] npm http GET https://registry.npmjs.org/mime-types
[ERROR] npm http GET https://registry.npmjs.org/mime-types
[ERROR] npm http GET https://registry.npmjs.org/destroy/1.0.3
[ERROR] npm http GET https://registry.npmjs.org/mime/1.3.4
[ERROR] npm http GET https://registry.npmjs.org/ms/0.7.1
[ERROR] npm http 200 https://registry.npmjs.org/ipaddr.js/1.0.5
[ERROR] npm http GET https://registry.npmjs.org/ipaddr.js/-/ipaddr.js-1.0.5.tgz
[ERROR] npm http 200 https://registry.npmjs.org/forwarded
[ERROR] npm http 200 https://registry.npmjs.org/negotiator/0.5.3
[ERROR] npm http 200 https://registry.npmjs.org/media-typer/0.3.0
[ERROR] npm http GET https://registry.npmjs.org/negotiator/-/negotiator-0.5.3.tgz
[ERROR] npm http GET https://registry.npmjs.org/media-typer/-/media-typer-0.3.0.tgz
[ERROR] npm http 304 https://registry.npmjs.org/mime-types
[ERROR] npm http 304 https://registry.npmjs.org/mime-types
[ERROR] npm http 200 https://registry.npmjs.org/crc/3.2.1
[ERROR] npm http GET https://registry.npmjs.org/crc/-/crc-3.2.1.tgz
[ERROR] npm http 304 https://registry.npmjs.org/ms/0.7.1
[ERROR] npm http 200 https://registry.npmjs.org/ee-first/1.1.0
[ERROR] npm http 200 https://registry.npmjs.org/ipaddr.js/-/ipaddr.js-1.0.5.tgz
[ERROR] npm http GET https://registry.npmjs.org/ee-first/-/ee-first-1.1.0.tgz
[ERROR] npm http 200 https://registry.npmjs.org/media-typer/-/media-typer-0.3.0.tgz
[ERROR] npm http 200 https://registry.npmjs.org/negotiator/-/negotiator-0.5.3.tgz
[ERROR] npm http 200 https://registry.npmjs.org/destroy/1.0.3
[ERROR] npm http GET https://registry.npmjs.org/destroy/-/destroy-1.0.3.tgz
[ERROR] npm http 200 https://registry.npmjs.org/mime/1.3.4
[ERROR] npm http 200 https://registry.npmjs.org/crc/-/crc-3.2.1.tgz
[ERROR] npm http GET https://registry.npmjs.org/mime/-/mime-1.3.4.tgz
[ERROR] npm http 200 https://registry.npmjs.org/ee-first/-/ee-first-1.1.0.tgz
[ERROR] npm http 200 https://registry.npmjs.org/destroy/-/destroy-1.0.3.tgz
[ERROR] npm http 200 https://registry.npmjs.org/mime/-/mime-1.3.4.tgz
[ERROR] npm http GET https://registry.npmjs.org/mime-db
[ERROR] npm http 304 https://registry.npmjs.org/mime-db
[ERROR] npm http GET https://registry.npmjs.org/htmlparser2
[ERROR] npm http GET https://registry.npmjs.org/exit
[ERROR] npm http GET https://registry.npmjs.org/minimatch
[ERROR] npm http GET https://registry.npmjs.org/strip-json-comments
[ERROR] npm http GET https://registry.npmjs.org/lodash
[ERROR] npm http GET https://registry.npmjs.org/cli
[ERROR] npm http GET https://registry.npmjs.org/console-browserify
[ERROR] npm http GET https://registry.npmjs.org/shelljs
[ERROR] npm http 304 https://registry.npmjs.org/exit
[ERROR] npm http 304 https://registry.npmjs.org/minimatch
[ERROR] npm http 304 https://registry.npmjs.org/strip-json-comments
[ERROR] npm http 304 https://registry.npmjs.org/cli
[ERROR] npm http 304 https://registry.npmjs.org/console-browserify
[ERROR] npm http 200 https://registry.npmjs.org/lodash
[ERROR] npm ERR! registry error parsing json
[ERROR] npm http 200 https://registry.npmjs.org/htmlparser2
[ERROR] npm http 304 https://registry.npmjs.org/shelljs
[ERROR] npm http GET https://registry.npmjs.org/date-now
[ERROR] npm http GET https://registry.npmjs.org/brace-expansion
[ERROR] npm http GET https://registry.npmjs.org/glob
[ERROR] npm http 200 https://registry.npmjs.org/date-now
[ERROR] npm http 304 https://registry.npmjs.org/brace-expansion
[ERROR] npm http 304 https://registry.npmjs.org/glob
[ERROR] npm http GET https://registry.npmjs.org/balanced-match
[ERROR] npm http GET https://registry.npmjs.org/concat-map/0.0.1
[ERROR] npm http GET https://registry.npmjs.org/entities
[ERROR] npm http GET https://registry.npmjs.org/domhandler
[ERROR] npm http GET https://registry.npmjs.org/domutils
[ERROR] npm http GET https://registry.npmjs.org/domelementtype
[ERROR] npm http GET https://registry.npmjs.org/readable-stream
[ERROR] npm http GET https://registry.npmjs.org/inherits
[ERROR] npm http 304 https://registry.npmjs.org/balanced-match
[ERROR] npm http 304 https://registry.npmjs.org/concat-map/0.0.1
[ERROR] npm http 200 https://registry.npmjs.org/domelementtype
[ERROR] npm http 304 https://registry.npmjs.org/readable-stream
[ERROR] npm http 304 https://registry.npmjs.org/inherits
[ERROR] npm http 200 https://registry.npmjs.org/entities
[ERROR] npm http 200 https://registry.npmjs.org/domhandler
[ERROR] npm http 200 https://registry.npmjs.org/domutils
[ERROR] npm http GET https://registry.npmjs.org/lru-cache
[ERROR] npm http GET https://registry.npmjs.org/sigmund
[ERROR] npm http GET https://registry.npmjs.org/dom-serializer
[ERROR] npm http 304 https://registry.npmjs.org/sigmund
[ERROR] npm http 304 https://registry.npmjs.org/lru-cache
[ERROR] npm http GET https://registry.npmjs.org/string_decoder
[ERROR] npm http GET https://registry.npmjs.org/core-util-is
[ERROR] npm http GET https://registry.npmjs.org/isarray/0.0.1
[ERROR] npm http 200 https://registry.npmjs.org/dom-serializer
[ERROR] npm ERR! registry error parsing json
[ERROR] npm ERR! Error: ENOENT, lstat '<https://builds.apache.org/job/apache-atlas-nightly/ws/dashboard/target/node_modules/grunt-contrib-jshint/node_modules/jshint/node_modules/lodash/array/lastIndexOf.js'>
[ERROR] npm ERR! If you need help, you may report this *entire* log,
[ERROR] npm ERR! including the npm and node versions, at:
[ERROR] npm ERR!     <http://github.com/npm/npm/issues>
[ERROR] 
[ERROR] npm ERR! System Linux 3.13.0-36-lowlatency
[ERROR] npm ERR! command "<https://builds.apache.org/job/apache-atlas-nightly/ws/dashboard/target/node/node"> "<https://builds.apache.org/job/apache-atlas-nightly/ws/dashboard/target/node/npm/bin/npm-cli.js"> "install" "--color=false"
[ERROR] npm ERR! cwd <https://builds.apache.org/job/apache-atlas-nightly/ws/dashboard/target>
[ERROR] npm ERR! node -v v0.10.30
[ERROR] npm ERR! npm -v 1.4.3
[ERROR] npm ERR! path <https://builds.apache.org/job/apache-atlas-nightly/ws/dashboard/target/node_modules/grunt-contrib-jshint/node_modules/jshint/node_modules/lodash/array/lastIndexOf.js>
[ERROR] npm ERR! fstream_path <https://builds.apache.org/job/apache-atlas-nightly/ws/dashboard/target/node_modules/grunt-contrib-jshint/node_modules/jshint/node_modules/lodash/array/lastIndexOf.js>
[ERROR] npm ERR! fstream_type File
[ERROR] npm ERR! fstream_class FileWriter
[ERROR] npm ERR! code ENOENT
[ERROR] npm ERR! errno 34
[ERROR] npm ERR! fstream_stack <https://builds.apache.org/job/apache-atlas-nightly/ws/dashboard/target/node/npm/node_modules/fstream/lib/writer.js>:284:26
[ERROR] npm ERR! fstream_stack Object.oncomplete (fs.js:107:15)
[ERROR] npm http 304 https://registry.npmjs.org/string_decoder
[ERROR] npm http 304 https://registry.npmjs.org/isarray/0.0.1
[ERROR] npm http 304 https://registry.npmjs.org/core-util-is
[ERROR] npm ERR! 
[ERROR] npm ERR! Additional logging details can be found in:
[ERROR] npm ERR!     <https://builds.apache.org/job/apache-atlas-nightly/ws/dashboard/target/npm-debug.log>
[ERROR] npm ERR! not ok code 0
[INFO] ------------------------------------------------------------------------
[INFO] Reactor Summary:
[INFO] 
[INFO] apache-atlas ...................................... SUCCESS [ 20.287 s]
[INFO] Apache Atlas Common ............................... SUCCESS [ 35.536 s]
[INFO] Apache Atlas Typesystem ........................... SUCCESS [02:32 min]
[INFO] Apache Atlas Client ............................... SUCCESS [ 38.815 s]
[INFO] Apache Atlas Server API ........................... SUCCESS [ 18.560 s]
[INFO] Apache Atlas Notification ......................... SUCCESS [ 54.178 s]
[INFO] Apache Atlas Titan ................................ SUCCESS [ 52.194 s]
[INFO] Apache Atlas Repository ........................... SUCCESS [12:45 min]
[INFO] Apache Atlas UI ................................... FAILURE [01:15 min]
[INFO] Apache Atlas Web Application ...................... SKIPPED
[INFO] Apache Atlas Documentation ........................ SKIPPED
[INFO] Apache Atlas FileSystem Model ..................... SKIPPED
[INFO] Apache Atlas Hive Bridge .......................... SKIPPED
[INFO] Apache Atlas Falcon Bridge ........................ SKIPPED
[INFO] Apache Atlas Sqoop Bridge ......................... SKIPPED
[INFO] Apache Atlas Storm Bridge ......................... SKIPPED
[INFO] Apache Atlas Distribution ......................... SKIPPED
[INFO] ------------------------------------------------------------------------
[INFO] BUILD FAILURE
[INFO] ------------------------------------------------------------------------
[INFO] Total time: 20:16 min
[INFO] Finished at: 2016-04-05T01:48:39+00:00
[INFO] Final Memory: 123M/1446M
[INFO] ------------------------------------------------------------------------
[ERROR] Failed to execute goal com.github.eirslett:frontend-maven-plugin:0.0.23:npm (npm install) on project atlas-dashboard: Failed to run task: 'npm install --color=false' failed. (error code 1) -> [Help 1]
[ERROR] 
[ERROR] To see the full stack trace of the errors, re-run Maven with the -e switch.
[ERROR] Re-run Maven using the -X switch to enable full debug logging.
[ERROR] 
[ERROR] For more information about the errors and possible solutions, please read the following articles:
[ERROR] [Help 1] http://cwiki.apache.org/confluence/display/MAVEN/MojoFailureException
[ERROR] 
[ERROR] After correcting the problems, you can resume the build with the command
[ERROR]   mvn <goals> -rf :atlas-dashboard
Build step 'Execute shell' marked build as failure
[CHECKSTYLE] Collecting checkstyle analysis files...
[CHECKSTYLE] Finding all files that match the pattern **/target/checkstyle-result.xml
[CHECKSTYLE] Parsing 16 files in <https://builds.apache.org/job/apache-atlas-nightly/ws/>
[CHECKSTYLE] Successfully parsed file <https://builds.apache.org/job/apache-atlas-nightly/ws/addons/falcon-bridge/target/checkstyle-result.xml> with 52 unique warnings and 0 duplicates.
[CHECKSTYLE] Successfully parsed file <https://builds.apache.org/job/apache-atlas-nightly/ws/addons/hdfs-model/target/checkstyle-result.xml> with 69 unique warnings and 0 duplicates.
[CHECKSTYLE] Successfully parsed file <https://builds.apache.org/job/apache-atlas-nightly/ws/addons/hive-bridge/target/checkstyle-result.xml> with 235 unique warnings and 0 duplicates.
[CHECKSTYLE] Successfully parsed file <https://builds.apache.org/job/apache-atlas-nightly/ws/addons/sqoop-bridge/target/checkstyle-result.xml> with 251 unique warnings and 0 duplicates.
[CHECKSTYLE] Successfully parsed file <https://builds.apache.org/job/apache-atlas-nightly/ws/addons/storm-bridge/target/checkstyle-result.xml> with 327 unique warnings and 0 duplicates.
[CHECKSTYLE] Successfully parsed file <https://builds.apache.org/job/apache-atlas-nightly/ws/client/target/checkstyle-result.xml> with 392 unique warnings and 0 duplicates.
[CHECKSTYLE] Successfully parsed file <https://builds.apache.org/job/apache-atlas-nightly/ws/common/target/checkstyle-result.xml> with 392 unique warnings and 0 duplicates.
[CHECKSTYLE] Successfully parsed file <https://builds.apache.org/job/apache-atlas-nightly/ws/distro/target/checkstyle-result.xml> with 392 unique warnings and 0 duplicates.
[CHECKSTYLE] Successfully parsed file <https://builds.apache.org/job/apache-atlas-nightly/ws/docs/target/checkstyle-result.xml> with 392 unique warnings and 0 duplicates.
[CHECKSTYLE] Successfully parsed file <https://builds.apache.org/job/apache-atlas-nightly/ws/notification/target/checkstyle-result.xml> with 392 unique warnings and 0 duplicates.
[CHECKSTYLE] Successfully parsed file <https://builds.apache.org/job/apache-atlas-nightly/ws/repository/target/checkstyle-result.xml> with 1099 unique warnings and 0 duplicates.
[CHECKSTYLE] Successfully parsed file <https://builds.apache.org/job/apache-atlas-nightly/ws/server-api/target/checkstyle-result.xml> with 1122 unique warnings and 0 duplicates.
[CHECKSTYLE] Successfully parsed file <https://builds.apache.org/job/apache-atlas-nightly/ws/target/checkstyle-result.xml> with 1122 unique warnings and 0 duplicates.
[CHECKSTYLE] Successfully parsed file <https://builds.apache.org/job/apache-atlas-nightly/ws/titan/target/checkstyle-result.xml> with 1482 unique warnings and 0 duplicates.
[CHECKSTYLE] Successfully parsed file <https://builds.apache.org/job/apache-atlas-nightly/ws/typesystem/target/checkstyle-result.xml> with 2145 unique warnings and 0 duplicates.
[CHECKSTYLE] Successfully parsed file <https://builds.apache.org/job/apache-atlas-nightly/ws/webapp/target/checkstyle-result.xml> with 2386 unique warnings and 0 duplicates.
[CHECKSTYLE] Computing warning deltas based on reference build #231
[FINDBUGS] Collecting findbugs analysis files...
[FINDBUGS] Finding all files that match the pattern **/target/findbugs.xml
[FINDBUGS] Parsing 13 files in <https://builds.apache.org/job/apache-atlas-nightly/ws/>
[FINDBUGS] Successfully parsed file <https://builds.apache.org/job/apache-atlas-nightly/ws/addons/falcon-bridge/target/findbugs.xml> with 0 unique warnings and 0 duplicates.
[FINDBUGS] Successfully parsed file <https://builds.apache.org/job/apache-atlas-nightly/ws/addons/hdfs-model/target/findbugs.xml> with 0 unique warnings and 0 duplicates.
[FINDBUGS] Successfully parsed file <https://builds.apache.org/job/apache-atlas-nightly/ws/addons/hive-bridge/target/findbugs.xml> with 0 unique warnings and 0 duplicates.
[FINDBUGS] Successfully parsed file <https://builds.apache.org/job/apache-atlas-nightly/ws/addons/sqoop-bridge/target/findbugs.xml> with 0 unique warnings and 0 duplicates.
[FINDBUGS] Successfully parsed file <https://builds.apache.org/job/apache-atlas-nightly/ws/addons/storm-bridge/target/findbugs.xml> with 0 unique warnings and 0 duplicates.
[FINDBUGS] Successfully parsed file <https://builds.apache.org/job/apache-atlas-nightly/ws/client/target/findbugs.xml> with 0 unique warnings and 0 duplicates.
[FINDBUGS] Successfully parsed file <https://builds.apache.org/job/apache-atlas-nightly/ws/common/target/findbugs.xml> with 0 unique warnings and 0 duplicates.
[FINDBUGS] Successfully parsed file <https://builds.apache.org/job/apache-atlas-nightly/ws/notification/target/findbugs.xml> with 0 unique warnings and 0 duplicates.
[FINDBUGS] Successfully parsed file <https://builds.apache.org/job/apache-atlas-nightly/ws/repository/target/findbugs.xml> with 0 unique warnings and 0 duplicates.
[FINDBUGS] Successfully parsed file <https://builds.apache.org/job/apache-atlas-nightly/ws/server-api/target/findbugs.xml> with 0 unique warnings and 0 duplicates.
[FINDBUGS] Successfully parsed file <https://builds.apache.org/job/apache-atlas-nightly/ws/titan/target/findbugs.xml> with 0 unique warnings and 0 duplicates.
[FINDBUGS] Successfully parsed file <https://builds.apache.org/job/apache-atlas-nightly/ws/typesystem/target/findbugs.xml> with 0 unique warnings and 0 duplicates.
[FINDBUGS] Successfully parsed file <https://builds.apache.org/job/apache-atlas-nightly/ws/webapp/target/findbugs.xml> with 0 unique warnings and 0 duplicates.
[FINDBUGS] Computing warning deltas based on reference build #231
Archiving artifacts
Compressed 499.73 MB of artifacts by 82.6% relative to #231
TestNG Reports Processing: START
Looking for TestNG results report in workspace using pattern: **/target/surefire-reports/testng-results.xml,**/target/failsafe-reports/testng-results.xml
testng-results.xml was last modified before this build started. Ignoring it.
testng-results.xml was last modified before this build started. Ignoring it.
testng-results.xml was last modified before this build started. Ignoring it.
testng-results.xml was last modified before this build started. Ignoring it.
testng-results.xml was last modified before this build started. Ignoring it.
testng-results.xml was last modified before this build started. Ignoring it.
testng-results.xml was last modified before this build started. Ignoring it.
testng-results.xml was last modified before this build started. Ignoring it.
Saving reports...
Processing '/x1/jenkins/jenkins-home/jobs/apache-atlas-nightly/builds/232/testng/testng-results-1.xml'
Processing '/x1/jenkins/jenkins-home/jobs/apache-atlas-nightly/builds/232/testng/testng-results-2.xml'
Processing '/x1/jenkins/jenkins-home/jobs/apache-atlas-nightly/builds/232/testng/testng-results-3.xml'
Processing '/x1/jenkins/jenkins-home/jobs/apache-atlas-nightly/builds/232/testng/testng-results-4.xml'
Processing '/x1/jenkins/jenkins-home/jobs/apache-atlas-nightly/builds/232/testng/testng-results-5.xml'
Processing '/x1/jenkins/jenkins-home/jobs/apache-atlas-nightly/builds/232/testng/testng-results.xml'
TestNG Reports Processing: FINISH





--
This message was sent by Atlassian JIRA
(v6.3.4#6332)